{"text_format":"1","workbook":"xlsx","n_sheets":2,"sheets":["District","LEA"],"not_rendered":{"charts":0,"images":0,"macros":1,"external_links":0,"defined_names":6,"comments":0,"pivot_tables":0},"unopened":[],"bounds":{"document_bytes":16777216,"sheet_cells":100000,"rows_first":2000,"rows_last":500,"rows_between":2000,"halvings":0,"cell_chars":16384,"cell_head_chars":4096},"cells_cut":0,"cells_raw":0,"read":"whole","date_system":"1900"}

{"sheet":"District","index":0,"n_rows":4534,"n_cols":12,"rows_kept":4534,"cut":false,"hidden":false,"merged":[[2,0,2,11],[3,0,3,11],[5,4,5,8]]}
["2018-09-12",null,null,null,null,null,null,null,"Color key updates:","Includes FY18 revenues claimed in June and received after 06/30/2018"]
[null,null,null,null,null,null,null,null,null,"Federal Emergency Aid for Displaced Students"]
["Massachusetts Department of Elementary and Secondary Education"]
["FY18 Grants Reported on End of Year Financial Report"]
[1]
[1,null,null,null,{"$f":"VLOOKUP(A7,LEA!C2:D557,2,FALSE)","v":"Abington"}]
[{"$f":"VLOOKUP(A6,LEA!B2:E557,2,FALSE)","v":1}]
[]
["LEA","District","Type","Appr. No.","Project No.","Grant Name","Regular Day","Special Education","Occupational Day","Undistributed","Adult Education (not included in EOY Report)","July/August FY17 drawdown excluded from FY18 EOYR"]
[1,"Abington","FED","7043-1001","305-147771-2018-0001","Title I Distribution",222822,0,0,0,0,0]
[1,"Abington","FED","7043-2001","140-147769-2018-0001","Teacher Quality",0,0,0,54572,0,0]
[1,"Abington","FED","7043-4004","309-149426-2018-0001","Student Support and Academic Enrichment Grant",0,0,0,4989,0,0]
[1,"Abington","FED","7043-7001","240-149427-2018-0001","Sped 94-142 Allocation",0,504600,0,0,0,0]
[1,"Abington","FED","7043-7001","274-202034-2018-0001","Sped Program Improvement",0,7137,0,0,0,0]
[1,"Abington","STATE","7010-0005","192-203427-2018-0001","Special Distr. Support",0,0,0,25000,0,0]
[1,"Abington","District Total",null,null,null,{"$f":"SUBTOTAL(9,G10:G15)","v":222822},511737,0,84561,0,0]
[3,"Acushnet","FED","7043-1001","305-098767-2017-0003","Title I Distribution",276,0,0,0,0,-1096]
[3,"Acushnet","FED","7043-1001","305-155214-2018-0003","Title I Distribution",74935,0,0,0,0,0]
[3,"Acushnet","FED","7043-2001","140-097668-2017-0003","Teacher Quality",0,0,0,247,0,0]
[3,"Acushnet","FED","7043-2001","140-155263-2018-0003","Teacher Quality",0,0,0,17626,0,0]
[3,"Acushnet","FED","7043-7001","240-100170-2017-0003","Sped 94-142 Allocation",0,37000,0,0,0,-7065]
[3,"Acushnet","FED","7043-7001","240-146828-2018-0003","Sped 94-142 Allocation",0,258541,0,0,0,0]
[3,"Acushnet","District Total",null,null,null,{"$f":"SUBTOTAL(9,G17:G22)","v":75211},295541,0,17873,0,-8161]
[5,"Agawam","FED","7043-1001","305-104610-2017-0005","Title I Distribution",155539,0,0,0,0,0]
[5,"Agawam","FED","7043-1001","305-153660-2018-0005","Title I Distribution",416569,0,0,0,0,0]
[5,"Agawam","FED","7043-2001","140-104609-2017-0005","Teacher Quality",0,0,0,30757,0,0]
[5,"Agawam","FED","7043-2001","140-153661-2018-0005","Teacher Quality",0,0,0,69709,0,0]
[5,"Agawam","FED","7043-3001","180-153662-2018-0005","LEP Support",0,0,0,3445,0,0]
[5,"Agawam","FED","7043-4004","309-153663-2018-0005","Student Support and Academic Enrichment Grant",0,0,0,4395,0,0]
[5,"Agawam","FED","7043-7001","240-101200-2017-0005","Sped 94-142 Allocation",0,296125,0,0,0,0]
[5,"Agawam","FED","7043-7001","240-147671-2018-0005","Sped 94-142 Allocation",0,819873,0,0,0,0]
[5,"Agawam","STATE","7061-0011",null,"P.R. USVI Hurricane Relief",0,0,0,9947.9399999999987,0,0]
[5,"Agawam","District Total",null,null,null,{"$f":"SUBTOTAL(9,G24:G32)","v":572108},1115998,0,118253.94,0,0]
[7,"Amesbury","FED","7043-1001","305-150251-2018-0007","Title I Distribution",258332,0,0,0,0,0]
[7,"Amesbury","FED","7043-2001","140-152071-2018-0007","Teacher Quality",0,0,0,60784,0,0]
[7,"Amesbury","FED","7043-4004","309-152770-2018-0007","Student Support and Academic Enrichment Grant",0,0,0,5782,0,0]
[7,"Amesbury","FED","7043-7001","240-147741-2018-0007","Sped 94-142 Allocation",0,598832,0,0,0,0]
[7,"Amesbury","STATE","7010-0005","192-202924-2018-0007","Special Distr. Support",0,0,0,20000,0,0]
[7,"Amesbury","District Total",null,null,null,{"$f":"SUBTOTAL(9,G34:G38)","v":258332},598832,0,86566,0,0]
[8,"Amherst","FED","7043-1001","305-069071-2016-0008","Title I Distribution",34470,0,0,0,0,0]
[8,"Amherst","FED","7043-1001","305-102038-2017-0008","Title I Distribution",53023,0,0,0,0,-122920]
[8,"Amherst","FED","7043-1001","305-159772-2018-0008","Title I Distribution",230326,0,0,0,0,0]
[8,"Amherst","FED","7043-2001","140-102028-2017-0008","Teacher Quality",0,0,0,11390,0,0]
[8,"Amherst","FED","7043-2001","140-159771-2018-0008","Teacher Quality",0,0,0,5729,0,0]
[8,"Amherst","FED","7043-3001","180-134546-2017-0008","LEP Support",0,0,0,26481,0,0]
[8,"Amherst","FED","7043-3001","180-162109-2018-0008","LEP Support",0,0,0,2881,0,0]
[8,"Amherst","FED","7043-3001","184-138287-2018-0008","LEP - Summer Support",0,0,0,707,0,0]
[8,"Amherst","FED","7043-4004","309-162090-2018-0008","Student Support and Academic Enrichment Grant",0,0,0,2388,0,0]
[8,"Amherst","FED","7045-6300",null,"Emergency Impact Aid for Displaced Students (Fund Code 312)",0,0,0,16830,0,0]
[8,"Amherst","STATE","7061-0011",null,"P.R. USVI Hurricane Relief",0,0,0,10419.450000000001,0,0]
[8,"Amherst","District Total",null,null,null,{"$f":"SUBTOTAL(9,G40:G50)","v":317819},0,0,76825.45,0,-122920]
[9,"Andover","FED","7043-7001","274-220-7-0009-R","Sped Program Improvement",0,0,0,0,0,-1500]
[9,"Andover","FED","7043-1001","305-141361-2018-0009","Title I Distribution",174756,0,0,0,0,0]
[9,"Andover","FED","7043-3001","180-136580-2017-0009","LEP Support",0,0,0,24945,0,-2385]
[9,"Andover","FED","7043-2001","140-141355-2018-0009","Teacher Quality",0,0,0,43708,0,0]
[9,"Andover","FED","7043-7001","231-001-7-0009-R","LEAP",0,0,0,0,0,-8750]
[9,"Andover","FED","7043-3001","180-147759-2018-0009","LEP Support",0,0,0,3598,0,0]
[9,"Andover","FED","7043-3001","184-138231-2018-0009","LEP - Summer Support",0,0,0,890,0,0]
[9,"Andover","FED","7043-4004","309-141360-2018-0009","Student Support and Academic Enrichment Grant",0,0,0,4758,0,0]
[9,"Andover","FED","7043-2001","140-094089-2017-0009","Teacher Quality",0,0,0,32395,0,-21144]
[9,"Andover","FED","7043-7001","231-202017-2018-0009","LEAP",0,500,0,0,0,0]
[9,"Andover","FED","7043-1001","305-094035-2017-0009","Title I Distribution",37717,0,0,0,0,-41194]
[9,"Andover","FED","7043-7001","240-146830-2018-0009","Sped 94-142 Allocation",0,1396912,0,0,0,0]
[9,"Andover","FED","7043-7001","240-102232-2017-0009","Sped 94-142 Allocation",0,157478,0,0,0,-199271]
[9,"Andover","FED","7048-9200","110-202675-2018-0009","NGA Program",0,0,0,7500,0,0]
[9,"Andover","FED","7045-6300",null,"Emergency Impact Aid for Displaced Students (Fund Code 312)",0,0,0,11633,0,0]
[9,"Andover","STATE","7061-0011",null,"P.R. USVI Hurricane Relief",0,0,0,2860.38,0,0]
[9,"Andover","District Total",null,null,null,{"$f":"SUBTOTAL(9,G52:G67)","v":212473},1554890,0,132287.38,0,-274244]
[10,"Arlington","FED","7043-3001","180-119385-2017-0010","LEP Support",0,0,0,33398,0,-1862]
[10,"Arlington","FED","7043-1001","305-139254-2018-0010","Title I Distribution",346934,0,0,0,0,0]
[10,"Arlington","FED","7043-1001","305-094128-2017-0010","Title I Distribution",95570,0,0,0,0,-22268]
[10,"Arlington","FED","7043-2001","140-144290-2018-0010","Teacher Quality",0,0,0,52006,0,0]
[10,"Arlington","FED","7043-2001","140-095050-2017-0010","Teacher Quality",0,0,0,55631,0,-35445]
[10,"Arlington","FED","7043-3001","180-145559-2018-0010","LEP Support",0,0,0,6077,0,0]
[10,"Arlington","FED","7043-3001","184-138256-2018-0010","LEP - Summer Support",0,0,0,999,0,0]
[10,"Arlington","FED","7043-4004","309-146503-2018-0010","Student Support and Academic Enrichment Grant",0,0,0,6447,0,0]
[10,"Arlington","FED","7043-7001","274-232-7-0010-R","Sped Program Improvement",0,0,0,0,0,-36403]
[10,"Arlington","FED","7043-7001","240-146535-2018-0010","Sped 94-142 Allocation",0,1239102,0,0,0,0]
[10,"Arlington","FED","7043-7001","240-100129-2017-0010","Sped 94-142 Allocation",0,89507,0,0,0,-149851]
[10,"Arlington","FED","7043-7002","298-204615-2018-0010","E.C. Learning Together",0,300,0,0,0,0]
[10,"Arlington","FED","7045-6300",null,"Emergency Impact Aid for Displaced Students (Fund Code 312)",0,0,0,15964,0,0]
[10,"Arlington","STATE","7061-0011",null,"P.R. USVI Hurricane Relief",0,0,0,898.06,0,0]
[10,"Arlington","STATE","7010-0012","317-023-7-0010-R","Racial Imbalance (Metco)",0,0,0,0,0,-100025]
[10,"Arlington","STATE","7010-0012","317-139253-2018-0010","Racial Imbalance (Metco)",0,0,0,440519,0,0]
[10,"Arlington","STATE","7061-9612","335-003-8-0010-S","Safe Supportive School Action Plans",0,0,0,6220,0,0]
[10,"Arlington","STATE","7061-9612","335-004-7-0010-R","Safe Supportive School Action Plans",0,0,0,0,0,-18660]
[10,"Arlington","STATE","7061-9612","335-201819-2018-0010","Safe Supportive School Action Plans",0,0,0,18900,0,0]
[10,"Arlington","District Total",null,null,null,{"$f":"SUBTOTAL(9,G69:G87)","v":442504},1328909,0,637059.06000000006,0,-364514]
[14,"Ashland","FED","7043-1001","305-094129-2017-0014","Title I Distribution",40009,0,0,0,0,0]
[14,"Ashland","FED","7043-1001","305-141353-2018-0014","Title I Distribution",133344,0,0,0,0,0]
[14,"Ashland","FED","7043-2001","140-094146-2017-0014","Teacher Quality",0,0,0,1881,0,0]
[14,"Ashland","FED","7043-2001","140-141365-2018-0014","Teacher Quality",0,0,0,33032,0,0]
[14,"Ashland","FED","7043-3001","180-095235-2017-0014","LEP Support",0,0,0,8112,0,0]
[14,"Ashland","FED","7043-3001","180-145593-2018-0014","LEP Support",0,0,0,6240,0,0]
[14,"Ashland","FED","7043-4004","309-141716-2018-0014","Student Support and Academic Enrichment Grant",0,0,0,4375,0,0]
[14,"Ashland","FED","7043-7001","240-095234-2017-0014","Sped 94-142 Allocation",0,76425,0,0,0,0]
[14,"Ashland","FED","7043-7001","240-144315-2018-0014","Sped 94-142 Allocation",0,475346,0,0,0,0]
[14,"Ashland","FED","7043-7001","274-024-7-0014-R","Sped Program Improvement",0,0,0,0,0,-83]
[14,"Ashland","STATE","7010-0005","192-202478-2018-0014","Special Distr. Support",0,0,0,300000,0,0]
[14,"Ashland","District Total",null,null,null,{"$f":"SUBTOTAL(9,G89:G99)","v":173353},551771,0,353640,0,-83]
[16,"Attleboro","FED","7043-7001","240-026-7-0016-R","Sped 94-142 Allocation",0,0,0,0,0,-6209]
[16,"Attleboro","FED","7043-1001","305-094211-2017-0016","Title I Distribution",204996,0,0,0,0,0]
[16,"Attleboro","FED","7043-1001","305-142739-2018-0016","Title I Distribution",716604,0,0,0,0,0]
[16,"Attleboro","FED","7043-8001","400-015-7-0016-R","OCC Ed - Vocational Skills",0,0,0,0,0,-13288]
[16,"Attleboro","FED","7043-1001","320-198840-2018-0016","Title 1 St-Risk Students",0,0,0,26267,0,0]
[16,"Attleboro","FED","7043-2001","140-094139-2017-0016","Teacher Quality",0,0,0,4748,0,0]
[16,"Attleboro","FED","7043-2001","140-142740-2018-0016","Teacher Quality",0,0,0,197622,0,0]
[16,"Attleboro","FED","7043-6501","310-020-7-0016-R","McKinney Homeless",0,0,0,0,0,-14152]
[16,"Attleboro","FED","7043-3001","180-130193-2017-0016","LEP Support",0,0,0,20764,0,0]
[16,"Attleboro","FED","7043-3001","180-145547-2018-0016","LEP Support",0,0,0,13715,0,0]
[16,"Attleboro","FED","7043-4004","141-205865-2018-0016","T.Q. - Content Institutes",0,0,0,1225,0,0]
[16,"Attleboro","FED","7043-4004","309-142742-2018-0016","Student Support and Academic Enrichment Grant",0,0,0,24665,0,0]
[16,"Attleboro","FED","7043-1001","320-183-7-0016-R","Title 1 St-Risk Students",0,0,0,0,0,-17215]
[16,"Attleboro","FED","7043-6501","310-144271-2018-0016","McKinney Homeless",0,0,0,9302,0,0]
[16,"Attleboro","FED","7043-3001","180-046-7-0016-R","LEP Support",0,0,0,0,0,-21734]
[16,"Attleboro","FED","7043-7001","240-102082-2017-0016","Sped 94-142 Allocation",0,109035,0,0,0,0]
[16,"Attleboro","FED","7043-7001","240-153671-2018-0016","Sped 94-142 Allocation",0,1494692,0,0,0,0]
[16,"Attleboro","FED","7043-7001","274-164-7-0016-R","Sped Program Improvement",0,0,0,0,0,-25401]
[16,"Attleboro","FED","7043-7002","298-204430-2018-0016","E.C. Learning Together",0,300,0,0,0,0]
[16,"Attleboro","FED","7043-1001","305-069153-2016-0016","Title I Distribution",0,0,0,0,0,-26332]
{"$rows_left_out":4415}
{"sheet":"LEA","index":1,"n_rows":557,"n_cols":5,"rows_kept":557,"cut":false,"hidden":false,"merged":[]}
["org4code","order","lea_num","lea_name","dropdown_name"]
["0001",1,1,"Abington","1 Abington"]
["0002",2,2,"Acton","2 Acton"]
["0003",3,3,"Acushnet","3 Acushnet"]
["0004",4,4,"Adams","4 Adams"]
["0005",5,5,"Agawam","5 Agawam"]
["0006",6,6,"Alford","6 Alford"]
["0007",7,7,"Amesbury","7 Amesbury"]
["0008",8,8,"Amherst","8 Amherst"]
["0009",9,9,"Andover","9 Andover"]
["0010",10,10,"Arlington","10 Arlington"]
["0011",11,11,"Ashburnham","11 Ashburnham"]
["0012",12,12,"Ashby","12 Ashby"]
["0013",13,13,"Ashfield","13 Ashfield"]
["0014",14,14,"Ashland","14 Ashland"]
["0015",15,15,"Athol","15 Athol"]
["0016",16,16,"Attleboro","16 Attleboro"]
["0017",17,17,"Auburn","17 Auburn"]
["0018",18,18,"Avon","18 Avon"]
["0019",19,19,"Ayer","19 Ayer"]
["0020",20,20,"Barnstable","20 Barnstable"]
["0021",21,21,"Barre","21 Barre"]
["0022",22,22,"Becket","22 Becket"]
["0023",23,23,"Bedford","23 Bedford"]
["0024",24,24,"Belchertown","24 Belchertown"]
["0025",25,25,"Bellingham","25 Bellingham"]
["0026",26,26,"Belmont","26 Belmont"]
["0027",27,27,"Berkley","27 Berkley"]
["0028",28,28,"Berlin","28 Berlin"]
["0029",29,29,"Bernardston","29 Bernardston"]
["0030",30,30,"Beverly","30 Beverly"]
["0031",31,31,"Billerica","31 Billerica"]
["0032",32,32,"Blackstone","32 Blackstone"]
["0033",33,33,"Blandford","33 Blandford"]
["0034",34,34,"Bolton","34 Bolton"]
["0035",35,35,"Boston","35 Boston"]
["0036",36,36,"Bourne","36 Bourne"]
["0037",37,37,"Boxborough","37 Boxborough"]
["0038",38,38,"Boxford","38 Boxford"]
["0039",39,39,"Boylston","39 Boylston"]
["0040",40,40,"Braintree","40 Braintree"]
["0041",41,41,"Brewster","41 Brewster"]
["0042",42,42,"Bridgewater","42 Bridgewater"]
["0043",43,43,"Brimfield","43 Brimfield"]
["0044",44,44,"Brockton","44 Brockton"]
["0045",45,45,"Brookfield","45 Brookfield"]
["0046",46,46,"Brookline","46 Brookline"]
["0047",47,47,"Buckland","47 Buckland"]
["0048",48,48,"Burlington","48 Burlington"]
["0049",49,49,"Cambridge","49 Cambridge"]
["0050",50,50,"Canton","50 Canton"]
["0051",51,51,"Carlisle","51 Carlisle"]
["0052",52,52,"Carver","52 Carver"]
["0053",53,53,"Charlemont","53 Charlemont"]
["0054",54,54,"Charlton","54 Charlton"]
["0055",55,55,"Chatham","55 Chatham"]
["0056",56,56,"Chelmsford","56 Chelmsford"]
["0057",57,57,"Chelsea","57 Chelsea"]
["0058",58,58,"Cheshire","58 Cheshire"]
["0059",59,59,"Chester","59 Chester"]
["0060",60,60,"Chesterfield","60 Chesterfield"]
["0061",61,61,"Chicopee","61 Chicopee"]
["0062",62,62,"Chilmark","62 Chilmark"]
["0063",63,63,"Clarksburg","63 Clarksburg"]
["0064",64,64,"Clinton","64 Clinton"]
["0065",65,65,"Cohasset","65 Cohasset"]
["0066",66,66,"Colrain","66 Colrain"]
["0067",67,67,"Concord","67 Concord"]
["0068",68,68,"Conway","68 Conway"]
["0069",69,69,"Cummington","69 Cummington"]
["0070",70,70,"Dalton","70 Dalton"]
["0071",71,71,"Danvers","71 Danvers"]
["0072",72,72,"Dartmouth","72 Dartmouth"]
["0073",73,73,"Dedham","73 Dedham"]
["0074",74,74,"Deerfield","74 Deerfield"]
["0075",75,75,"Dennis","75 Dennis"]
["0076",76,76,"Dighton","76 Dighton"]
["0077",77,77,"Douglas","77 Douglas"]
["0078",78,78,"Dover","78 Dover"]
["0079",79,79,"Dracut","79 Dracut"]
["0080",80,80,"Dudley","80 Dudley"]
["0081",81,81,"Dunstable","81 Dunstable"]
["0082",82,82,"Duxbury","82 Duxbury"]
["0083",83,83,"East Bridgewater","83 East Bridgewater"]
["0084",84,84,"East Brookfield","84 East Brookfield"]
["0085",85,85,"Eastham","85 Eastham"]
["0086",86,86,"Easthampton","86 Easthampton"]
["0087",87,87,"East Longmeadow","87 East Longmeadow"]
["0088",88,88,"Easton","88 Easton"]
["0089",89,89,"Edgartown","89 Edgartown"]
["0090",90,90,"Egremont","90 Egremont"]
["0091",91,91,"Erving","91 Erving"]
["0092",92,92,"Essex","92 Essex"]
["0093",93,93,"Everett","93 Everett"]
["0094",94,94,"Fairhaven","94 Fairhaven"]
["0095",95,95,"Fall River","95 Fall River"]
["0096",96,96,"Falmouth","96 Falmouth"]
["0097",97,97,"Fitchburg","97 Fitchburg"]
["0098",98,98,"Florida","98 Florida"]
["0099",99,99,"Foxborough","99 Foxborough"]
["0100",100,100,"Framingham","100 Framingham"]
["0101",101,101,"Franklin","101 Franklin"]
["0102",102,102,"Freetown","102 Freetown"]
["0103",103,103,"Gardner","103 Gardner"]
["0104",104,104,"Aquinnah","104 Aquinnah"]
["0105",105,105,"Georgetown","105 Georgetown"]
["0106",106,106,"Gill","106 Gill"]
["0107",107,107,"Gloucester","107 Gloucester"]
["0108",108,108,"Goshen","108 Goshen"]
["0109",109,109,"Gosnold","109 Gosnold"]
["0110",110,110,"Grafton","110 Grafton"]
["0111",111,111,"Granby","111 Granby"]
["0112",112,112,"Granville","112 Granville"]
["0113",113,113,"Great Barrington","113 Great Barrington"]
["0114",114,114,"Greenfield","114 Greenfield"]
["0115",115,115,"Groton","115 Groton"]
["0116",116,116,"Groveland","116 Groveland"]
["0117",117,117,"Hadley","117 Hadley"]
["0118",118,118,"Halifax","118 Halifax"]
["0119",119,119,"Hamilton","119 Hamilton"]
{"$rows_left_out":437}