{"text_format":"1","workbook":"xlsx","n_sheets":4,"sheets":["FY17","FY18","Reports 2.0","LEA List"],"not_rendered":{"charts":0,"images":0,"macros":1,"external_links":2,"defined_names":8,"comments":2,"pivot_tables":0},"unopened":[],"bounds":{"document_bytes":16777216,"sheet_cells":100000,"rows_first":2000,"rows_last":500,"rows_between":2000,"halvings":0,"cell_chars":16384,"cell_head_chars":4096},"cells_cut":0,"cells_raw":0,"read":"whole","date_system":"1900"}

{"sheet":"FY17","index":0,"n_rows":444,"n_cols":41,"rows_kept":444,"cut":false,"hidden":true,"merged":[]}
[]
[]
[]
[]
[null,"Order","Lea","District","Lea","Op.","Curriculum Directors  (Supervisory) (2110) (line 3409, col 6)","Department Heads  (Non-Supervisory) (2120) (line 3419, col 6)","Instructional Technology Leadership and Training (2130) (line 3427, col 6) *","School Leadership-Building (2210) (line 3429, col 6)","Curriculum Leaders/Department Heads-Building Level (2220) (line 3439, col 6)","Building Technology (2250) (line 3449, col 6)","Teachers, Classroom (2305) (line 3450, col 6)","Teachers, Specialists  (2310) (line 3451, col 6)","Instructional Coordinators and Team Leaders (2315) (line 3464, col 6)","Medical/ Therapeutic Services (2320) (line 3469, col 6)","Substitutes, Long Term (2324) (line 3465, col 6)","Substitutes, Short Term (2325) (line 3469, col 6)","Non-Clerical Paraprofs./Instructional Assistants (2330) (line 3475, col 6)","Librarians and Media Center Directors (2340) (line 3479, col 6)","Distance Learning and Online Coursework (2345) (line 3486, col 6) *","Professional Development Leadership (2351) (line 3489, col 6)","Instructional Coaches (2352) (line 3495, col 6)","Teacher/Instructional Staff-Professional Days (2353) (line 3493, col 6)","Stipends for Teachers Providing Instructional Coaching (2354) (line 3497, col 6)","Substitutes for Instructional Staff at Prof. Development (2355) (line 3494, col 6)","Costs for Instructional Staff to Attend Prof. Dev. (2356) (line 3505, col 6)","Prof. Development Stipends, Providers and Expenses (2357) (line 3499, col 6)","Outside Professional Development for Instructional Staff (2358) (line 3509, col 6)","Textbooks and Related Software/Media/Materials (2410) (line 3509, col 6)","Other Instructional Materials (2415) (line 3519, col 6)","Instructional Equipment (2420) (line 3529, col 6)","General Supplies (2430) (line 3535, col 6)","Other Instructional Services (2440) (line 3544, col 6)","Classroom Instructional Technology (2451) (line 3548, col 6)","Other Instructional Hardware  (2453) (line 3552, col 6)","Instructional Software (2455) (line 3556, col 6)","Guidance Counselors and Adjustment Counselors (2710) (line 3569, col 6)","Testing and Assessment (2720) (line 3579, col 6)","Psychological Services (2800) (line 3589, col 6)","Total Instruction (2000) (line 3599, col 6)"]
[null,1,"0001","ABINGTON                     ","001",1,286416.76,0,0,1053683.03,0,8246.92,8937658.6099999994,509795,0,320139.61,0,118895.93999999999,1373048.59,83635.44,0,243435.89000000004,0,78590.33,0,0,0,92618.53,0,226402.47999999995,47673.45,24224.47,224430.72,877919.48,183572.57,22536.400000000001,21441.079999999998,366422.38999999996,0,366395.61,15467183.300000001]
[null,{"$f":"B6+1","v":2},"0002","ACTON                        ","002",0,0,0,0,0,0,0,0,0,0,0,0,0,0,0,0,0,0,0,0,0,0,0,0,0,0,0,0,0,0,0,0,0,0,0,0]
[null,3,"0003","ACUSHNET                     ","003",1,151304.63999999998,0,0,461855.55000000005,0,120186.5,4892512.2100000009,1027.5,16240.5,378130.47,0,105449.65000000001,465803.14,30178.76,0,0,0,37000,0,0,0,45062.5,0,115654.62,179.98,17567.890000000003,64361.420000000006,21055.050000000003,261527.72999999998,0,0,249674.49,0,123635.59,7558408.1900000013]
[null,4,"0004","ADAMS                        ","004",0,0,0,0,0,0,0,0,0,0,0,0,0,0,0,0,0,0,0,0,0,0,0,0,0,0,0,0,0,0,0,0,0,0,0,0]
[null,5,"0005","AGAWAM                       ","005",1,369808,0,0,1949101,140911,0,22129770,14544,565060,1217465,0,417613,3190244,574877,0,0,0,0,0,0,0,95368,0,338880,75822,16736,213399,9256,407400,3753,0,1483205,23648,574279,33811139]
[null,6,"0006","ALFORD                       ","006",0,0,0,0,0,0,0,0,0,0,0,0,0,0,0,0,0,0,0,0,0,0,0,0,0,0,0,0,0,0,0,0,0,0,0,0]
[null,7,"0007","AMESBURY                     ","007",1,389933.51,0,0,1392348.8000000003,0,0,12253197.619999999,0,0,278991.35999999999,0,234044.24000000002,1927260.17,318347.69,0,0,0,13500,0,0,0,79936.990000000005,0,125928.22,29544.07,87280.37999999999,168197.44,5818.12,10096.81,0,24876.78,827089.65,17225,161999,18345615.849999998]
[null,8,"0008","AMHERST                      ","008",1,282671,0,0,941117,0,9712,5794264,2560982,15389,540901,0,181975,2015545,305831,0,752,0,105147,0,37291,0,483887,0,1724,178118,16363,69654,51608,77536,0,4196,240752,0,451517,14366932]
[null,9,"0009","ANDOVER                      ","009",1,1635266,0,0,3514562,541885,355196,28436891,9724610,31193,2502269,0,351356,5818133,1162016,0,0,0,74659,0,75875,0,326380,0,393820,121890,172141,510097,63885,135656,2413,22731,2092516,0,1374883,59440323]
[null,10,"0010","ARLINGTON                    ","010",1,1532544.83,2999.88,0,2577079.94,16525.02,0,22181475.477049176,4535995.7336065564,744128.05,1449045.76,0,699463.15,2436978.9400000004,268887.21000000002,0,7454.75,0,483429.70901639346,0,0,0,265291.48,0,108389.10999999999,381456.22,28330.14,180756.78,45100.420000000006,90630.430000000008,0,50690,2187114.31,145020.85999999999,641587.41999999993,41060375.61967212]
[null,11,"0011","ASHBURNHAM                   ","011",0,0,0,0,0,0,0,0,0,0,0,0,0,0,0,0,0,0,0,0,0,0,0,0,0,0,0,0,0,0,0,0,0,0,0,0]
[null,12,"0012","ASHBY                        ","012",0,0,0,0,0,0,0,0,0,0,0,0,0,0,0,0,0,0,0,0,0,0,0,0,0,0,0,0,0,0,0,0,0,0,0,0]
[null,13,"0013","ASHFIELD                     ","013",0,0,0,0,0,0,0,0,0,0,0,0,0,0,0,0,0,0,0,0,0,0,0,0,0,0,0,0,0,0,0,0,0,0,0,0]
[null,14,"0014","ASHLAND                      ","014",1,248414.37,0,0,1254478,3555,23981.08,10624146.109999999,3457241.08,211797.62,784875.77,0,289497.65000000002,1109824.1200000001,91735.08,0,29781.25,0,6630,0,16247.5,0,207389.84,0,80072.77,4012.68,91163.39,218098.52000000002,188017.88000000003,16586.669999999998,0,0,1196473.92,0,390687.78,20544708.079999998]
[null,15,"0015","ATHOL                        ","015",0,0,0,0,0,0,0,0,0,0,0,0,0,0,0,0,0,0,0,0,0,0,0,0,0,0,0,0,0,0,0,0,0,0,0,0]
{"$rows_left_out":425}
{"sheet":"FY18","index":1,"n_rows":444,"n_cols":41,"rows_kept":444,"cut":false,"hidden":true,"merged":[]}
[]
[]
[]
[null,null,null,null,1,{"$f":"E4+1","v":2},{"$f":"F4+1","v":3},4,5,6,7,8,9,10,11,12,13,14,15,16,17,18,19,20,21,22,23,24,25,26,27,28,29,30,31,32,33,34,35,36,37]
[null,"Order","Lea","District","Lea","Op.","Curriculum Directors  (Supervisory) (2110) (line 3409, col 6)","Department Heads  (Non-Supervisory) (2120) (line 3419, col 6)","Instructional Technology Leadership and Training (2130) (line 3427, col 6) *","School Leadership-Building (2210) (line 3434, col 6)","Curriculum Leaders/Department Heads-Building Level (2220) ","Administrative Technology and Support – Schools (2250) (line 3449, col 6)","Teachers, Classroom (2305) (line 3450, col 6)","Teachers, Specialists (2310)","Instructional Coordinators and Team Leaders (2315)","Medical/ Therapeutic Services (2320) (line 3459, col 6)","Substitutes, Long Term (2324) (line 3465, col 6)","Substitutes, Short Term (2325) (line 3469, col 6)","Non-Clerical Paraprofs./Instructional Assistants (2330) (line 3475, col 6)","Librarians and Media Center Directors (2340) (line 3479, col 6)","Distance Learning and Online Coursework (2345) (line 3486, col 6) *","Professional Development Leadership (2351) (line 3493, col 6)","Instructional Coaches (2352) (line 3498, col 6)","Teacher/Instructional Staff-Professional Days (2353) ","Stipends for Teachers Providing Instructional Coaching (2354) (line 3499, col 6)","Substitutes for Instructional Staff at Prof. Development (2355) ","Costs for Instructional Staff to Attend Prof. Dev. (2356) (line 3505, col 6)","Prof. Development Stipends, Providers and Expenses (2357)","Outside Professional Development for Instructional Staff (2358) (line 3509, col 6)","Textbooks (2410) (line 3511, col 6)","Other Instructional Materials (2415) (line 3519, col 6)","Instructional Equipment (2420) (line 3529, col 6)","General Supplies (2430) (line 3535, col 6)","Other Instructional Services (2440) (line 3544, col 6)","Instructional Hardware –Student and Staff Devices (computers) (2451) (line 3548, col 6)","Instructional Hardware—All Other (2453) (line 3552, col 6)","Instructional Software and Other Instructional Materials (2455) (line 3556, col 6)","Guidance Counselors and Adjustment Counselors (2710) (line 3569, col 6)","Testing and Assessment (2720) (line 3579, col 6)","Psychological Services (2800) (line 3589, col 6)","Total Instruction (2000) (line 3599, col 6)"]
[null,1,"0001","ABINGTON                     ","001",1,326478.51999999996,45318.879999999997,0,1116731.53,0,5289.46,9722775.6699999999,0,0,368494,155382.04,92978.86,1558018.37,87421.98,0,17935,0,0,21975,0,82917.650000000009,0,0,176428.48,67861.23,32391.89,237938.21,473132,205644.67,21990,139209,383840.96000000008,0,401795.03,15741948.430000002]
[null,{"$f":"B6+1","v":2},"0002","ACTON                        ","002",0,0,0,0,0,0,0,0,0,0,0,0,0,0,0,0,0,0,0,0,0,0,0,0,0,0,0,0,0,0,0,0,0,0,0,0]
[null,3,"0003","ACUSHNET                     ","003",1,157585.43,16117.71,0,454500.17,0,141092.38,4989090.01,0,0,367818,46692.3,103656.75,491659.11,30446.58,0,0,67110.5,0,0,0,8728.869999999999,0,28187.9,71147.06,0,4111.87,34189.29,25411.510000000002,253915.09,0,0,315655.88,0,135112.60999999999,7742229.0199999996]
[null,4,"0004","ADAMS                        ","004",0,0,0,0,0,0,0,0,0,0,0,0,0,0,0,0,0,0,0,0,0,0,0,0,0,0,0,0,0,0,0,0,0,0,0,0]
[null,5,"0005","AGAWAM                       ","005",1,400672,0,0,2032307,0,8798,23213648,0,0,1598724,509085,31945,3210703,458305,0,0,276870,0,144686,0,101854,0,0,230652,60710,21983,279935,3148,285482,54930,0,1648948,17392,435432,35026209]
[null,6,"0006","ALFORD                       ","006",0,0,0,0,0,0,0,0,0,0,0,0,0,0,0,0,0,0,0,0,0,0,0,0,0,0,0,0,0,0,0,0,0,0,0,0]
[null,7,"0007","AMESBURY                     ","007",1,416329.95500000002,65755.5,0,1447417.4299999997,0,2433.5100000000002,11921715.130000001,0,0,1000452.95,154951.32999999999,189155.75599999999,1729770.5899999999,316539.42,0,76549.645000000004,0,0,8975,0,55654.420000000013,0,10616.060000000001,27588.58,20272.71,106032.18,182122.03000000003,35425.629999999997,32486.400000000001,3289.97,32996.770000000004,873401.99,0,169377.6,18879310.555999998]
[null,8,"0008","AMHERST                      ","008",1,324266,15953,0,977603,0,8091,8556989,0,0,561726,79247,163625,2297479,247606,0,268,383098,0,0,0,14588,0,14075,0,70654,8102,41919,23648,173794,129,3455,249189,0,484499,14700003]
[null,9,"0009","ANDOVER                      ","009",1,2120042,101211,0,3589074,0,408942,39765313,0,0,2376078,136770,405814,6026458,1301955,0,0,0,0,50283,0,367463,0,45199,749228,68045,167183,465379,81383,69208,0,14629,2122923,0,1433466,61866046]
[null,10,"0010","ARLINGTON                    ","010",1,1744171,14124,0,2952765.92,0,0,29559573,0,0,1183757,991812,0,2693186,286368,0,14175,5351,0,0,0,2818,0,217223,105537,373694,31181,172990,38609,348,0,31985,2366278,45995.3,760825,43592766.219999999]
[null,11,"0011","ASHBURNHAM                   ","011",0,0,0,0,0,0,0,0,0,0,0,0,0,0,0,0,0,0,0,0,0,0,0,0,0,0,0,0,0,0,0,0,0,0,0,0]
[null,12,"0012","ASHBY                        ","012",0,0,0,0,0,0,0,0,0,0,0,0,0,0,0,0,0,0,0,0,0,0,0,0,0,0,0,0,0,0,0,0,0,0,0,0]
[null,13,"0013","ASHFIELD                     ","013",0,0,0,0,0,0,0,0,0,0,0,0,0,0,0,0,0,0,0,0,0,0,0,0,0,0,0,0,0,0,0,0,0,0,0,0]
[null,14,"0014","ASHLAND                      ","014",1,137019.47,25866.36,0,1331556.26,0,6800.93,15258032.83,0,0,660630.51,158049.96000000002,183706.31999999998,1580998.6099999999,94084.98,0,36876.380000000005,0,0,52449.08,0,0,0,64150.380000000005,22908.989999999998,2943.81,22542.81,3249.2699999999995,91725.940000000017,7274.6,0,2500,1251354.8700000001,0,538380.74,21533103.099999994]
[null,15,"0015","ATHOL                        ","015",0,0,0,0,0,0,0,0,0,0,0,0,0,0,0,0,0,0,0,0,0,0,0,0,0,0,0,0,0,0,0,0,0,0,0,0]
{"$rows_left_out":425}
{"sheet":"Reports 2.0","index":2,"n_rows":41,"n_cols":11,"rows_kept":41,"cut":false,"hidden":false,"merged":[[1,2,1,7]]}
[]
[null,null,"Corrected FY18 EOYR Schedule 3 Instructoinal data"]
[]
[null,null,"Please select your District from the below drop down:"]
[" ",null,{"$f":"VLOOKUP(A6,'LEA List'!A2:C440,3,FALSE)","v":"001"}]
[1,null,"Schedule 3 Instruction Expenditures, School Committee",null,"FY17","FY18","FY19","Change FY18-FY19",null,"Please review and correct \nany reporting errors","Select OK if the reported data is correct"]
[null,149,"Curriculum Directors  (Supervisory) (2110) (line 3409, col 6)",null,{"$f":"IFERROR(VLOOKUP($C$5,'FY17'!$E$6:$AO$444,3,FALSE),\"\")","v":286416.76},{"$f":"IFERROR(VLOOKUP($C$5,'FY18'!$E$6:$AO$444,3,FALSE),\"\")","v":326478.51999999996},0,{"$f":"IF(F7>0,(G7-F7)/F7,IF(G7>0,1,0))","v":-1},null,{"$f":"IF(K7=\"OK\",\"\", IF(AND(ABS(H7)>0.25,ABS(G7-F7)>100000),\"Please Review\",\"\"))","v":"Please Review"}]
[null,150,"Department Heads  (Non-Supervisory) (2120) (line 3419, col 6)",null,{"$f":"IFERROR(VLOOKUP($C$5,'FY17'!$E$6:$AO$444,4,FALSE),\"\")","v":0},{"$f":"IFERROR(VLOOKUP($C$5,'FY18'!$E$6:$AO$444,4,FALSE),\"\")","v":45318.879999999997},0,-1,null,{"$f":"IF(K8=\"OK\",\"\", IF(AND(ABS(H8)>0.25,ABS(G8-F8)>100000),\"Please Review\",\"\"))","v":""}]
[null,151,"Instructional Technology Leadership and Training (2130) (line 3427, col 6) *",null,null,null,0,null,null,""]
[null,152,"School Leadership-Building (2210) (line 3434, col 6)",null,{"$f":"IFERROR(VLOOKUP($C$5,'FY17'!$E$6:$AO$444,6,FALSE),\"\")","v":1053683.03},{"$f":"IFERROR(VLOOKUP($C$5,'FY18'!$E$6:$AO$444,6,FALSE),\"\")","v":1116731.53},0,-1,null,"Please Review"]
[null,153,"Curriculum Leaders/Department Heads-Building Level (2220) ",null,{"$f":"IFERROR(VLOOKUP($C$5,'FY17'!$E$6:$AO$444,7,FALSE),\"\")","v":0},null,null,null,null,""]
[null,154,"Administrative Technology and Support – Schools (2250) (line 3449, col 6)",null,{"$f":"IFERROR(VLOOKUP($C$5,'FY17'!$E$6:$AO$444,8,FALSE),\"\")","v":8246.92},{"$f":"IFERROR(VLOOKUP($C$5,'FY18'!$E$6:$AO$444,8,FALSE),\"\")","v":5289.46},0,-1,null,""]
[null,155,"Teachers, Classroom (2305) (line 3450, col 6)",null,{"$f":"IFERROR(VLOOKUP($C$5,'FY17'!$E$6:$AO$444,9,FALSE),\"\")","v":8937658.6099999994},{"$f":"IFERROR(VLOOKUP($C$5,'FY18'!$E$6:$AO$444,9,FALSE),\"\")","v":9722775.6699999999},0,-1,null,"Please Review"]
[null,156,"Teachers, Specialists (2310)",null,{"$f":"IFERROR(VLOOKUP($C$5,'FY17'!$E$6:$AO$444,10,FALSE),\"\")","v":509795},null,null,null,null,""]
[null,157,"Instructional Coordinators and Team Leaders (2315)",null,{"$f":"IFERROR(VLOOKUP($C$5,'FY17'!$E$6:$AO$444,11,FALSE),\"\")","v":0},null,null,null,null,""]
[null,158,"Medical/ Therapeutic Services (2320) (line 3459, col 6)",null,{"$f":"IFERROR(VLOOKUP($C$5,'FY17'!$E$6:$AO$444,12,FALSE),\"\")","v":320139.61},{"$f":"IFERROR(VLOOKUP($C$5,'FY18'!$E$6:$AO$444,12,FALSE),\"\")","v":368494},0,-1,null,"Please Review"]
[null,159,"Substitutes, Long Term (2324) (line 3465, col 6)",null,null,{"$f":"IFERROR(VLOOKUP($C$5,'FY18'!$E$6:$AO$444,13,FALSE),\"\")","v":155382.04},0,-1,null,"Please Review"]
[null,160,"Substitutes, Short Term (2325) (line 3469, col 6)",null,{"$f":"IFERROR(VLOOKUP($C$5,'FY17'!$E$6:$AO$444,14,FALSE),\"\")","v":118895.93999999999},{"$f":"IFERROR(VLOOKUP($C$5,'FY18'!$E$6:$AO$444,14,FALSE),\"\")","v":92978.86},0,-1,null,""]
[null,161,"Non-Clerical Paraprofs./Instructional Assistants (2330) (line 3475, col 6)",null,{"$f":"IFERROR(VLOOKUP($C$5,'FY17'!$E$6:$AO$444,15,FALSE),\"\")","v":1373048.59},{"$f":"IFERROR(VLOOKUP($C$5,'FY18'!$E$6:$AO$444,15,FALSE),\"\")","v":1558018.37},0,-1,null,"Please Review"]
[null,162,"Librarians and Media Center Directors (2340) (line 3479, col 6)",null,{"$f":"IFERROR(VLOOKUP($C$5,'FY17'!$E$6:$AO$444,16,FALSE),\"\")","v":83635.44},{"$f":"IFERROR(VLOOKUP($C$5,'FY18'!$E$6:$AO$444,16,FALSE),\"\")","v":87421.98},0,-1,null,""]
{"$rows_left_out":22}
{"sheet":"LEA List","index":3,"n_rows":440,"n_cols":4,"rows_kept":440,"cut":false,"hidden":true,"merged":[]}
[]
[1,"001 - ABINGTON                     ","001",{"$f":"C2&\" - \"&B2","v":"001 - 001 - ABINGTON                     "}]
[{"$f":"A2+1","v":2},"002 - ACTON                        ","002",{"$f":"C3&\" - \"&B3","v":"002 - 002 - ACTON                        "}]
[3,"003 - ACUSHNET                     ","003","003 - 003 - ACUSHNET                     "]
[4,"004 - ADAMS                        ","004","004 - 004 - ADAMS                        "]
[5,"005 - AGAWAM                       ","005","005 - 005 - AGAWAM                       "]
[6,"006 - ALFORD                       ","006","006 - 006 - ALFORD                       "]
[7,"007 - AMESBURY                     ","007","007 - 007 - AMESBURY                     "]
[8,"008 - AMHERST                      ","008","008 - 008 - AMHERST                      "]
[9,"009 - ANDOVER                      ","009","009 - 009 - ANDOVER                      "]
[10,"010 - ARLINGTON                    ","010","010 - 010 - ARLINGTON                    "]
[11,"011 - ASHBURNHAM                   ","011","011 - 011 - ASHBURNHAM                   "]
[12,"012 - ASHBY                        ","012","012 - 012 - ASHBY                        "]
[13,"013 - ASHFIELD                     ","013","013 - 013 - ASHFIELD                     "]
[14,"014 - ASHLAND                      ","014","014 - 014 - ASHLAND                      "]
[15,"015 - ATHOL                        ","015","015 - 015 - ATHOL                        "]
[16,"016 - ATTLEBORO                    ","016","016 - 016 - ATTLEBORO                    "]
[17,"017 - AUBURN                       ","017","017 - 017 - AUBURN                       "]
[18,"018 - AVON                         ","018","018 - 018 - AVON                         "]
[19,"019 - AYER                         ","019","019 - 019 - AYER                         "]
{"$rows_left_out":420}