{"text_format":"1","workbook":"xlsx","n_sheets":4,"sheets":["Functional Expense Line Lookup","LineLookup","DropDown","Data"],"not_rendered":{"charts":0,"images":1,"macros":1,"external_links":0,"defined_names":3,"comments":0,"pivot_tables":0},"unopened":[],"bounds":{"document_bytes":16777216,"sheet_cells":100000,"rows_first":2000,"rows_last":500,"rows_between":2000,"halvings":0,"cell_chars":16384,"cell_head_chars":4096},"cells_cut":0,"cells_raw":0,"read":"whole","date_system":"1900"}

{"sheet":"Functional Expense Line Lookup","index":0,"n_rows":17,"n_cols":3,"rows_kept":17,"cut":false,"hidden":false,"merged":[[3,1,3,2],[10,1,10,2],[4,1,4,2]]}
[]
[null,"CSEOYFR Schedule of Functional Expense Line Lookup"]
[""]
[null,"Instructions: Use the search feature and dropdown list to find the expense in question. The best line item for the applicable expense will autofill below."]
[null,"Make selection or start typing here (must clear and click off to begin new search):"]
[null,""]
[]
[null,"Functional Expense Line:"]
[null,{"$f":"VLOOKUP(B6, DATA, 2, FALSE)","v":{"$error":"#N/A"}}]
[null,{"$f":"VLOOKUP(B9, LineDescr, 2, FALSE)","v":{"$error":"#N/A"}}]
[null,{"$f":"VLOOKUP(B9, LineDescr, 3, FALSE)","v":{"$error":"#N/A"}}]
[]
[]
[null,"Related Contact Info:"]
[null,{"$f":"VLOOKUP(B6, DATA, 4, FALSE)","v":{"$error":"#N/A"}},{"$f":"VLOOKUP(B6, DATA, 5, FALSE)","v":{"$error":"#N/A"}}]
[null,"Phone Number:",{"$f":"VLOOKUP(B6, DATA, 3, FALSE)","v":{"$error":"#N/A"}}]
[null,"Links to related guidance:",{"$f":"HYPERLINK(VLOOKUP(B6, DATA, 6, FALSE))","v":{"$error":"#N/A"}}]

{"sheet":"LineLookup","index":1,"n_rows":95,"n_cols":3,"rows_kept":95,"cut":false,"hidden":true,"merged":[]}
["Line","Functional Category","Descr"]
[100,"Administration","Administration - Calculates automatically."]
[110,"Subtotal - Board of Trustees","Calculates automatically"]
[111,"Contracted Services","Contracted professional services, including all related expenses covered by the contract. (Ex: board training consultant, facilitator for board retreat, board attorney) Do not include auditor see Non-Instructional Administration-Contracted Services."]
[112,"Travel and other expenses","Travel and other expenses for board members such as dues, subscriptions and memberships. (Ex: board member travels to charter school conference, dues for board-specific professional association)."]
["120a","Subtotal - Non-Instructional Administration and Support Staff","Calculates automatically"]
["121a","Salaries - Professional and Support Staff","Salaries for non-instructional school-wide administrative personnel, excluding development staff. (Ex: executive director, Business and Finance, Human Resources, Legal Services, Information Technology, Student Recruitment and Enrollment/Registrar, Enrollment Director, SIMS administrator, and respective Support Staff). Principals and Instructional Leaders should be noted in Instructional Services. If role is instructional and administrative, split accordingly."]
["122a","Contracted Services - Professional and Support Staff","Contracted professional services, including all related expenses covered by the contract, excluding development contracts. (Ex: interim school leader, auditor, attorney, licensing for district wide software - Microsoft, Anti virus)."]
[123,"Recruitment/Advertising","Recruiting/advertising for students, staff, and board members. (Ex: brochures, newspaper advertising,  web based staff recruitment such as School Spring, radio, advertising for bids)."]
[124,"Travel, Dues, and other expenses","Travel and other expenses for all non-instructional  administrative and support staff,  dues such as charter school association dues, professional dues, subscriptions, memberships, professional development and conferences."]
[125,"Supplies and Materials","Materials and items of an expendable nature. Unit price of less than $5000. (Ex: office furniture, office supplies, non-instructional computers and software)."]
[126,"Depreciation - non instructional","Annual depreciation expense for capitalized costs (ex: district wide information management, computers, furniture)."]
[170,"Subtotal - Development (Private)","Calculates automatically"]
["170a","Salaries - Professional - Private","Salaries apportioned to private development personnel (this could be % of a salary). (Ex: grant writer and fundraiser)."]
["170b","Contracted Services - Private","Contracts apportioned to professional services for private development (including all related expenses covered by the contract). (Ex: contracted fundraiser, contracted grant writer)."]
["170c","Fundraising - Private","Expenses related to private fundraising. (Ex: invitations to fundraiser, fundraising software, space rental for fundraising event)."]
[171,"Subtotal - Development (Public)","Calculates automatically"]
["171a","Salaries - Professional - Public","Salaries apportioned to public development personnel (this could be a % of a salary). (Ex: grant writer and fundraiser)."]
["171b","Contracted Services - Public","Contracts apportioned to professional services for public development (including all related expenses covered by the contract). (Ex: contracted grant writer)."]
[null,""]
[200,"Instructional Services","Calculates automatically"]
[210,"Instructional\nSubtotal - Instructional Leadership","Calculates automatically"]
[211,"Salaries - Professional","Salaries for instructional personnel in leadership roles. (Ex: principal/asst. principals (undistributed), curriculum directors (including SPED), department heads, technology/tnstructional coordinators, team leaders, network school administrators)."]
[212,"Salaries - Clerical","Salaries for administrative support personnel who prepare, transcribe, systematize or preserve communications, records and transactions. (Ex: instructional school secretary and respective clerical support staff to the various instructional personnel in leadership roles)."]
[213,"Contracted Services","Contracted professional services, including all related expenses covered by the contract. (Ex: contracted instructional consultant such as a reading specialist)."]
[214,"Supplies and Materials","Materials and items of an expendable nature. Unit price of less than $5000. (Ex: white boards and computers for instructional leaders)."]
[215,"Travel and other expenses","Travel and other expenses for all instructional leadership and their support staff, professional dues, subscriptions, memberships, teaching seminars and conferences ."]
[220,"Instructional\nSubtotal - Classroom and Specialist Teachers","Calculates automatically"]
[221,"Salaries - Teachers, Classroom","Salaries for teachers with primary responsibility for teaching designated curriculum to established \"classes\" of students in a group instruction setting. Also includes itinerant music, art, health, physical education teachers who travel from classroom-to-classroom.\nTeacher EPIMS codes: 2305 - Teacher, 2306 - Co Teacher, 2307 - Virtual Teacher, 2308 - Virtual Teacher – Co Teacher"]
[222,"Salaries - Teachers, Specialists","Salaries for teachers/specialists  who provide individualized instruction to students (1-on-1 or small groups) to supplement the services delivered by the students' classroom teachers, e.g. reading recovery, Title I reading specialists, special education, academic support, and language acquisitions services. NOT paraprofessionals.\nTeacher EPIMS codes: 2310 - Teacher - specialized content instruction"]
{"$rows_left_out":66}
{"sheet":"DropDown","index":2,"n_rows":183,"n_cols":12,"rows_kept":183,"cut":false,"hidden":true,"merged":[]}
[]
[null,null,null,null,"Topic/Expense (alphabetical)"]
[null,null,null,null,"Administration: Copier lease",{"$f":"--ISNUMBER(IFERROR(SEARCH('Functional Expense Line Lookup'!$B$6,DropDown!E3,1),\"\"))","v":1},{"$f":"IF(F3=1,COUNTIF($F$3:F3,1),\"\")","v":1},{"$f":"IFERROR(INDEX(DropDown!$E$3:$E$183,MATCH(ROWS($G$3:G3),$G$3:$G$183,0)),\"\")","v":"Administration: Copier lease"},null,{"$f":"IFERROR(INDEX(DropDown!$E$3:$E$22,MATCH(ROWS($G$3:G3),$G$3:$G$22,0)),\"\")","v":"Administration: Copier lease"},null,{"$f":"DropDown!$H$3:INDEX(DropDown!$H$3:$H$22,MAX(DropDown!$G$3:$G$22),1)","v":"Administration: Copier lease"}]
[null,null,null,null,"401K Employee",{"$f":"--ISNUMBER(IFERROR(SEARCH('Functional Expense Line Lookup'!$B$6,DropDown!E4,1),\"\"))","v":1},{"$f":"IF(F4=1,COUNTIF($F$3:F4,1),\"\")","v":2},{"$f":"IFERROR(INDEX(DropDown!$E$3:$E$183,MATCH(ROWS($G$3:G4),$G$3:$G$183,0)),\"\")","v":"401K Employee"}]
[null,null,null,null,"403B Employee",{"$f":"--ISNUMBER(IFERROR(SEARCH('Functional Expense Line Lookup'!$B$6,DropDown!E5,1),\"\"))","v":1},{"$f":"IF(F5=1,COUNTIF($F$3:F5,1),\"\")","v":3},{"$f":"IFERROR(INDEX(DropDown!$E$3:$E$183,MATCH(ROWS($G$3:G5),$G$3:$G$183,0)),\"\")","v":"403B Employee"}]
[null,null,null,null,"Advertising",{"$f":"--ISNUMBER(IFERROR(SEARCH('Functional Expense Line Lookup'!$B$6,DropDown!E6,1),\"\"))","v":1},{"$f":"IF(F6=1,COUNTIF($F$3:F6,1),\"\")","v":4},{"$f":"IFERROR(INDEX(DropDown!$E$3:$E$183,MATCH(ROWS($G$3:G6),$G$3:$G$183,0)),\"\")","v":"Advertising"}]
[null,null,null,null,"Architect for Facilities",{"$f":"--ISNUMBER(IFERROR(SEARCH('Functional Expense Line Lookup'!$B$6,DropDown!E7,1),\"\"))","v":1},{"$f":"IF(F7=1,COUNTIF($F$3:F7,1),\"\")","v":5},{"$f":"IFERROR(INDEX(DropDown!$E$3:$E$183,MATCH(ROWS($G$3:G7),$G$3:$G$183,0)),\"\")","v":"Architect for Facilities"}]
[null,null,null,null,"Asset Disposal",{"$f":"--ISNUMBER(IFERROR(SEARCH('Functional Expense Line Lookup'!$B$6,DropDown!E8,1),\"\"))","v":1},{"$f":"IF(F8=1,COUNTIF($F$3:F8,1),\"\")","v":6},{"$f":"IFERROR(INDEX(DropDown!$E$3:$E$183,MATCH(ROWS($G$3:G8),$G$3:$G$183,0)),\"\")","v":"Asset Disposal"}]
[null,null,null,null,"Asset Loss",{"$f":"--ISNUMBER(IFERROR(SEARCH('Functional Expense Line Lookup'!$B$6,DropDown!E9,1),\"\"))","v":1},{"$f":"IF(F9=1,COUNTIF($F$3:F9,1),\"\")","v":7},{"$f":"IFERROR(INDEX(DropDown!$E$3:$E$183,MATCH(ROWS($G$3:G9),$G$3:$G$183,0)),\"\")","v":"Asset Loss"}]
[null,null,null,null,"Assistant Principal",{"$f":"--ISNUMBER(IFERROR(SEARCH('Functional Expense Line Lookup'!$B$6,DropDown!E10,1),\"\"))","v":1},{"$f":"IF(F10=1,COUNTIF($F$3:F10,1),\"\")","v":8},{"$f":"IFERROR(INDEX(DropDown!$E$3:$E$183,MATCH(ROWS($G$3:G10),$G$3:$G$183,0)),\"\")","v":"Assistant Principal"}]
[null,null,null,null,"Auditor",{"$f":"--ISNUMBER(IFERROR(SEARCH('Functional Expense Line Lookup'!$B$6,DropDown!E11,1),\"\"))","v":1},{"$f":"IF(F11=1,COUNTIF($F$3:F11,1),\"\")","v":9},{"$f":"IFERROR(INDEX(DropDown!$E$3:$E$183,MATCH(ROWS($G$3:G11),$G$3:$G$183,0)),\"\")","v":"Auditor"}]
[null,null,null,null,"Bad Debt",{"$f":"--ISNUMBER(IFERROR(SEARCH('Functional Expense Line Lookup'!$B$6,DropDown!E12,1),\"\"))","v":1},{"$f":"IF(F12=1,COUNTIF($F$3:F12,1),\"\")","v":10},{"$f":"IFERROR(INDEX(DropDown!$E$3:$E$183,MATCH(ROWS($G$3:G12),$G$3:$G$183,0)),\"\")","v":"Bad Debt"}]
[null,null,null,null,"Blackboard Software",{"$f":"--ISNUMBER(IFERROR(SEARCH('Functional Expense Line Lookup'!$B$6,DropDown!E13,1),\"\"))","v":1},{"$f":"IF(F13=1,COUNTIF($F$3:F13,1),\"\")","v":11},{"$f":"IFERROR(INDEX(DropDown!$E$3:$E$183,MATCH(ROWS($G$3:G13),$G$3:$G$183,0)),\"\")","v":"Blackboard Software"}]
[null,null,null,null,"Blended Learning",{"$f":"--ISNUMBER(IFERROR(SEARCH('Functional Expense Line Lookup'!$B$6,DropDown!E14,1),\"\"))","v":1},{"$f":"IF(F14=1,COUNTIF($F$3:F14,1),\"\")","v":12},{"$f":"IFERROR(INDEX(DropDown!$E$3:$E$183,MATCH(ROWS($G$3:G14),$G$3:$G$183,0)),\"\")","v":"Blended Learning"}]
[null,null,null,null,"Building Lease",{"$f":"--ISNUMBER(IFERROR(SEARCH('Functional Expense Line Lookup'!$B$6,DropDown!E15,1),\"\"))","v":1},{"$f":"IF(F15=1,COUNTIF($F$3:F15,1),\"\")","v":13},{"$f":"IFERROR(INDEX(DropDown!$E$3:$E$183,MATCH(ROWS($G$3:G15),$G$3:$G$183,0)),\"\")","v":"Building Lease"}]
[null,null,null,null,"Capital Acquisition Costs",{"$f":"--ISNUMBER(IFERROR(SEARCH('Functional Expense Line Lookup'!$B$6,DropDown!E16,1),\"\"))","v":1},{"$f":"IF(F16=1,COUNTIF($F$3:F16,1),\"\")","v":14},{"$f":"IFERROR(INDEX(DropDown!$E$3:$E$183,MATCH(ROWS($G$3:G16),$G$3:$G$183,0)),\"\")","v":"Capital Acquisition Costs"}]
[null,null,null,null,"Civic Activities",{"$f":"--ISNUMBER(IFERROR(SEARCH('Functional Expense Line Lookup'!$B$6,DropDown!E17,1),\"\"))","v":1},{"$f":"IF(F17=1,COUNTIF($F$3:F17,1),\"\")","v":15},{"$f":"IFERROR(INDEX(DropDown!$E$3:$E$183,MATCH(ROWS($G$3:G17),$G$3:$G$183,0)),\"\")","v":"Civic Activities"}]
[null,null,null,null,"Closing Costs (Facility)",{"$f":"--ISNUMBER(IFERROR(SEARCH('Functional Expense Line Lookup'!$B$6,DropDown!E18,1),\"\"))","v":1},{"$f":"IF(F18=1,COUNTIF($F$3:F18,1),\"\")","v":16},{"$f":"IFERROR(INDEX(DropDown!$E$3:$E$183,MATCH(ROWS($G$3:G18),$G$3:$G$183,0)),\"\")","v":"Closing Costs (Facility)"}]
[null,null,null,null,"Community Service Activities",{"$f":"--ISNUMBER(IFERROR(SEARCH('Functional Expense Line Lookup'!$B$6,DropDown!E19,1),\"\"))","v":1},{"$f":"IF(F19=1,COUNTIF($F$3:F19,1),\"\")","v":17},{"$f":"IFERROR(INDEX(DropDown!$E$3:$E$183,MATCH(ROWS($G$3:G19),$G$3:$G$183,0)),\"\")","v":"Community Service Activities"}]
[null,null,null,null,"Community Service Activities",{"$f":"--ISNUMBER(IFERROR(SEARCH('Functional Expense Line Lookup'!$B$6,DropDown!E20,1),\"\"))","v":1},{"$f":"IF(F20=1,COUNTIF($F$3:F20,1),\"\")","v":18},{"$f":"IFERROR(INDEX(DropDown!$E$3:$E$183,MATCH(ROWS($G$3:G20),$G$3:$G$183,0)),\"\")","v":"Community Service Activities"}]
[null,null,null,null,"Computers for Classroom",{"$f":"--ISNUMBER(IFERROR(SEARCH('Functional Expense Line Lookup'!$B$6,DropDown!E21,1),\"\"))","v":1},{"$f":"IF(F21=1,COUNTIF($F$3:F21,1),\"\")","v":19},{"$f":"IFERROR(INDEX(DropDown!$E$3:$E$183,MATCH(ROWS($G$3:G21),$G$3:$G$183,0)),\"\")","v":"Computers for Classroom"}]
[null,null,null,null,"Computers for Library and Media Center",{"$f":"--ISNUMBER(IFERROR(SEARCH('Functional Expense Line Lookup'!$B$6,DropDown!E22,1),\"\"))","v":1},{"$f":"IF(F22=1,COUNTIF($F$3:F22,1),\"\")","v":20},{"$f":"IFERROR(INDEX(DropDown!$E$3:$E$183,MATCH(ROWS($G$3:G22),$G$3:$G$183,0)),\"\")","v":"Computers for Library and Media Center"}]
[null,null,null,null,"Computers: Administration (less then $5K each)",{"$f":"--ISNUMBER(IFERROR(SEARCH('Functional Expense Line Lookup'!$B$6,DropDown!E23,1),\"\"))","v":1},{"$f":"IF(F23=1,COUNTIF($F$3:F23,1),\"\")","v":21},{"$f":"IFERROR(INDEX(DropDown!$E$3:$E$183,MATCH(ROWS($G$3:G23),$G$3:$G$183,0)),\"\")","v":"Computers: Administration (less then $5K each)"}]
[null,null,null,null,"Contracted Services: Administration: Business",{"$f":"--ISNUMBER(IFERROR(SEARCH('Functional Expense Line Lookup'!$B$6,DropDown!E24,1),\"\"))","v":1},{"$f":"IF(F24=1,COUNTIF($F$3:F24,1),\"\")","v":22},{"$f":"IFERROR(INDEX(DropDown!$E$3:$E$183,MATCH(ROWS($G$3:G24),$G$3:$G$183,0)),\"\")","v":"Contracted Services: Administration: Business"}]
[null,null,null,null,"Contracted Services: Administration: Enrollment",{"$f":"--ISNUMBER(IFERROR(SEARCH('Functional Expense Line Lookup'!$B$6,DropDown!E25,1),\"\"))","v":1},{"$f":"IF(F25=1,COUNTIF($F$3:F25,1),\"\")","v":23},{"$f":"IFERROR(INDEX(DropDown!$E$3:$E$183,MATCH(ROWS($G$3:G25),$G$3:$G$183,0)),\"\")","v":"Contracted Services: Administration: Enrollment"}]
[null,null,null,null,"Contracted Services: Administration: Executive Director",{"$f":"--ISNUMBER(IFERROR(SEARCH('Functional Expense Line Lookup'!$B$6,DropDown!E26,1),\"\"))","v":1},{"$f":"IF(F26=1,COUNTIF($F$3:F26,1),\"\")","v":24},{"$f":"IFERROR(INDEX(DropDown!$E$3:$E$183,MATCH(ROWS($G$3:G26),$G$3:$G$183,0)),\"\")","v":"Contracted Services: Administration: Executive Director"}]
[null,null,null,null,"Contracted Services: Administration: Finance",{"$f":"--ISNUMBER(IFERROR(SEARCH('Functional Expense Line Lookup'!$B$6,DropDown!E27,1),\"\"))","v":1},{"$f":"IF(F27=1,COUNTIF($F$3:F27,1),\"\")","v":25},{"$f":"IFERROR(INDEX(DropDown!$E$3:$E$183,MATCH(ROWS($G$3:G27),$G$3:$G$183,0)),\"\")","v":"Contracted Services: Administration: Finance"}]
[null,null,null,null,"Contracted Services: Administration: Information Technology",{"$f":"--ISNUMBER(IFERROR(SEARCH('Functional Expense Line Lookup'!$B$6,DropDown!E28,1),\"\"))","v":1},{"$f":"IF(F28=1,COUNTIF($F$3:F28,1),\"\")","v":26},{"$f":"IFERROR(INDEX(DropDown!$E$3:$E$183,MATCH(ROWS($G$3:G28),$G$3:$G$183,0)),\"\")","v":"Contracted Services: Administration: Information Technology"}]
[null,null,null,null,"Contracted Services: Administration: Legal",{"$f":"--ISNUMBER(IFERROR(SEARCH('Functional Expense Line Lookup'!$B$6,DropDown!E29,1),\"\"))","v":1},{"$f":"IF(F29=1,COUNTIF($F$3:F29,1),\"\")","v":27},{"$f":"IFERROR(INDEX(DropDown!$E$3:$E$183,MATCH(ROWS($G$3:G29),$G$3:$G$183,0)),\"\")","v":"Contracted Services: Administration: Legal"}]
[null,null,null,null,"Contracted Services: Administration: Recruitment",{"$f":"--ISNUMBER(IFERROR(SEARCH('Functional Expense Line Lookup'!$B$6,DropDown!E30,1),\"\"))","v":1},{"$f":"IF(F30=1,COUNTIF($F$3:F30,1),\"\")","v":28},{"$f":"IFERROR(INDEX(DropDown!$E$3:$E$183,MATCH(ROWS($G$3:G30),$G$3:$G$183,0)),\"\")","v":"Contracted Services: Administration: Recruitment"}]
{"$rows_left_out":154}
{"sheet":"Data","index":3,"n_rows":183,"n_cols":6,"rows_kept":183,"cut":false,"hidden":true,"merged":[]}
[]
["Topic/Expense (alphabetical)","Best Line Item","Contact Phone","Contact Name","Contact e-mail","Links to Guidance"]
["Administration: Copier lease",125,"781-338-3221","Joanna Laghetto","jlaghetto@doe.mass.edu","http://www.doe.mass.edu/charter/finance/revexp/"]
["401K Employee",510,"781-338-3221","Joanna Laghetto","jlaghetto@doe.mass.edu","http://www.doe.mass.edu/charter/finance/revexp/"]
["403B Employee",510,"781-338-3221","Joanna Laghetto","jlaghetto@doe.mass.edu","http://www.doe.mass.edu/charter/finance/revexp/"]
["Advertising",124,"781-338-3221","Joanna Laghetto","jlaghetto@doe.mass.edu","http://www.doe.mass.edu/charter/finance/revexp/"]
["Architect for Facilities",730,"781-338-3221","Joanna Laghetto","jlaghetto@doe.mass.edu","http://www.doe.mass.edu/charter/finance/revexp/"]
["Asset Disposal",760,"781-338-3221","Joanna Laghetto","jlaghetto@doe.mass.edu","http://www.doe.mass.edu/charter/finance/revexp/"]
["Asset Loss",760,"781-338-3221","Joanna Laghetto","jlaghetto@doe.mass.edu","http://www.doe.mass.edu/charter/finance/revexp/"]
["Assistant Principal",211,"781-338-3221","Joanna Laghetto","jlaghetto@doe.mass.edu","http://www.doe.mass.edu/charter/finance/revexp/"]
["Auditor","122a","781-338-3221","Joanna Laghetto","jlaghetto@doe.mass.edu","http://www.doe.mass.edu/charter/finance/revexp/"]
["Bad Debt",760,"781-338-3221","Joanna Laghetto","jlaghetto@doe.mass.edu","http://www.doe.mass.edu/charter/finance/revexp/"]
["Blackboard Software","268a","781-338-3221","Joanna Laghetto","jlaghetto@doe.mass.edu","http://www.doe.mass.edu/charter/finance/revexp/"]
["Blended Learning",265,"781-338-3221","Joanna Laghetto","jlaghetto@doe.mass.edu","http://www.doe.mass.edu/charter/finance/revexp/"]
["Building Lease",740,"781-338-3221","Joanna Laghetto","jlaghetto@doe.mass.edu","http://www.doe.mass.edu/charter/finance/revexp/"]
["Capital Acquisition Costs",730,"781-338-3221","Joanna Laghetto","jlaghetto@doe.mass.edu","http://www.doe.mass.edu/charter/finance/revexp/"]
["Civic Activities",620,"781-338-3221","Joanna Laghetto","jlaghetto@doe.mass.edu","http://www.doe.mass.edu/charter/finance/revexp/"]
["Closing Costs (Facility)",730,"781-338-3221","Joanna Laghetto","jlaghetto@doe.mass.edu","http://www.doe.mass.edu/charter/finance/revexp/"]
["Community Service Activities",620,"781-338-3221","Joanna Laghetto","jlaghetto@doe.mass.edu","http://www.doe.mass.edu/charter/finance/revexp/"]
["Community Service Activities",620,"781-338-3221","Joanna Laghetto","jlaghetto@doe.mass.edu","http://www.doe.mass.edu/charter/finance/revexp/"]
["Computers for Classroom",266,"781-338-3221","Joanna Laghetto","jlaghetto@doe.mass.edu","http://www.doe.mass.edu/charter/finance/revexp/"]
["Computers for Library and Media Center",267,"781-338-3221","Joanna Laghetto","jlaghetto@doe.mass.edu","http://www.doe.mass.edu/charter/finance/revexp/"]
["Computers: Administration (less then $5K each)",125,"781-338-3221","Joanna Laghetto","jlaghetto@doe.mass.edu","http://www.doe.mass.edu/charter/finance/revexp/"]
["Contracted Services: Administration: Business","122a","781-338-3221","Joanna Laghetto","jlaghetto@doe.mass.edu","http://www.doe.mass.edu/charter/finance/revexp/"]
["Contracted Services: Administration: Enrollment","122a","781-338-3221","Joanna Laghetto","jlaghetto@doe.mass.edu","http://www.doe.mass.edu/charter/finance/revexp/"]
["Contracted Services: Administration: Executive Director","122a","781-338-3221","Joanna Laghetto","jlaghetto@doe.mass.edu","http://www.doe.mass.edu/charter/finance/revexp/"]
["Contracted Services: Administration: Finance","122a","781-338-3221","Joanna Laghetto","jlaghetto@doe.mass.edu","http://www.doe.mass.edu/charter/finance/revexp/"]
["Contracted Services: Administration: Information Technology","122a","781-338-3221","Joanna Laghetto","jlaghetto@doe.mass.edu","http://www.doe.mass.edu/charter/finance/revexp/"]
["Contracted Services: Administration: Legal","122a","781-338-3221","Joanna Laghetto","jlaghetto@doe.mass.edu","http://www.doe.mass.edu/charter/finance/revexp/"]
["Contracted Services: Administration: Recruitment","122a","781-338-3221","Joanna Laghetto","jlaghetto@doe.mass.edu","http://www.doe.mass.edu/charter/finance/revexp/"]
{"$rows_left_out":153}