{"text_format":"1","workbook":"xlsx","n_sheets":2,"sheets":["District","LEA"],"not_rendered":{"charts":0,"images":0,"macros":1,"external_links":0,"defined_names":1,"comments":0,"pivot_tables":0},"unopened":[],"bounds":{"document_bytes":16777216,"sheet_cells":100000,"rows_first":2000,"rows_last":500,"rows_between":2000,"halvings":0,"cell_chars":16384,"cell_head_chars":4096},"cells_cut":0,"cells_raw":0,"read":"whole","date_system":"1900"}

{"sheet":"District","index":0,"n_rows":4370,"n_cols":11,"rows_kept":4370,"cut":false,"hidden":false,"merged":[[2,0,2,10],[3,0,3,10],[5,1,5,10]]}
["2019-10-04"]
[]
["Massachusetts Department of Elementary and Secondary Education"]
["FY19 Grants Reported on End of Year Financial Report"]
[1]
[1,{"$f":"VLOOKUP(A7,LEA!C2:D557,2,FALSE)","v":"Abington"}]
[{"$f":"VLOOKUP(A6,LEA!B2:E557,2,FALSE)","v":1}]
[]
["LEA","District","Type","Appr. No.","Project No.","Grant Name","Regular Day","Special Education","Occupational Day","Undistributed","Adult \nEducation"]
[1,"Abington","Federal","7043-2001","140-147769-2018-0001","Teacher Quality",0,0,0,247,0]
[1,"Abington","Federal","7043-2001","140-211990-2019-0001","Teacher Quality",0,0,0,49694,0]
[1,"Abington","Federal","7043-7001","240-211992-2019-0001","Sped 94-142 Allocation",0,532954,0,0,0]
[1,"Abington","Federal","7043-7002","262-225037-2019-0001","Sped Early Childh'd Alloc",0,9744,0,0,0]
[1,"Abington","Federal","7043-1001","305-147771-2018-0001","Title I Distribution",1698,0,0,0,0]
[1,"Abington","Federal","7043-1001","305-212626-2019-0001","Title I Distribution",215738,0,0,0,0]
[1,"Abington","Federal","7043-4004","309-237943-2019-0001","Student Support and Academic Enrichment Grant",0,0,0,16140,0]
[1,"Abington","District Total",null,null,null,{"$f":"SUBTOTAL(9,G10:G16)","v":217436},{"$f":"SUBTOTAL(9,H10:H16)","v":542698},{"$f":"SUBTOTAL(9,I10:I16)","v":0},{"$f":"SUBTOTAL(9,J10:J16)","v":66081},{"$f":"SUBTOTAL(9,K10:K16)","v":0}]
[3,"Acushnet","Federal","7043-2001","140-155263-2018-0003","Teacher Quality",0,0,0,1050,0]
[3,"Acushnet","Federal","7043-2001","140-209595-2019-0003","Teacher Quality",0,0,0,14530,0]
[3,"Acushnet","Federal","7043-7001","240-146828-2018-0003","Sped 94-142 Allocation",0,32681,0,0,0]
[3,"Acushnet","Federal","7043-7001","240-209589-2019-0003","Sped 94-142 Allocation",0,222283,0,0,0]
[3,"Acushnet","Federal","7043-7002","262-209584-2019-0003","Sped Early Childh'd Alloc",0,6598,0,0,0]
[3,"Acushnet","Federal","7043-1001","305-155214-2018-0003","Title I Distribution",242,0,0,0,0]
[3,"Acushnet","Federal","7043-1001","305-209597-2019-0003","Title I Distribution",66431,0,0,0,0]
[3,"Acushnet","Federal","7043-4004","309-239190-2019-0003","Student Support and Academic Enrichment Grant",0,0,0,5404,0]
[3,"Acushnet","District Total",null,null,null,{"$f":"SUBTOTAL(9,G18:G25)","v":66673},{"$f":"SUBTOTAL(9,H18:H25)","v":261562},{"$f":"SUBTOTAL(9,I18:I25)","v":0},{"$f":"SUBTOTAL(9,J18:J25)","v":20984},{"$f":"SUBTOTAL(9,K18:K25)","v":0}]
[5,"Agawam","Federal","7043-2001","140-153661-2018-0005","Teacher Quality",0,0,0,39366,0]
[5,"Agawam","Federal","7043-2001","140-239184-2019-0005","Teacher Quality",0,0,0,37356,0]
[5,"Agawam","Federal","7043-3001","180-153662-2018-0005","LEP Support",0,0,0,19959,0]
[5,"Agawam","Federal","7043-3001","180-239185-2019-0005","LEP Support",0,0,0,3002,0]
[5,"Agawam","Federal","7043-7001","240-147671-2018-0005","Sped 94-142 Allocation",0,209842,0,0,0]
[5,"Agawam","Federal","7043-7001","240-224869-2019-0005","Sped 94-142 Allocation",0,874139,0,0,0]
[5,"Agawam","Federal","7043-7002","262-210256-2019-0005","Sped Early Childh'd Alloc",0,47467,0,0,0]
[5,"Agawam","Federal","7043-1001","305-153660-2018-0005","Title I Distribution",55633,0,0,0,0]
[5,"Agawam","Federal","7043-1001","305-224915-2019-0005","Title I Distribution",399765,0,0,0,0]
[5,"Agawam","Federal","7043-4004","309-153663-2018-0005","Student Support and Academic Enrichment Grant",0,0,0,7636,0]
[5,"Agawam","Federal","7043-4004","309-239186-2019-0005","Student Support and Academic Enrichment Grant",0,0,0,13470,0]
[5,"Agawam","State","7061-9612","335-280632-2019-0005","Safe Supportive School Action Plans",0,0,0,20000,0]
[5,"Agawam","State","7061-0010","336-287202-2019-0005","Safe and Supportive Schools MH",0,0,0,8000,0]
[5,"Agawam","State","7061-0011","USVI 00005","USVI",0,0,0,4375.76,0]
[5,"Agawam","District Total",null,null,null,{"$f":"SUBTOTAL(9,G27:G40)","v":455398},{"$f":"SUBTOTAL(9,H27:H40)","v":1131448},{"$f":"SUBTOTAL(9,I27:I40)","v":0},{"$f":"SUBTOTAL(9,J27:J40)","v":153164.76},{"$f":"SUBTOTAL(9,K27:K40)","v":0}]
[7,"Amesbury","Federal","7043-2001","140-152071-2018-0007","Teacher Quality",0,0,0,372,0]
[7,"Amesbury","Federal","7043-2001","140-234301-2019-0007","Teacher Quality",0,0,0,57216,0]
[7,"Amesbury","State","7061-9408","222-280572-2019-0007","Expanding Learning Time",0,0,0,10000,0]
[7,"Amesbury","Federal","7043-7001","240-234304-2019-0007","Sped 94-142 Allocation",0,610157,0,0,0]
[7,"Amesbury","Federal","7043-7002","262-256240-2019-0007","Sped Early Childh'd Alloc",0,19595,0,0,0]
[7,"Amesbury","Federal","7043-1001","305-104573-2017-0007","Title I Distribution",136,0,0,0,0]
[7,"Amesbury","Federal","7043-1001","305-150251-2018-0007","Title I Distribution",1973,0,0,0,0]
[7,"Amesbury","Federal","7043-1001","305-234299-2019-0007","Title I Distribution",252661,0,0,0,0]
[7,"Amesbury","Federal","7043-4004","309-234302-2019-0007","Student Support and Academic Enrichment Grant",0,0,0,18713,0]
[7,"Amesbury","State","7061-0010","336-287348-2019-0007","Safe and Supportive Schools MH",0,0,0,5050,0]
[7,"Amesbury","District Total",null,null,null,{"$f":"SUBTOTAL(9,G42:G51)","v":254770},{"$f":"SUBTOTAL(9,H42:H51)","v":629752},{"$f":"SUBTOTAL(9,I42:I51)","v":0},{"$f":"SUBTOTAL(9,J42:J51)","v":91351},{"$f":"SUBTOTAL(9,K42:K51)","v":0}]
[8,"Amherst","Federal","7043-2001","140-159771-2018-0008","Teacher Quality",0,0,0,16823,0]
[8,"Amherst","Federal","7043-2001","140-225059-2019-0008","Teacher Quality",0,0,0,32389,0]
[8,"Amherst","Federal","7043-3001","180-162109-2018-0008","LEP Support",0,0,0,25934,0]
[8,"Amherst","Federal","7043-3001","180-225060-2019-0008","LEP Support",0,0,0,5655,0]
[8,"Amherst","State","7027-1004","187-284656-2019-0008","Bilingual Education Programs",0,0,0,262000,0]
[8,"Amherst","State","7061-9408","218-286552-2019-0008","Quality Instruction Summer Planning",0,0,0,9478,0]
[8,"Amherst","Federal","7043-7002","262-265606-2019-0008","Sped Early Childh'd Alloc",0,17332,0,0,0]
[8,"Amherst","Federal","7043-7002","298-280628-2019-0008","E.C. Learning Together",0,7000,0,0,0]
[8,"Amherst","Federal","7043-1001","305-159772-2018-0008","Title I Distribution",106093,0,0,0,0]
[8,"Amherst","Federal","7043-1001","305-225061-2019-0008","Title I Distribution",374054,0,0,0,0]
[8,"Amherst","Federal","7043-4004","309-162090-2018-0008","Student Support and Academic Enrichment Grant",0,0,0,2429,0]
[8,"Amherst","Federal","7043-4004","309-225062-2019-0008","Student Support and Academic Enrichment Grant",0,0,0,10318,0]
[8,"Amherst","Federal","7045-6300","312-278796-2019-0008","Emergency Impact Aid for Displaced Students",0,0,0,20048,0]
[8,"Amherst","State","7061-0011","USVI 00008","USVI",0,0,0,4691.83,0]
[8,"Amherst","District Total",null,null,null,{"$f":"SUBTOTAL(9,G53:G66)","v":480147},{"$f":"SUBTOTAL(9,H53:H66)","v":24332},{"$f":"SUBTOTAL(9,I53:I66)","v":0},{"$f":"SUBTOTAL(9,J53:J66)","v":389765.83},{"$f":"SUBTOTAL(9,K53:K66)","v":0}]
[9,"Andover","Federal","7048-9200","110-269476-2019-0009","NGA Program",0,0,0,23750,0]
[9,"Andover","Federal","7043-2001","140-141355-2018-0009","Teacher Quality",0,0,0,12159,0]
[9,"Andover","Federal","7043-2001","140-218897-2019-0009","Teacher Quality",0,0,0,93366,0]
[9,"Andover","Federal","7043-3001","180-147759-2018-0009","LEP Support",0,0,0,32383,0]
[9,"Andover","Federal","7043-3001","180-218898-2019-0009","LEP Support",0,0,0,8723,0]
[9,"Andover","Federal","7043-7001","240-146830-2018-0009","Sped 94-142 Allocation",0,65035,0,0,0]
[9,"Andover","Federal","7043-7001","240-239251-2019-0009","Sped 94-142 Allocation",0,1329273,0,0,0]
[9,"Andover","Federal","7043-7002","262-239260-2019-0009","Sped Early Childh'd Alloc",0,19886,0,0,0]
[9,"Andover","Federal","7043-1001","305-141361-2018-0009","Title I Distribution",33581,0,0,0,0]
[9,"Andover","Federal","7043-1001","305-218899-2019-0009","Title I Distribution",183103,0,0,0,0]
[9,"Andover","Federal","7043-4004","309-218900-2019-0009","Student Support and Academic Enrichment Grant",0,0,0,13977,0]
[9,"Andover","Federal","7045-6300","312-235715-2019-0009","Emergency Impact Aid for Displaced Students",0,0,0,11633,0]
[9,"Andover","State","7061-0011","USVI 00009","USVI",0,0,0,1555.76,0]
[9,"Andover","District Total",null,null,null,{"$f":"SUBTOTAL(9,G68:G80)","v":216684},{"$f":"SUBTOTAL(9,H68:H80)","v":1414194},{"$f":"SUBTOTAL(9,I68:I80)","v":0},{"$f":"SUBTOTAL(9,J68:J80)","v":197546.76},{"$f":"SUBTOTAL(9,K68:K80)","v":0}]
[10,"Arlington","Federal","7043-2001","140-144290-2018-0010","Teacher Quality",0,0,0,21566,0]
[10,"Arlington","Federal","7043-2001","140-208902-2019-0010","Teacher Quality",0,0,0,61721,0]
[10,"Arlington","Federal","7043-3001","180-145559-2018-0010","LEP Support",0,0,0,34925,0]
[10,"Arlington","Federal","7043-3001","180-208904-2019-0010","LEP Support",0,0,0,6755,0]
[10,"Arlington","Federal","7043-7001","240-146535-2018-0010","Sped 94-142 Allocation",0,92399,0,0,0]
[10,"Arlington","Federal","7043-7001","240-215772-2019-0010","Sped 94-142 Allocation",0,1292103,0,0,0]
[10,"Arlington","Federal","7043-7002","262-210055-2019-0010","Sped Early Childh'd Alloc",0,37818,0,0,0]
[10,"Arlington","Federal","7043-7002","298-284508-2019-0010","E.C. Learning Together",0,7000,0,0,0]
[10,"Arlington","Federal","7043-1001","305-139254-2018-0010","Title I Distribution",52612,0,0,0,0]
[10,"Arlington","Federal","7043-1001","305-208903-2019-0010","Title I Distribution",154594,0,0,0,0]
[10,"Arlington","Federal","7043-4004","309-146503-2018-0010","Student Support and Academic Enrichment Grant",0,0,0,2471,0]
[10,"Arlington","Federal","7043-4004","309-208905-2019-0010","Student Support and Academic Enrichment Grant",0,0,0,13362,0]
[10,"Arlington","Federal","7045-6300","312-237958-2019-0010","Emergency Impact Aid for Displaced Students",0,0,0,15964,0]
[10,"Arlington","State","7010-0012","317-207650-2019-0010","Racial Imbalance (Metco)",0,0,0,489063,0]
[10,"Arlington","State","7061-9612","335-207667-2019-0010","Safe Supportive School Action Plans",0,0,0,1000,0]
[10,"Arlington","State","7061-9612","335-281168-2019-0010","Safe Supportive School Action Plans",0,0,0,10000,0]
[10,"Arlington","State","7061-0011","USVI 000010","USVI",0,0,0,1733.74,0]
[10,"Arlington","District Total",null,null,null,{"$f":"SUBTOTAL(9,G82:G98)","v":207206},{"$f":"SUBTOTAL(9,H82:H98)","v":1429320},{"$f":"SUBTOTAL(9,I82:I98)","v":0},{"$f":"SUBTOTAL(9,J82:J98)","v":658560.74},{"$f":"SUBTOTAL(9,K82:K98)","v":0}]
[14,"Ashland","Federal","7043-2001","140-141365-2018-0014","Teacher Quality",0,0,0,11434,0]
[14,"Ashland","Federal","7043-2001","140-212660-2019-0014","Teacher Quality",0,0,0,33883,0]
[14,"Ashland","Federal","7043-3001","180-095235-2017-0014","LEP Support",0,0,0,3038,0]
[14,"Ashland","Federal","7043-3001","180-145593-2018-0014","LEP Support",0,0,0,10683,0]
[14,"Ashland","Federal","7043-3001","180-212661-2019-0014","LEP Support",0,0,0,4913,0]
[14,"Ashland","State","7010-0005","192-217151-2019-0014","Special Distr. Support",0,0,0,300000,0]
[14,"Ashland","Federal","7043-7001","240-144315-2018-0014","Sped 94-142 Allocation",0,74687,0,0,0]
[14,"Ashland","Federal","7043-7001","240-215664-2019-0014","Sped 94-142 Allocation",0,462172,0,0,0]
[14,"Ashland","Federal","7043-7002","262-217070-2019-0014","Sped Early Childh'd Alloc",0,10300,0,0,0]
[14,"Ashland","Federal","7043-1001","305-141353-2018-0014","Title I Distribution",25000,0,0,0,0]
[14,"Ashland","Federal","7043-1001","305-212659-2019-0014","Title I Distribution",77480,0,0,0,0]
[14,"Ashland","Federal","7043-4004","309-212662-2019-0014","Student Support and Academic Enrichment Grant",0,0,0,10893,0]
[14,"Ashland","District Total",null,null,null,{"$f":"SUBTOTAL(9,G100:G111)","v":102480},{"$f":"SUBTOTAL(9,H100:H111)","v":547159},{"$f":"SUBTOTAL(9,I100:I111)","v":0},{"$f":"SUBTOTAL(9,J100:J111)","v":374844},{"$f":"SUBTOTAL(9,K100:K111)","v":0}]
[16,"Attleboro","Federal","7043-2001","140-094139-2017-0016","Teacher Quality",0,0,0,7584,0]
[16,"Attleboro","Federal","7043-2001","140-142740-2018-0016","Teacher Quality",0,0,0,895,0]
[16,"Attleboro","Federal","7043-2001","140-211971-2019-0016","Teacher Quality",0,0,0,178378,0]
[16,"Attleboro","Federal","7043-3001","180-145547-2018-0016","LEP Support",0,0,0,38426,0]
[16,"Attleboro","Federal","7043-3001","180-211988-2019-0016","LEP Support",0,0,0,6346,0]
[16,"Attleboro","State","7061-9408","222-281142-2019-0016","Expanding Learning Time",0,0,0,10000,0]
[16,"Attleboro","Federal","7043-7001","240-153671-2018-0016","Sped 94-142 Allocation",0,149988,0,0,0]
[16,"Attleboro","Federal","7043-7001","240-217688-2019-0016","Sped 94-142 Allocation",0,1395657,0,0,0]
{"$rows_left_out":4251}
{"sheet":"LEA","index":1,"n_rows":557,"n_cols":5,"rows_kept":557,"cut":false,"hidden":false,"merged":[]}
["org4code","order","lea_num","lea_name","dropdown_name"]
["0001",1,1,"Abington","1 Abington"]
["0002",2,2,"Acton","2 Acton"]
["0003",3,3,"Acushnet","3 Acushnet"]
["0004",4,4,"Adams","4 Adams"]
["0005",5,5,"Agawam","5 Agawam"]
["0006",6,6,"Alford","6 Alford"]
["0007",7,7,"Amesbury","7 Amesbury"]
["0008",8,8,"Amherst","8 Amherst"]
["0009",9,9,"Andover","9 Andover"]
["0010",10,10,"Arlington","10 Arlington"]
["0011",11,11,"Ashburnham","11 Ashburnham"]
["0012",12,12,"Ashby","12 Ashby"]
["0013",13,13,"Ashfield","13 Ashfield"]
["0014",14,14,"Ashland","14 Ashland"]
["0015",15,15,"Athol","15 Athol"]
["0016",16,16,"Attleboro","16 Attleboro"]
["0017",17,17,"Auburn","17 Auburn"]
["0018",18,18,"Avon","18 Avon"]
["0019",19,19,"Ayer","19 Ayer"]
["0020",20,20,"Barnstable","20 Barnstable"]
["0021",21,21,"Barre","21 Barre"]
["0022",22,22,"Becket","22 Becket"]
["0023",23,23,"Bedford","23 Bedford"]
["0024",24,24,"Belchertown","24 Belchertown"]
["0025",25,25,"Bellingham","25 Bellingham"]
["0026",26,26,"Belmont","26 Belmont"]
["0027",27,27,"Berkley","27 Berkley"]
["0028",28,28,"Berlin","28 Berlin"]
["0029",29,29,"Bernardston","29 Bernardston"]
["0030",30,30,"Beverly","30 Beverly"]
["0031",31,31,"Billerica","31 Billerica"]
["0032",32,32,"Blackstone","32 Blackstone"]
["0033",33,33,"Blandford","33 Blandford"]
["0034",34,34,"Bolton","34 Bolton"]
["0035",35,35,"Boston","35 Boston"]
["0036",36,36,"Bourne","36 Bourne"]
["0037",37,37,"Boxborough","37 Boxborough"]
["0038",38,38,"Boxford","38 Boxford"]
["0039",39,39,"Boylston","39 Boylston"]
["0040",40,40,"Braintree","40 Braintree"]
["0041",41,41,"Brewster","41 Brewster"]
["0042",42,42,"Bridgewater","42 Bridgewater"]
["0043",43,43,"Brimfield","43 Brimfield"]
["0044",44,44,"Brockton","44 Brockton"]
["0045",45,45,"Brookfield","45 Brookfield"]
["0046",46,46,"Brookline","46 Brookline"]
["0047",47,47,"Buckland","47 Buckland"]
["0048",48,48,"Burlington","48 Burlington"]
["0049",49,49,"Cambridge","49 Cambridge"]
["0050",50,50,"Canton","50 Canton"]
["0051",51,51,"Carlisle","51 Carlisle"]
["0052",52,52,"Carver","52 Carver"]
["0053",53,53,"Charlemont","53 Charlemont"]
["0054",54,54,"Charlton","54 Charlton"]
["0055",55,55,"Chatham","55 Chatham"]
["0056",56,56,"Chelmsford","56 Chelmsford"]
["0057",57,57,"Chelsea","57 Chelsea"]
["0058",58,58,"Cheshire","58 Cheshire"]
["0059",59,59,"Chester","59 Chester"]
["0060",60,60,"Chesterfield","60 Chesterfield"]
["0061",61,61,"Chicopee","61 Chicopee"]
["0062",62,62,"Chilmark","62 Chilmark"]
["0063",63,63,"Clarksburg","63 Clarksburg"]
["0064",64,64,"Clinton","64 Clinton"]
["0065",65,65,"Cohasset","65 Cohasset"]
["0066",66,66,"Colrain","66 Colrain"]
["0067",67,67,"Concord","67 Concord"]
["0068",68,68,"Conway","68 Conway"]
["0069",69,69,"Cummington","69 Cummington"]
["0070",70,70,"Dalton","70 Dalton"]
["0071",71,71,"Danvers","71 Danvers"]
["0072",72,72,"Dartmouth","72 Dartmouth"]
["0073",73,73,"Dedham","73 Dedham"]
["0074",74,74,"Deerfield","74 Deerfield"]
["0075",75,75,"Dennis","75 Dennis"]
["0076",76,76,"Dighton","76 Dighton"]
["0077",77,77,"Douglas","77 Douglas"]
["0078",78,78,"Dover","78 Dover"]
["0079",79,79,"Dracut","79 Dracut"]
["0080",80,80,"Dudley","80 Dudley"]
["0081",81,81,"Dunstable","81 Dunstable"]
["0082",82,82,"Duxbury","82 Duxbury"]
["0083",83,83,"East Bridgewater","83 East Bridgewater"]
["0084",84,84,"East Brookfield","84 East Brookfield"]
["0085",85,85,"Eastham","85 Eastham"]
["0086",86,86,"Easthampton","86 Easthampton"]
["0087",87,87,"East Longmeadow","87 East Longmeadow"]
["0088",88,88,"Easton","88 Easton"]
["0089",89,89,"Edgartown","89 Edgartown"]
["0090",90,90,"Egremont","90 Egremont"]
["0091",91,91,"Erving","91 Erving"]
["0092",92,92,"Essex","92 Essex"]
["0093",93,93,"Everett","93 Everett"]
["0094",94,94,"Fairhaven","94 Fairhaven"]
["0095",95,95,"Fall River","95 Fall River"]
["0096",96,96,"Falmouth","96 Falmouth"]
["0097",97,97,"Fitchburg","97 Fitchburg"]
["0098",98,98,"Florida","98 Florida"]
["0099",99,99,"Foxborough","99 Foxborough"]
["0100",100,100,"Framingham","100 Framingham"]
["0101",101,101,"Franklin","101 Franklin"]
["0102",102,102,"Freetown","102 Freetown"]
["0103",103,103,"Gardner","103 Gardner"]
["0104",104,104,"Aquinnah","104 Aquinnah"]
["0105",105,105,"Georgetown","105 Georgetown"]
["0106",106,106,"Gill","106 Gill"]
["0107",107,107,"Gloucester","107 Gloucester"]
["0108",108,108,"Goshen","108 Goshen"]
["0109",109,109,"Gosnold","109 Gosnold"]
["0110",110,110,"Grafton","110 Grafton"]
["0111",111,111,"Granby","111 Granby"]
["0112",112,112,"Granville","112 Granville"]
["0113",113,113,"Great Barrington","113 Great Barrington"]
["0114",114,114,"Greenfield","114 Greenfield"]
["0115",115,115,"Groton","115 Groton"]
["0116",116,116,"Groveland","116 Groveland"]
["0117",117,117,"Hadley","117 Hadley"]
["0118",118,118,"Halifax","118 Halifax"]
["0119",119,119,"Hamilton","119 Hamilton"]
{"$rows_left_out":437}