{"text_format":"1","workbook":"xlsx","n_sheets":3,"sheets":["Calendar","data","FY20_sped-prices_combined file"],"not_rendered":{"charts":0,"images":0,"macros":1,"external_links":0,"defined_names":7,"comments":3,"pivot_tables":0},"unopened":[],"bounds":{"document_bytes":16777216,"sheet_cells":100000,"rows_first":2000,"rows_last":500,"rows_between":2000,"halvings":0,"cell_chars":16384,"cell_head_chars":4096},"cells_cut":0,"cells_raw":0,"read":"whole","date_system":"1900"}

{"sheet":"Calendar","index":0,"n_rows":380,"n_cols":35,"rows_kept":380,"cut":false,"hidden":false,"merged":[[2,19,2,25],[33,10,33,16],[33,19,33,25],[5,16,5,17],[6,16,6,17],[24,19,24,25],[7,16,7,17],[12,2,12,26],[10,19,10,25],[24,10,24,16],[15,19,15,25],[8,7,8,10],[15,1,15,7],[33,1,33,7],[24,1,24,7],[15,10,15,16],[62,1,62,7],[42,1,42,7],[42,10,42,16],[55,21,55,25],[56,21,56,25],[51,22,51,23],[58,11,58,16],[61,1,61,26],[55,11,55,16],[58,21,58,25],[57,11,57,16],[42,19,42,25],[57,21,57,25],[54,11,54,16],[56,11,56,16]]}
[null,null,null,null,null,null,"FY2020 - 2021 Private School Calendar"]
[null,"SAVE TO YOUR HARD DRIVE FIRST, DO NOT WORK ON THE WEB! "]
[1,"Program Information: (Select your program code from the dropdown)",null,null,null,null,null,null,null,null,null,null,null,null,null,null,null,null,null,"June 2020"]
[null,null,null,null,null,null,null,null,1,null,null,null,null,null,null,null,null,null,null,"S","M","T","W","T","F","S"]
[null,null,null,null,null,null,null,null,null,null,null,null,null,null,null,null,null,null,null,null,1,2,3,4,5,6,"June 2020"]
[null,"Program Code:",null,null,null,null,null,null,null,null,null,null,"Annual Rate: ",null,null,null,{"$f":"IF($I$6=\"\",\"\",VLOOKUP($I$6,rates,5))","v":""},null,null,7,8,9,10,11,12,13,"Total Days"]
[null,"Private School Name:",null,null,null,null,null,{"$f":"IF($I$6=\"\",\"\",VLOOKUP($I$6,rates,3))","v":""},null,null,null,null,"Daily Rate:",null,null,null,{"$f":"IF($I$6=\"\",\"\",VLOOKUP($I$6,rates,6))","v":""},null,null,14,15,16,17,18,19,20,"IN Session"]
[null,"Program Name:",null,null,null,null,null,{"$f":"IF($I$6=\"\",\"\",VLOOKUP($I$6,rates,4))","v":""},null,null,null,null,"Program Type:",null,null,null,{"$f":"IF($I$6=\"\",\"\",VLOOKUP($I$6,rates,2))","v":""},null,null,21,22,23,24,25,26,27,{"$f":"IF(AND(I6<>\"\",Q8=\"Summer\"),COUNTA(T5:Z10),0)","v":0}]
[null,"OSD Approved Total Days:",null,null,null,null,null,{"$f":"IF($I$6=\"\",\"\",IF(VLOOKUP($I$6,rates,7)=\"\",\"No Calendar\",VLOOKUP($I$6,rates,7)))","v":""},null,null,null,null,null,null,null,null,null,null,null,28,29,30]
[null,null,null,null,null,null,null,null,null," "]
[2,"Calendar Information:",null,null,null,null,null,null,null,null,null,null,null,null,null,null,null,null,null,"Note: For summer programs operating in June 2020 - Delete the dates school is NOT open."]
[null,"A. ","If program operates 365 days, complete Other Information below and proceed to saving the file instructions.",null,null,null,null,null,null,null,null,null,null,null,null,null,null,null,null,null,null,null,null,null,null,null,null,null,null,null,null,null,null,null,{"$f":"IF(W52=AI13,\"\",\"Not Match\")","v":""}]
[null,"B. ","Programs operating less than 365 days, delete dates school is not in session. Complete Other Information and proceed to saving the file instructions below.  (ONLY for those programs operating summer programs starting in June 2020 see \"Note\" above)",null,null,null,null,null,null,null,null,null,null,null,null,null,null,null,null,null,null,null,null,null,null,null,null,null,null,null,null,null,null,"Total Days:",{"$f":"SUM(AI16:AJ381)","v":365}]
[]
[null,null,null,null,null,null,null,null,null,null,null,null,null,null,null,null,null,null,null,null,null,null,null,null,null,null,null,null,null,null,null,"Col","Row",{"$f":"I6","v":0}]
[null,"July 2020",null,null,null,null,null,null,null,null,"August 2020",null,null,null,null,null,null,null,null,"September 2020",null,null,null,null,null,null,null,null,null,null,"2020-07-01","E",18,{"$f":"IF(INDIRECT(AF16&AG16)=\"\",\"\",AE16)","v":"2020-07-01"},{"$f":"IF(AH16=\"\",0,1)","v":1}]
[null,"S","M","T","W","T","F","S",null,null,"S","M","T","W","T","F","S",null,null,"S","M","T","W","T","F","S",null,null,null,null,"2020-07-02","F",18,{"$f":"IF(INDIRECT(AF17&AG17)=\"\",\"\",AE17)","v":"2020-07-02"},{"$f":"IF(AH17=\"\",0,1)","v":1}]
[null,null,null,null,1,2,3,4,null,null,null,null,null,null,null,null,1,null,null,null,null,1,2,3,4,5,null,null,null,null,"2020-07-03","G",18,"2020-07-03",1]
[null,5,6,7,8,9,10,11,"July 2020",null,2,3,4,5,6,7,8,"Aug 2020",null,6,7,8,9,10,11,12,"Sept 2020",null,null,null,"2020-07-04","H",18,"2020-07-04",1]
[null,12,13,14,15,16,17,18,"Total Days",null,9,10,11,12,13,14,15,"Total Days",null,13,14,15,16,17,18,19,"Total Days",null,null,null,"2020-07-05","B",19,"2020-07-05",1]
[null,19,20,21,22,23,24,25,"in Session",null,16,17,18,19,20,21,22,"in Session",null,20,21,22,23,24,25,26,"in Session",null,null,null,"2020-07-06","C",19,"2020-07-06",1]
[null,26,27,28,29,30,31,null,{"$f":"COUNT(B18:H23)","v":31},null,23,24,25,26,27,28,29,{"$f":"COUNT(K18:Q23)","v":31},null,27,28,29,30,null,null,null,{"$f":"COUNT(T18:Z23)","v":30},null,null,null,"2020-07-07","D",19,"2020-07-07",1]
[null,null,null,null,null,null,null,null,null,null,30,31,null,null,null,null,null,null,null,null,null,null,null,null,null,null,null,null,null,null,"2020-07-08","E",19,"2020-07-08",1]
[null,null,null,null,null,null,null,null,null,null,null,null,null,null,null,null,null,null,null,null,null,null,null,null,null,null,null,null,null,null,"2020-07-09","F",19,"2020-07-09",1]
[null,"October 2020",null,null,null,null,null,null,null,null,"November 2020",null,null,null,null,null,null,null,null,"December 2020",null,null,null,null,null,null,null,null,null,null,"2020-07-10","G",19,"2020-07-10",1]
[null,"S","M","T","W","T","F","S",null,null,"S","M","T","W","T","F","S",null,null,"S","M","T","W","T","F","S",null,null,null,null,"2020-07-11","H",19,"2020-07-11",1]
[null,null,null,null,null,1,2,3,null,null,1,2,3,4,5,6,7,null,null,null,null,1,2,3,4,5,null,null,null,null,"2020-07-12","B",20,"2020-07-12",1]
[null,4,5,6,7,8,9,10,"Oct 2020",null,8,9,10,11,12,13,14,"Nov 2020",null,6,7,8,9,10,11,12,"Dec 2020",null,null,null,"2020-07-13","C",20,"2020-07-13",1]
[null,11,12,13,14,15,16,17,"Total Days",null,15,16,17,18,19,20,21,"Total Days",null,13,14,15,16,17,18,19,"Total Days",null,null,null,"2020-07-14","D",20,"2020-07-14",1]
[null,18,19,20,21,22,23,24,"in Session",null,22,23,24,25,26,27,28,"in Session",null,20,21,22,23,24,25,26,"in Session",null,null,null,"2020-07-15","E",20,"2020-07-15",1]
[null,25,26,27,28,29,30,31,{"$f":"COUNT(B27:H32)","v":31},null,29,30,null,null,null,null,null,{"$f":"COUNT(K27:Q32)","v":30},null,27,28,29,30,31,null,null,{"$f":"COUNT(T27:Z32)","v":31},null,null,null,"2020-07-16","F",20,"2020-07-16",1]
[null,null,null,null,null,null,null,null,null,null,null,null,null,null,null,null,null,null,null,null,null,null,null,null,null,null,null,null,null,null,"2020-07-17","G",20,"2020-07-17",1]
[null,null,null,null,null,null,null,null,null,null,null,null,null,null,null,null,null,null,null,null,null,null,null,null,null,null,null,null,null,null,"2020-07-18","H",20,"2020-07-18",1]
[null,"January 2021",null,null,null,null,null,null,null,null,"Feburary 2021",null,null,null,null,null,null,null,null,"March 2021",null,null,null,null,null,null,null,null,null,null,"2020-07-19","B",21,"2020-07-19",1]
[null,"S","M","T","W","T","F","S",null,null,"S","M","T","W","T","F","S",null,null,"S","M","T","W","T","F","S",null,null,null,null,"2020-07-20","C",21,"2020-07-20",1]
[null,null,null,null,null,null,1,2,null,7,null,1,2,3,4,5,6,null,null,null,1,2,3,4,5,6,null,null,null,null,"2020-07-21","D",21,"2020-07-21",1]
[null,3,4,5,6,7,8,9,"Jan 2021",null,7,8,9,10,11,12,13,"Feb 2021",null,7,8,9,10,11,12,13,"Mar 2021",null,null,null,"2020-07-22","E",21,"2020-07-22",1]
[null,10,11,12,13,14,15,16,"Total Days",null,14,15,16,17,18,19,20,"Total Days",null,14,15,16,17,18,19,20,"Total Days",null,null,null,"2020-07-23","F",21,"2020-07-23",1]
[null,17,18,19,20,21,22,23,"in Session",null,21,22,23,24,25,26,27,"in Session",null,21,22,23,24,25,26,27,"in Session",null,null,null,"2020-07-24","G",21,"2020-07-24",1]
[null,24,25,26,27,28,29,30,{"$f":"COUNT(B36:H41)","v":31},null,28,null,null,null,null,null,null,{"$f":"COUNT(K36:Q41)","v":28},null,28,29,30,31,null,null,null,{"$f":"COUNT(T36:Z41)","v":31},null,null,null,"2020-07-25","H",21,"2020-07-25",1]
{"$rows_left_out":341}
{"sheet":"data","index":1,"n_rows":214,"n_cols":16,"rows_kept":214,"cut":false,"hidden":false,"merged":[]}
["Prog_Code","type","School_Name","Prog_Name","Rate_ann","Rate_daily","total_days","start_date","end_date",null,null,null,null,null,"366 annual rate calculation"]
[]
["5017A","Res Ed","Amego","Autistic",248738.27,681.47471232876705,365,null,null,{"$f":"IF(C3<>\"Summer\", \"No\", \"Yes\")","v":"No"},{"$f":"A3& \" - \"&C3 & \" - \"&D3","v":"5017A - Amego - Autistic"}," ",{"$f":"TRIM(A3)","v":"5017A"},null,{"$f":"IF(G3=366,366*F3,)","v":0}," "]
["5017B","Day","Amego","Amego School Day ",124078.452516,523.53777432911397,237,null,null,"No","5017B - Amego - Amego School Day "," ","5017B",null,{"$f":"IF(G4=366,366*F4,)","v":0}]
["5021C","Day","American School for the Deaf","MA Educational/Day",69160,384.22222222222223,180,null,null,"No","5021C - American School for the Deaf - MA Educational/Day"," ","5021C"]
["5021E","Res Ed","American School for the Deaf","MA Educational/Residential",99797,554.42777777777781,180,null,null,"No","5021E - American School for the Deaf - MA Educational/Residential"," ","5021E",null,{"$f":"IF(G6=366,366*F6,)","v":0}]
["5021G","Res Ed","American School for the Deaf","MA PACES 365",489267,1340.4575342465753,365,null,null,"No","5021G - American School for the Deaf - MA PACES 365"," ","5021G",null,{"$f":"IF(G7=366,366*F7,)","v":0}]
["5034A","Res Ed","Archway, Inc.","Archway",181577.39,497.47230136986303,365,null,null,"No","5034A - Archway, Inc. - Archway"," ","5034A",null,{"$f":"IF(G8=366,366*F8,)","v":0}]
["5036A","Day","McLean Hospital, Inc.","Arlington-Academy",74850.929999999993,378.03499999999997,198,null,null,"No","5036A - McLean Hospital, Inc. - Arlington-Academy"," ","5036A"]
["5036I","Day","McLean Hospital, Inc.","CNS",108723.05,503.34745370370371,216,null,null,"No","5036I - McLean Hospital, Inc. - CNS"," ","5036I",null,{"$f":"IF(G10=366,366*F10,)","v":0}]
["5049A","Day","Mass. Found. for Learning Disabilities","White Oak School",49079.43,272.6635,180,null,null,"No","5049A - Mass. Found. for Learning Disabilities - White Oak School"," ","5049A",null,0]
["5088D","Res Ed","Hillcrest Educational Centers, Inc.","Hillcrest",217335.96,595.44098630136989,365,null,null,"No","5088D - Hillcrest Educational Centers, Inc. - Hillcrest"," ","5088D",null,0]
["5088E","Res Ed","Hillcrest Educational Centers, Inc.","Intensive Tx Unit",351937.16,964.21139726027388,365,null,null,"No","5088E - Hillcrest Educational Centers, Inc. - Intensive Tx Unit"," ","5088E",null,0]
["5088F","Day","Hillcrest Educational Centers, Inc.","Housatonic Academy",59681.47,276.30310185185186,216,null,null,"No","5088F - Hillcrest Educational Centers, Inc. - Housatonic Academy"," ","5088F",null,0]
["5088G","Res Ed","Hillcrest Educational Centers, Inc.","Autism Spectrum Disorders",373153.64,1022.3387397260275,365,null,null,"No","5088G - Hillcrest Educational Centers, Inc. - Autism Spectrum Disorders"," ","5088G",null,0]
["5095A","Res Ed","Home for Little Wanderers","Southeast Campus Res.",224962.3,616.33506849315063,365,null,null,"No","5095A - Home for Little Wanderers - Southeast Campus Res."," ","5095A",null,0]
["5095B","Day","Home for Little Wanderers","Southeast Campus Day",75046.880000000005,347.4392592592593,216,null,null,"No","5095B - Home for Little Wanderers - Southeast Campus Day"," ","5095B",null,0]
["5097A","Day","Judge Baker Children's Center, Inc.","Manville",96110.91,533.94950000000006,180,null,null,"No","5097A - Judge Baker Children's Center, Inc. - Manville"," ","5097A",null,0]
["5097B","Summer","Judge Baker Children's Center, Inc.","Manville-Summer",6665.3,333.26499999999999,20,null,null,"No","5097B - Judge Baker Children's Center, Inc. - Manville-Summer"," ","5097B",null,0]
["5110A","Summer","COMPASS, Inc.","Summer",7891.6,328.81666666666666,24,null,null,"No","5110A - COMPASS, Inc. - Summer"," ","5110A",null,0]
["5110B","Day","COMPASS, Inc.","Short Term Crisis",31326.66,174.03700000000001,180,null,null,"No","5110B - COMPASS, Inc. - Short Term Crisis"," ","5110B",null,0]
["5110C","Day","COMPASS, Inc.","766 Day School",74930.59,416.28105555555555,180,null,null,"No","5110C - COMPASS, Inc. - 766 Day School"," ","5110C",null,0]
["5112B","Day","Justice Resource Institute","Bay Cove",80080.83,364.00377272727275,220,null,null,"No","5112B - Justice Resource Institute - Bay Cove"," ","5112B",null,0]
["5113A","Day","New England Pediatric Nursing Home","Pediatric",64458.080000000002,256.80509960159361,251,null,null,"No","5113A - New England Pediatric Nursing Home - Pediatric"," ","5113A",null,0]
["5120A","Res Ed","Judge Rotenberg Educational Center","Judge Rotenberg",277915.18,761.41145205479449,365,null,null,"No","5120A - Judge Rotenberg Educational Center - Judge Rotenberg"," ","5120A",null,0]
["5121A","Res Ed","Bellefaire Jewish  Childrens Bureau","Monarch School",212302.18,581.64980821917811,365,null,null,"No","5121A - Bellefaire Jewish  Childrens Bureau - Monarch School"," ","5121A",null,0]
["5121B","Day","Bellefaire Jewish  Childrens Bureau","Monarch School",85585.72,475.47622222222225,180,null,null,"No","5121B - Bellefaire Jewish  Childrens Bureau - Monarch School"," ","5121B",null,0]
["5127C","Res Ed","Justice Resource Institute","Berkshire Meadows",237166.28,649.77063013698626,365,null,null,"No","5127C - Justice Resource Institute - Berkshire Meadows"," ","5127C",null,0]
["5127D","Day","Justice Resource Institute","Victor School",58982.080000000002,273.06518518518521,216,null,null,"No","5127D - Justice Resource Institute - Victor School"," ","5127D",null,0]
["5134B","Day","Beverly School for the Deaf","BSD",81414.570000000007,399.09102941176474,204,null,null,"No","5134B - Beverly School for the Deaf - BSD"," ","5134B"]
["5134C","Day","Beverly School for the Deaf","Child. Comm. Ctr.",99590.32,488.18784313725496,204,null,null,"No","5134C - Beverly School for the Deaf - Child. Comm. Ctr."," ","5134C"]
["5154A","Day","Boston Higashi School","Day Education",80877.702000000005,372.70830414746547,217,null,null,"No","5154A - Boston Higashi School - Day Education"," ","5154A",null,{"$f":"IF(G32=366,366*F32,)","v":0}]
["5154B","Res Ed","Boston Higashi School","Residential Ed.",198031.3,651.41874999999993,304,null,null,"No","5154B - Boston Higashi School - Residential Ed."," ","5154B",null,{"$f":"IF(G33=366,366*F33,)","v":0}]
["5154C","Res Ed","Boston Higashi School","Residential Ed. 365",237759.12,651.39484931506843,365,null,null,"No","5154C - Boston Higashi School - Residential Ed. 365"," ","5154C",null,{"$f":"IF(G34=366,366*F34,)","v":0}]
["5157A","Day","Boston College Campus School","Campus School",95706.032000000007,483.36379797979799,198,null,null,"No","5157A - Boston College Campus School - Campus School"," ","5157A",null,{"$f":"IF(G35=366,366*F35,)","v":0}]
["5160C","Day","Brandon Residential Treatment Center","Intensive Day",82981.37,384.17300925925923,216,null,null,"No","5160C - Brandon Residential Treatment Center - Intensive Day"," ","5160C"]
["5160D","Res Ed","Brandon Residential Treatment Center","Intensive Res.",211044,578.2027397260274,365,null,null,"No","5160D - Brandon Residential Treatment Center - Intensive Res."," ","5160D"]
["5165A","Day","Broccoli Hall, Inc.","Corwin-Russell",40304.199999999997,223.9122222222222,180,null,null,"No","5165A - Broccoli Hall, Inc. - Corwin-Russell"," ","5165A",null,{"$f":"IF(G38=366,366*F38,)","v":0}]
["5177G","Day","Specialized Education Services, Inc.","High Road School of MA.",41888.49,232.71383333333333,180,null,null,"No","5177G - Specialized Education Services, Inc. - High Road School of MA."," ","5177G",null,0]
["5177H","Summer","Specialized Education Services, Inc.","High Road School of MA.",6558.76,218.62533333333334,30,null,null,"No","5177H - Specialized Education Services, Inc. - High Road School of MA."," ","5177H",null,0]
{"$rows_left_out":175}
{"sheet":"FY20_sped-prices_combined file","index":2,"n_rows":213,"n_cols":16,"rows_kept":213,"cut":false,"hidden":true,"merged":[]}
[]
[null,"Amego",237131690,"Day","Amego School Day ","2003-06-30","05","5017B",237,{"$f":"IF(I2=365,365+1,I2)","v":237},121717.14,{"$f":"+M2*J2","v":121717.13999999998},513.57443037974679,"2019-09-01",null,{"$f":"VLOOKUP(H2,data!$A$3:$A$269,1,FALSE)","v":"5017B"}]
[null,"Amego","237131690","Res Ed","Autistic","2003-06-30","03","5017A",365,366,242151.74,242815.16942465754,663.42942465753424,null,null,{"$f":"VLOOKUP(H3,data!$A$3:$A$269,1,FALSE)","v":"5017A"}]
[null,"American School for the Deaf","060667600","Day","MA Educational/Day",null,null,"5021C",180,180,69160,69160,384.22222222222223,"2019-08-01",null,{"$f":"VLOOKUP(H4,data!$A$3:$A$269,1,FALSE)","v":"5021C"}]
[null,"American School for the Deaf","060667600","Res Ed","MA Educational/Residential","Exempt ",41090,"5021E",180,180,99797,99797,554.42777777777781,"2019-08-01",null,{"$f":"VLOOKUP(H5,data!$A$3:$A$269,1,FALSE)","v":"5021E"}]
[null,"American School for the Deaf","060667600","Res Ed","MA PACES 365","Exempt ",41090,"5021G",365,366,489267,490607.45753424655,1340.4575342465753,"2019-08-01",null,{"$f":"VLOOKUP(H6,data!$A$3:$A$269,1,FALSE)","v":"5021G"}]
[null,"Archway, Inc.","042643209","Res Ed","Archway","2003-06-30","01","5034A",365,366,176769.27,177253.56936986302,484.29936986301368,null,null,{"$f":"VLOOKUP(H7,data!$A$3:$A$269,1,FALSE)","v":"5034A"}]
[null,"Becket","020433265","Res Ed","Belgrade","Exempt ",41090,"6276C",365,366,224777.95,225393.78000000003,615.83000000000004,null,null,{"$f":"VLOOKUP(H8,data!$A$3:$A$269,1,FALSE)","v":"6276C"}]
[null,"Becket","020433265","Res Ed","Mount Prospect Academy/ Depot (Subacute)",null,null,"6276M",365,366,307289.84999999998,308131.74,841.89,"2019-11-01",null,{"$f":"VLOOKUP(H9,data!$A$3:$A$269,1,FALSE)","v":"6276M"}]
[null,"Becket","020433265","Res Ed","Mount Prospect Academy/Campton",null,null,"6276H",365,366,259434.7,260145.48000000004,710.78000000000009,"2019-11-01",null,{"$f":"VLOOKUP(H10,data!$A$3:$A$269,1,FALSE)","v":"6276H"}]
[null,"Becket","020433266","Res Ed","Mount Prospect Academy/Pike ",null,null,"6276J",365,366,185076.9,185583.96,507.06,"2019-11-01",null,{"$f":"VLOOKUP(H11,data!$A$3:$A$269,1,FALSE)","v":"6276J"}]
[null,"Becket","020433266","Res Ed","Mount Prospect Academy/Plymouth",null,null,"6276N",365,366,181266.3,181762.91999999998,496.61999999999995,"2019-11-01",null,{"$f":"VLOOKUP(H12,data!$A$3:$A$269,1,FALSE)","v":"6276N"}]
[null,"Becket","020433265","Res Ed","Mount Prospect Academy/Rummey",null,null,"6276I",365,366,186664.65,187176.06,511.40999999999997,"2019-11-01",null,{"$f":"VLOOKUP(H13,data!$A$3:$A$269,1,FALSE)","v":"6276I"}]
[null,"Becket","020433267","Res Ed","NESFG Green Meadows Subacute",null,null,"6276S ",365,366,295102.5,295911,808.5,null,null,{"$f":"VLOOKUP(H14,data!$A$3:$A$269,1,FALSE)","v":{"$error":"#N/A"}}]
[null,"Becket","020433267","Res Ed","NESFG Intensive Residential",null,null,"6276T ",365,366,200056.5,200604.6,548.1,null,null,{"$f":"VLOOKUP(H15,data!$A$3:$A$269,1,FALSE)","v":{"$error":"#N/A"}}]
[null,"Becket","020433266","Res Ed","Vermont School for Girls",null,null,"6276P",365,366,141729.5,142117.80000000002,388.3,null,null,{"$f":"VLOOKUP(H16,data!$A$3:$A$269,1,FALSE)","v":"6276P"}]
[null,"Bellefaire Jewish  Childrens Bureau",340714630,"Res Ed","Monarch School",null,null,"5121A",365,366,202056.03,202609.60816438356,553.57816438356167,null,null,{"$f":"VLOOKUP(H17,data!$A$3:$A$269,1,FALSE)","v":"5121A"}]
[null,"Bellefaire Jewish  Childrens Bureau",340714630,"Day","Monarch School",null,null,"5121B",180,180,83551.48,83551.48,464.17488888888886,null,null,{"$f":"VLOOKUP(H18,data!$A$3:$A$269,1,FALSE)","v":"5121B"}]
[null,"Beverly School for the Deaf","042103886","Day","BSD","2003-06-30","8","5134B",204,204,79865.19,79865.19,391.49602941176471,"2019-09-01",null,{"$f":"VLOOKUP(H19,data!$A$3:$A$269,1,FALSE)","v":"5134B"}]
[null,"Beverly School for the Deaf","042103886","Day","Child. Comm. Ctr.","2003-06-30","7","5134C",204,204,97695.039999999994,97695.039999999994,478.89725490196076,"2019-09-01",null,{"$f":"VLOOKUP(H20,data!$A$3:$A$269,1,FALSE)","v":"5134C"}]
[null,"Boston College Campus School","042103545","Day","Campus School","2016-05-30",1,"5157A",198,198,93171.76,93171.76,470.5644444444444,null,null,{"$f":"VLOOKUP(H21,data!$A$3:$A$269,1,FALSE)","v":"5157A"}]
[null,"Boston Higashi School","222803661","Day","Day Education","2003-06-30",1,"5154A",217,217,78736.08,78736.08,362.83907834101382,null,null,{"$f":"VLOOKUP(H22,data!$A$3:$A$269,1,FALSE)","v":"5154A"}]
[null,"Boston Higashi School","222803661","Res Ed","Residential Ed.","2003-06-30",2,"5154B",304,304,192787.48,192787.48000000004,634.16934210526324,null,null,{"$f":"VLOOKUP(H23,data!$A$3:$A$269,1,FALSE)","v":"5154B"}]
[null,"Boston Higashi School","222803661","Res Ed","Residential Ed. 365","2003-06-30","3","5154C",365,366,231463.32,232097.46608219176,634.14608219178081,null,null,{"$f":"VLOOKUP(H24,data!$A$3:$A$269,1,FALSE)","v":"5154C"}]
[null,"Brandon Residential Treatment Center","043015339","Day","Intensive Day","2003-06-30",11,"5160C",216,216,80784.039999999994,80784.039999999994,374.00018518518516,null,null,{"$f":"VLOOKUP(H25,data!$A$3:$A$269,1,FALSE)","v":"5160C"}]
[null,"Brandon Residential Treatment Center","043015339","Res Ed","Intensive Res.","2003-06-30",12,"5160D",365,366,205455.61,206018.50208219176,562.89208219178079,null,null,{"$f":"VLOOKUP(H26,data!$A$3:$A$269,1,FALSE)","v":"5160D"}]
[null,"Broccoli Hall, Inc.","043379875","Day","Corwin-Russell","2003-06-30","01","5165A",180,180,39236.949999999997,39236.949999999997,217.98305555555555,"1(FY21)",null,{"$f":"VLOOKUP(H27,data!$A$3:$A$269,1,FALSE)","v":"5165A"}]
[null,"Camp Sunshine Day","042541474","Day","Reed Academy Day","2011-06-30","2","5947C",216,216,62754.26,62754.26,290.52898148148148,"1 (FY21) ",null,{"$f":"VLOOKUP(H28,data!$A$3:$A$269,1,FALSE)","v":"5947C"}]
[null,"Cardinal Cushing School & Training Ctr.","042104871","Day","Braintree St. Coletta","2003-06-30",11,"6012A",216,216,89234.39,89234.39,413.12217592592594,"2019-11-01",null,{"$f":"VLOOKUP(H29,data!$A$3:$A$269,1,FALSE)","v":"6012A"}]
[null,"Cardinal Cushing School & Training Ctr.","042104871","Day","Day/Vocational","2003-06-30",1,"5296A",216,216,95345.67,95345.67,441.41513888888886,"2019-11-01",null,{"$f":"VLOOKUP(H30,data!$A$3:$A$269,1,FALSE)","v":"5296A"}]
[null,"Cardinal Cushing School & Training Ctr.","042104871","Res Ed","Residential","2003-06-30",9,"5296C",365,366,248977,249659.12876712327,682.12876712328762,"2019-11-01",null,{"$f":"VLOOKUP(H31,data!$A$3:$A$269,1,FALSE)","v":"5296C"}]
[null,"Center for Applied Behavioral Instruction","272283580  ","Day","Day Program","2003-06-30","1","5224A",226,226,93311.83,93311.83,412.88420353982303,null,null,{"$f":"VLOOKUP(H32,data!$A$3:$A$269,1,FALSE)","v":"5224A"}]
[null,"Center for School Crisis Inter. & Assess.","043244814","Day","Center School","2003-06-30","01","5227B",220,220,79151.039999999994,79151.039999999994,359.77745454545453,"2 (FY21) ",null,{"$f":"VLOOKUP(H33,data!$A$3:$A$269,1,FALSE)","v":"5227B"}]
[null,"Children's Study Home",42105939,"Day","Curtis Blake Day School","2003-06-30",null,"5249G",180,180,43563.03,43563.03,242.01683333333332,null,null,{"$f":"VLOOKUP(H34,data!$A$3:$A$269,1,FALSE)","v":"5249G"}]
[null,"Children's Study Home","042105939","Day","Mill Pond Day Program","2003-06-30","06","5249A",216,216,50907.67,50907.67,235.6836574074074,null,null,{"$f":"VLOOKUP(H35,data!$A$3:$A$269,1,FALSE)","v":"5249A"}]
[null,"Clarke School for the Deaf","042104008","Day","Clarke School East","2003-06-30",4,"5257D",192,192,56329.38,56329.38,293.38218749999999,"2019-08-01",null,{"$f":"VLOOKUP(H36,data!$A$3:$A$269,1,FALSE)","v":"5257D"}]
[null,"Clarke School for the Deaf","042104008","Day","Day Education","2003-06-30",2,"5257A",180,180,59990.69,59990.69000000001,333.28161111111115,"2019-08-01",null,{"$f":"VLOOKUP(H37,data!$A$3:$A$269,1,FALSE)","v":"5257A"}]
[null,"Clarke School for the Deaf","042104008","Day","Preschool","2003-06-30",3,"5257B",198,198,50968.91,50968.909999999996,257.41873737373737,"2019-10-01",null,{"$f":"VLOOKUP(H38,data!$A$3:$A$269,1,FALSE)","v":"5257B"}]
[null,"Clearway School, Inc.","042576523","Day","766 School","2003-06-30","01","5258A",180,180,49825.43,49825.43,276.80794444444444,"1(FY20)",null,{"$f":"VLOOKUP(H39,data!$A$3:$A$269,1,FALSE)","v":"5258A"}]
[null,"Clearway School, Inc.",42576523,"Summer","Summer","2003-06-30","02","5258B",24,24,5756.4,5756.4,239.85,null,null,{"$f":"VLOOKUP(H40,data!$A$3:$A$269,1,FALSE)","v":"5258B"}]
{"$rows_left_out":173}