{"text_format":"1","workbook":"xlsx","n_sheets":4,"sheets":["Leas","Calendar","data","FY20_sped-prices_combined file"],"not_rendered":{"charts":0,"images":0,"macros":1,"external_links":0,"defined_names":7,"comments":3,"pivot_tables":0},"unopened":[],"bounds":{"document_bytes":16777216,"sheet_cells":100000,"rows_first":2000,"rows_last":500,"rows_between":2000,"halvings":0,"cell_chars":16384,"cell_head_chars":4096},"cells_cut":0,"cells_raw":0,"read":"whole","date_system":"1900"}

{"sheet":"Leas","index":0,"n_rows":0,"n_cols":0,"rows_kept":0,"cut":false,"hidden":true,"merged":[]}

{"sheet":"Calendar","index":1,"n_rows":380,"n_cols":35,"rows_kept":380,"cut":false,"hidden":false,"merged":[[15,19,15,25],[33,19,33,25],[15,10,15,16],[24,1,24,7],[15,1,15,7],[33,1,33,7],[24,19,24,25],[24,10,24,16],[55,11,55,16],[56,11,56,16],[51,22,51,23],[42,19,42,25],[33,10,33,16],[62,1,62,7],[42,1,42,7],[42,10,42,16],[55,21,55,25],[56,21,56,25],[54,11,54,16],[61,1,61,26],[57,21,57,25],[58,21,58,25],[57,11,57,16],[58,11,58,16],[2,19,2,25],[5,16,5,17],[6,16,6,17],[7,16,7,17],[12,2,12,26],[8,7,8,10],[10,19,10,25]]}
[null,null,null,null,null,null,"FY 2025 Private School Calendar",null,null,null,null,null,null,null,null,null,null,null,null,null,null,null,null,null,null,null,{"$f":"IF(Q8=\"Summer\",\"\",IF(AI13<>W52,\"Date Enter Error\",\"\"))","v":""}]
[null,"SAVE TO YOUR HARD DRIVE FIRST, DO NOT WORK ON THE WEB! "]
[1,"Program Information: (Select your program code from the dropdown)",null,null,null,null,null,null,null,null,null,null,null,null,null,null,null,null,null,"June 2024"]
[null,null,null,null,null,null,null,null,1,null,null,null,null,null,null,null,null,null,null,"S","M","T","W","T","F","S"]
[null,null,null,null,null,null,null,null,null,null,null,null,null,null,null,null,null,null,null,null,null,null,null,null,null,1,"June 2024"]
[null,"Program Code:",null,null,null,null,null,null,null,null,null,null,"Annual Rate: ",null,null,null,{"$f":"IF($I$6=\"\",\"\",VLOOKUP($I$6,rates,5))","v":""},null,null,2,3,4,5,6,7,8,"Total Days"]
[null,"Private School Name:",null,null,null,null,null,{"$f":"IF($I$6=\"\",\"\",VLOOKUP($I$6,rates,3))","v":""},null,null,null,null,"Daily Rate:",null,null,null,{"$f":"IF($I$6=\"\",\"\",VLOOKUP($I$6,rates,6))","v":""},null,null,9,10,11,12,13,14,15,"IN Session"]
[null,"Program Name:",null,null,null,null,null,{"$f":"IF($I$6=\"\",\"\",VLOOKUP($I$6,rates,4))","v":""},null,null,null,null,"Program Type:",null,null,null,{"$f":"IF($I$6=\"\",\"\",VLOOKUP($I$6,rates,2))","v":""},null,null,16,17,18,19,20,21,22,{"$f":"IF(AND(I6<>\"\",Q8=\"Summer\"),COUNTA(T5:Z10),0)","v":0}]
[null,"OSD Approved Total Days:",null,null,null,null,null,{"$f":"IF($I$6=\"\",\"\",IF(VLOOKUP($I$6,rates,7,FALSE)=\"\",\"No Calendar\",VLOOKUP($I$6,rates,7,FALSE)))","v":""},null,null,null,null,null,null,null,null,null,null,null,23,24,25,26,27,28,29]
[null,null,null,null,null,null,null,null,null," ",null,null,null,null,null,null,null,null,null,30]
[2,"Calendar Information:",null,null,null,null,null,null,null,null,null,null,null,null,null,null,null,null,null,"Note: For summer programs operating in June 2024 - Delete the dates school is NOT open."]
[null,"A. ","If program operates 365 days, complete Other Information below and proceed to saving the file instructions.",null,null,null,null,null,null,null,null,null,null,null,null,null,null,null,null,null,null,null,null,null,null,null,null,null,null,null,null,null,null,null,{"$f":"IF(W52=AI13,\"\",\"Not Match\")","v":""}]
[null,"B. ","Programs operating less than 365 days, delete dates school is not in session. Please use DELETE button rather than space bar to remove dates. Complete Other Information and proceed to saving the file instructions below.  (ONLY for those programs operating summer programs starting in June 2024 see \"Note\" above)",null,null,null,null,null,null,null,null,null,null,null,null,null,null,null,null,null,null,null,null,null,null,null,null,null,null,null,null,null,null,"Total Days:",{"$f":"SUM(AI16:AJ381)","v":365}]
[]
[null,null,null,null,null,null,null,null,null,null,null,null,null,null,null,null,null,null,null,null,null,null,null,null,null,null,null,null,null,null,null,"Col","Row",{"$f":"I6","v":0}]
[null,"July 2024",null,null,null,null,null,null,null,null,"August 2024",null,null,null,null,null,null,null,null,"September 2024",null,null,null,null,null,null,null,null,null,null,"2024-07-01","C",18,{"$f":"IF(INDIRECT(AF16&AG16)=\"\",\"\",AE16)","v":"2024-07-01"},{"$f":"IF(AH16=\"\",0,1)","v":1}]
[null,"S","M","T","W","T","F","S",null,null,"S","M","T","W","T","F","S",null,null,"S","M","T","W","T","F","S",null,null,null,null,"2024-07-02","D",18,{"$f":"IF(INDIRECT(AF17&AG17)=\"\",\"\",AE17)","v":"2024-07-02"},1]
[null,null,1,2,3,4,5,6,null,null,null,null,null,null,1,2,3,null,null,1,2,3,4,5,6,7,null,null,null,null,"2024-07-03","E",18,{"$f":"IF(INDIRECT(AF18&AG18)=\"\",\"\",AE18)","v":"2024-07-03"},1]
[null,7,8,9,10,11,12,13,"July 2024",null,4,5,6,7,8,9,10,"Aug 2024",null,8,9,10,11,12,13,14,"Sept 2024",null,null,null,"2024-07-04","F",18,"2024-07-04",1]
[null,14,15,16,17,18,19,20,"Total Days",null,11,12,13,14,15,16,17,"Total Days",null,15,16,17,18,19,20,21,"Total Days",null,null,null,"2024-07-05","G",18,"2024-07-05",1]
[null,21,22,23,24,25,26,27,"in Session",null,18,19,20,21,22,23,24,"in Session",null,22,23,24,25,26,27,28,"in Session",null,null,null,"2024-07-06","H",18,"2024-07-06",1]
[null,28,29,30,31,null,null,null,{"$f":"COUNT(B18:H23)","v":31},null,25,26,27,28,29,30,31,{"$f":"COUNT(K18:Q23)","v":31},null,29,30,null,null,null,null,null,{"$f":"COUNT(T18:Z23)","v":30},null,null,null,"2024-07-07","B",19,"2024-07-07",1]
[null,null,null,null,null,null,null,null,null,null,null,null,null,null,null,null,null,null,null,null,null,null,null,null,null,null,null,null,null,null,"2024-07-08","C",19,"2024-07-08",1]
[null,null,null,null,null,null,null,null,null,null,null,null,null,null,null,null,null,null,null,null,null,null,null,null,null,null,null,null,null,null,"2024-07-09","D",19,"2024-07-09",1]
[null,"October 2024",null,null,null,null,null,null,null,null,"November 2024",null,null,null,null,null,null,null,null,"December 2024",null,null,null,null,null,null,null,null,null,null,"2024-07-10","E",19,"2024-07-10",1]
[null,"S","M","T","W","T","F","S",null,null,"S","M","T","W","T","F","S",null,null,"S","M","T","W","T","F","S",null,null,null,null,"2024-07-11","F",19,"2024-07-11",1]
[null,null,null,1,2,3,4,5,null,null,null,null,null,null,null,1,2,null,null,1,2,3,4,5,6,7,null,null,null,null,"2024-07-12","G",19,"2024-07-12",1]
[null,6,7,8,9,10,11,12,"Oct 2024",null,3,4,5,6,7,8,9,"Nov 2024",null,8,9,10,11,12,13,14,"Dec 2024",null,null,null,"2024-07-13","H",19,"2024-07-13",1]
[null,13,14,15,16,17,18,19,"Total Days",null,10,11,12,13,14,15,16,"Total Days",null,15,16,17,18,19,20,21,"Total Days",null,null,null,"2024-07-14","B",20,"2024-07-14",1]
[null,20,21,22,23,24,25,26,"in Session",null,17,18,19,20,21,22,23,"in Session",null,22,23,24,25,26,27,28,"in Session",null,null,null,"2024-07-15","C",20,"2024-07-15",1]
{"$rows_left_out":351}
{"sheet":"data","index":2,"n_rows":215,"n_cols":20,"rows_kept":215,"cut":false,"hidden":false,"merged":[]}
["DA OrgCode","Type","School_Name","Prog_Name","Rate_Annual","Rate_Daily","Total_Days","Start_Date","End_Date","State","Legacy Program Code","DA Org Name","DA Code + Legacy Code + Name","Summer (Y/N)","DA Code + Legacy Code + Name",null,null,null,"Leap Year (366 annual rate calculation)","Per Elena, we have to change 365 days per OSD to 366 days and adjust an annual rate only for the programs that run for a full year (366 days in FY24)"]
[]
[]
["09505001","Res Ed","American School for the Deaf","MA Educational/Residential",121303,673.92,180,null,null,"CT","5021E","American School for the Deaf: MA Educational/Residential",{"$f":"CONCATENATE($A4,\"-\",$K4, \"-\",$L4)","v":"09505001-5021E-American School for the Deaf: MA Educational/Residential"},{"$f":"IF(B4<>\"Summer\", \"No\", \"Yes\")","v":"No"},{"$f":"CONCATENATE($A4,\"-\",$K4, \"-\",$L4)","v":"09505001-5021E-American School for the Deaf: MA Educational/Residential"}," ",{"$f":"TRIM(A4)","v":"09505001"},null,{"$f":"IF(G4=366,366*F4,0)","v":0}]
["09505002","Day","American School for the Deaf","MA Educational/Day",84065,467.02777777777777,180,null,null,"CT","5021C","American School for the Deaf: MA Educational/Day",{"$f":"CONCATENATE($A5,\"-\",$K5, \"-\",$L5)","v":"09505002-5021C-American School for the Deaf: MA Educational/Day"},"No",{"$f":"CONCATENATE($A5,\"-\",$K5, \"-\",$L5)","v":"09505002-5021C-American School for the Deaf: MA Educational/Day"}," ","09505002",null,0]
["09505004","Day","American School for the Deaf","PACES Day Education 215",212895,990.20930232558135,215,null,null,"CT","5021O","American School for the Deaf: PACES Day Education 215","09505004-5021O-American School for the Deaf: PACES Day Education 215","No","09505004-5021O-American School for the Deaf: PACES Day Education 215"," ","09505004",null,0]
["09505005","Day","Seven Hills New Hampshire, Inc.","Seven Hills at Crotched Mountain Day Program",122501,556.82272727272732,220,null,null,"NH","6005B","Seven Hills New Hampshire, Inc.: Seven Hills at Crotched Mountain Day Program","09505005-6005B-Seven Hills New Hampshire, Inc.: Seven Hills at Crotched Mountain Day Program","No","09505005-6005B-Seven Hills New Hampshire, Inc.: Seven Hills at Crotched Mountain Day Program"," ","09505005",null,0]
["09505006","Res Ed","Seven Hills New Hampshire, Inc.","Seven Hills at Crotched Mountain Residential Program",289112,792.08767123287669,365,null,null,"NH","6005A","Seven Hills New Hampshire, Inc.: Seven Hills at Crotched Mountain Residential Program","09505006-6005A-Seven Hills New Hampshire, Inc.: Seven Hills at Crotched Mountain Residential Program","No","09505006-6005A-Seven Hills New Hampshire, Inc.: Seven Hills at Crotched Mountain Residential Program"," ","09505006",null,0]
["09505008","Res Ed","Easter Seals of New Hampshire","Easterseals Gammon Academy at Krol House - Regular",299493.76000000001,820.53084931506851,365,null,null,"NH","5338C","Easter Seals of New Hampshire: Easterseals Gammon Academy at Krol House - Regular","09505008-5338C-Easter Seals of New Hampshire: Easterseals Gammon Academy at Krol House - Regular","No","09505008-5338C-Easter Seals of New Hampshire: Easterseals Gammon Academy at Krol House - Regular"," ","09505008",null,0]
["09505009","Res Ed","Easter Seals of New Hampshire","Easterseals Gammon Academy at Zachary Road - Regular",414811.86,1136.4708493150686,365,null,null,"NH","5338E","Easter Seals of New Hampshire: Easterseals Gammon Academy at Zachary Road - Regular","09505009-5338E-Easter Seals of New Hampshire: Easterseals Gammon Academy at Zachary Road - Regular","No","09505009-5338E-Easter Seals of New Hampshire: Easterseals Gammon Academy at Zachary Road - Regular"," ","09505009",null,0]
["09505010","Res Ed","Easter Seals of New Hampshire","Easterseals Gammon Academy at Zachary Road - Intensive",570402.99,1562.7479178082192,365,null,null,"NH","5338F","Easter Seals of New Hampshire: Easterseals Gammon Academy at Zachary Road - Intensive","09505010-5338F-Easter Seals of New Hampshire: Easterseals Gammon Academy at Zachary Road - Intensive","No","09505010-5338F-Easter Seals of New Hampshire: Easterseals Gammon Academy at Zachary Road - Intensive"," ","09505010",null,0]
["09505012","Res Ed","Easter Seals of New Hampshire","Easterseals Gammon Academy at Lancaster- Regular ",403460.16,1105.370301369863,365,null,null,"NH","5338I","Easter Seals of New Hampshire: Easterseals Gammon Academy at Lancaster- Regular","09505012-5338I-Easter Seals of New Hampshire: Easterseals Gammon Academy at Lancaster- Regular","No","09505012-5338I-Easter Seals of New Hampshire: Easterseals Gammon Academy at Lancaster- Regular"," ","09505012",null,0]
["09505013","Res Ed","Easter Seals of New Hampshire","Easterseals Gammon Academy at Lancaster - Int.",599051.29,1641.2364109589041,365,null,null,"NH","5338J","Easter Seals of New Hampshire: Easterseals Gammon Academy at Lancaster - Intensive","09505013-5338J-Easter Seals of New Hampshire: Easterseals Gammon Academy at Lancaster - Intensive","No","09505013-5338J-Easter Seals of New Hampshire: Easterseals Gammon Academy at Lancaster - Intensive"," ","09505013",null,0]
["09505014","Day","Greenwood School","Greenwood School -Day",76400,499.34640522875816,153,null,null,"VT","5451B","Greenwood School: Greenwood School - Day Program","09505014-5451B-Greenwood School: Greenwood School - Day Program","No","09505014-5451B-Greenwood School: Greenwood School - Day Program"," ","09505014",null,0]
["09505017","Day","The learning Clinic, Inc.","Day",117964.77,515.13,229,null,null,"CT","5620B","The Learning Clinic, Inc.: Day","09505017-5620B-The Learning Clinic, Inc.: Day","No","09505017-5620B-The Learning Clinic, Inc.: Day"," ","09505017",null,0]
["09505018","Res Ed","The learning Clinic, Inc.","Residential",200089.77000000002,548.19115068493159,365,null,null,"CT","5620E","The Learning Clinic, Inc.: Residential","09505018-5620E-The Learning Clinic, Inc.: Residential","No","09505018-5620E-The Learning Clinic, Inc.: Residential"," ","09505018",null,0]
["09505019","Day","Learning Skills Academy, Inc.","Learning Skills Academy",64301.4,357.23,180,null,null,"NH","5625A","Learning Skills Academy, Inc.: Learning Skills Academy","09505019-5625A-Learning Skills Academy, Inc.: Learning Skills Academy","No","09505019-5625A-Learning Skills Academy, Inc.: Learning Skills Academy"," ","09505019",null,0]
["09505020","Day","Learning Skills Academy, Inc.","Summer",2794.88,174.68,16,null,null,"NH","5625B","Learning Skills Academy, Inc.: Summer","09505020-5625B-Learning Skills Academy, Inc.: Summer","No","09505020-5625B-Learning Skills Academy, Inc.: Summer"," ","09505020",null,0]
["09505021","Day","Meeting Street School","Basic",86317,403.35046728971963,214,null,null,"RI","5730A","Meeting Street School: Basic (Standard Rate and ESY)","09505021-5730A-Meeting Street School: Basic (Standard Rate and ESY)","No","09505021-5730A-Meeting Street School: Basic (Standard Rate and ESY)"," ","09505021",null,0]
["09505024","Day","The Home for Little Wanderers","Wediko School at The home for Little Wanderers",85707.54,386.07,222,null,null,"NH","5785H","The Home for Little Wanderers: Wediko School at the Home for Little Wanderers Day Program","09505024-5785H-The Home for Little Wanderers: Wediko School at the Home for Little Wanderers Day Program","No","09505024-5785H-The Home for Little Wanderers: Wediko School at the Home for Little Wanderers Day Program"," ","09505024",null,0]
["09505025","Day","Wolf School","Wolf School",69600,421.81818181818181,165,null,null,"RI","6263A","Wolf School: Wolf School","09505025-6263A-Wolf School: Wolf School","No","09505025-6263A-Wolf School: Wolf School"," ","09505025",null,0]
["09505028","Res Ed","Mount Prospect Academy","Mount Prospect Academy/Campton",376282.15,1030.9100000000001,365,null,null,"NH","6276H","Becket: Mount Prospect Academy/Campton","09505028-6276H-Becket: Mount Prospect Academy/Campton","No","09505028-6276H-Becket: Mount Prospect Academy/Campton"," ","09505028",null,0]
["09505029","Res Ed","Mount Prospect Academy","Mount Prospect Academy/Rummey",320167.05,877.17,365,null,null,"NH","6276I","Becket: Mount Prospect Academy/Rummey Program","09505029-6276I-Becket: Mount Prospect Academy/Rummey Program","No","09505029-6276I-Becket: Mount Prospect Academy/Rummey Program"," ","09505029",null,0]
["09505031","Res Ed","Mount Prospect Academy","Mount Prospect Academy/Warren",299745.3,821.22,365,null,null,"NH","6277B","Becket: Mount Prospect Academy/Warren Program","09505031-6277B-Becket: Mount Prospect Academy/Warren Program","No","09505031-6277B-Becket: Mount Prospect Academy/Warren Program"," ","09505031",null,0]
["09505034","Day","Lifespan School Solutions/Bradley Schools","Bradley School Portsmouth Program Standard Rate",64070,298,215,null,null,"RI","5341J","Lifespan School Solutions/Bradley Schools: Bradley School Portsmouth Program Standard Rate","09505034-5341J-Lifespan School Solutions/Bradley Schools: Bradley School Portsmouth Program Standard Rate","No","09505034-5341J-Lifespan School Solutions/Bradley Schools: Bradley School Portsmouth Program Standard Rate"," ","09505034",null,0]
["09505035","Day","Lifespan School Solutions/Bradley Schools","Bradley School Portsmouth Program Intensive Rate",77830,362,215,null,null,"RI","5341E","Lifespan School Solutions/Bradley Schools: Bradley School Portsmouth Program Intensive Rate","09505035-5341E-Lifespan School Solutions/Bradley Schools: Bradley School Portsmouth Program Intensive Rate","No","09505035-5341E-Lifespan School Solutions/Bradley Schools: Bradley School Portsmouth Program Intensive Rate"," ","09505035",null,0]
["09505037","Day","Lifespan School Solutions/Bradley Schools","Bradley School Providence Program Standard Rate",64070,298,215,null,null,"RI","5341B ","Lifespan School Solutions/Bradley Schools: Bradley School Providence Program Standard Rate","09505037-5341B -Lifespan School Solutions/Bradley Schools: Bradley School Providence Program Standard Rate","No","09505037-5341B -Lifespan School Solutions/Bradley Schools: Bradley School Providence Program Standard Rate"," ","09505037",null,0]
["09505038","Day","Lifespan School Solutions/Bradley Schools","Bradley School Providence Program  Intensive Rate",77830,362,215,null,null,"RI","5341D","Lifespan School Solutions/Bradley Schools: Bradley School Providence Program  Intensive Rate","09505038-5341D-Lifespan School Solutions/Bradley Schools: Bradley School Providence Program  Intensive Rate","No","09505038-5341D-Lifespan School Solutions/Bradley Schools: Bradley School Providence Program  Intensive Rate"," ","09505038",null,0]
["09505040","Day","Lifespan School Solutions/Bradley Schools","Partnership Standard Rate Bradley School Portsmouth Partnership Program",54180,252,215,null,null,"RI","5341P","Lifespan School Solutions/Bradley Schools: Partnership Standard Rate Bradley School Portsmouth Partnership Program","09505040-5341P-Lifespan School Solutions/Bradley Schools: Partnership Standard Rate Bradley School Portsmouth Partnership Program","No","09505040-5341P-Lifespan School Solutions/Bradley Schools: Partnership Standard Rate Bradley School Portsmouth Partnership Program"," ","09505040",null,0]
["09505041","Res Ed","Groden Center","Resid. Inten.",324638,889.41917808219182,365,null,null,"RI","5454C","Groden Center: Resid. Inten.","09505041-5454C-Groden Center: Resid. Inten.","No","09505041-5454C-Groden Center: Resid. Inten."," ","09505041",null,0]
{"$rows_left_out":186}
{"sheet":"FY20_sped-prices_combined file","index":3,"n_rows":213,"n_cols":16,"rows_kept":213,"cut":false,"hidden":true,"merged":[]}
[]
[null,"Amego",237131690,"Day","Amego School Day ","2003-06-30","05","5017B",237,{"$f":"IF(I2=365,365+1,I2)","v":237},121717.14,{"$f":"+M2*J2","v":121717.13999999998},513.57443037974679,"2019-09-01",null,{"$f":"VLOOKUP(H2,data!$A$4:$A$316,1,FALSE)","v":{"$error":"#N/A"}}]
[null,"Amego","237131690","Res Ed","Autistic","2003-06-30","03","5017A",365,366,242151.74,242815.16942465754,663.42942465753424,null,null,{"$f":"VLOOKUP(H3,data!$A$4:$A$316,1,FALSE)","v":{"$error":"#N/A"}}]
[null,"American School for the Deaf","060667600","Day","MA Educational/Day",null,null,"5021C",180,180,69160,69160,384.22222222222223,"2019-08-01",null,{"$f":"VLOOKUP(H4,data!$A$4:$A$316,1,FALSE)","v":{"$error":"#N/A"}}]
[null,"American School for the Deaf","060667600","Res Ed","MA Educational/Residential","Exempt ",41090,"5021E",180,180,99797,99797,554.42777777777781,"2019-08-01",null,{"$f":"VLOOKUP(H5,data!$A$4:$A$316,1,FALSE)","v":{"$error":"#N/A"}}]
[null,"American School for the Deaf","060667600","Res Ed","MA PACES 365","Exempt ",41090,"5021G",365,366,489267,490607.45753424655,1340.4575342465753,"2019-08-01",null,{"$f":"VLOOKUP(H6,data!$A$4:$A$316,1,FALSE)","v":{"$error":"#N/A"}}]
[null,"Archway, Inc.","042643209","Res Ed","Archway","2003-06-30","01","5034A",365,366,176769.27,177253.56936986302,484.29936986301368,null,null,{"$f":"VLOOKUP(H7,data!$A$4:$A$316,1,FALSE)","v":{"$error":"#N/A"}}]
[null,"Becket","020433265","Res Ed","Belgrade","Exempt ",41090,"6276C",365,366,224777.95,225393.78000000003,615.83000000000004,null,null,{"$f":"VLOOKUP(H8,data!$A$4:$A$316,1,FALSE)","v":{"$error":"#N/A"}}]
[null,"Becket","020433265","Res Ed","Mount Prospect Academy/ Depot (Subacute)",null,null,"6276M",365,366,307289.84999999998,308131.74,841.89,"2019-11-01",null,{"$f":"VLOOKUP(H9,data!$A$4:$A$316,1,FALSE)","v":{"$error":"#N/A"}}]
[null,"Becket","020433265","Res Ed","Mount Prospect Academy/Campton",null,null,"6276H",365,366,259434.7,260145.48000000004,710.78000000000009,"2019-11-01",null,{"$f":"VLOOKUP(H10,data!$A$4:$A$316,1,FALSE)","v":{"$error":"#N/A"}}]
[null,"Becket","020433266","Res Ed","Mount Prospect Academy/Pike ",null,null,"6276J",365,366,185076.9,185583.96,507.06,"2019-11-01",null,{"$f":"VLOOKUP(H11,data!$A$4:$A$316,1,FALSE)","v":{"$error":"#N/A"}}]
[null,"Becket","020433266","Res Ed","Mount Prospect Academy/Plymouth",null,null,"6276N",365,366,181266.3,181762.91999999998,496.61999999999995,"2019-11-01",null,{"$f":"VLOOKUP(H12,data!$A$4:$A$316,1,FALSE)","v":{"$error":"#N/A"}}]
[null,"Becket","020433265","Res Ed","Mount Prospect Academy/Rummey",null,null,"6276I",365,366,186664.65,187176.06,511.40999999999997,"2019-11-01",null,{"$f":"VLOOKUP(H13,data!$A$4:$A$316,1,FALSE)","v":{"$error":"#N/A"}}]
[null,"Becket","020433267","Res Ed","NESFG Green Meadows Subacute",null,null,"6276S ",365,366,295102.5,295911,808.5,null,null,{"$f":"VLOOKUP(H14,data!$A$4:$A$316,1,FALSE)","v":{"$error":"#N/A"}}]
[null,"Becket","020433267","Res Ed","NESFG Intensive Residential",null,null,"6276T ",365,366,200056.5,200604.6,548.1,null,null,{"$f":"VLOOKUP(H15,data!$A$4:$A$316,1,FALSE)","v":{"$error":"#N/A"}}]
[null,"Becket","020433266","Res Ed","Vermont School for Girls",null,null,"6276P",365,366,141729.5,142117.80000000002,388.3,null,null,{"$f":"VLOOKUP(H16,data!$A$4:$A$316,1,FALSE)","v":{"$error":"#N/A"}}]
[null,"Bellefaire Jewish  Childrens Bureau",340714630,"Res Ed","Monarch School",null,null,"5121A",365,366,202056.03,202609.60816438356,553.57816438356167,null,null,{"$f":"VLOOKUP(H17,data!$A$4:$A$316,1,FALSE)","v":{"$error":"#N/A"}}]
[null,"Bellefaire Jewish  Childrens Bureau",340714630,"Day","Monarch School",null,null,"5121B",180,180,83551.48,83551.48,464.17488888888886,null,null,{"$f":"VLOOKUP(H18,data!$A$4:$A$316,1,FALSE)","v":{"$error":"#N/A"}}]
[null,"Beverly School for the Deaf","042103886","Day","BSD","2003-06-30","8","5134B",204,204,79865.19,79865.19,391.49602941176471,"2019-09-01",null,{"$f":"VLOOKUP(H19,data!$A$4:$A$316,1,FALSE)","v":{"$error":"#N/A"}}]
[null,"Beverly School for the Deaf","042103886","Day","Child. Comm. Ctr.","2003-06-30","7","5134C",204,204,97695.039999999994,97695.039999999994,478.89725490196076,"2019-09-01",null,{"$f":"VLOOKUP(H20,data!$A$4:$A$316,1,FALSE)","v":{"$error":"#N/A"}}]
[null,"Boston College Campus School","042103545","Day","Campus School","2016-05-30",1,"5157A",198,198,93171.76,93171.76,470.5644444444444,null,null,{"$f":"VLOOKUP(H21,data!$A$4:$A$316,1,FALSE)","v":{"$error":"#N/A"}}]
[null,"Boston Higashi School","222803661","Day","Day Education","2003-06-30",1,"5154A",217,217,78736.08,78736.08,362.83907834101382,null,null,{"$f":"VLOOKUP(H22,data!$A$4:$A$316,1,FALSE)","v":{"$error":"#N/A"}}]
[null,"Boston Higashi School","222803661","Res Ed","Residential Ed.","2003-06-30",2,"5154B",304,304,192787.48,192787.48000000004,634.16934210526324,null,null,{"$f":"VLOOKUP(H23,data!$A$4:$A$316,1,FALSE)","v":{"$error":"#N/A"}}]
[null,"Boston Higashi School","222803661","Res Ed","Residential Ed. 365","2003-06-30","3","5154C",365,366,231463.32,232097.46608219176,634.14608219178081,null,null,{"$f":"VLOOKUP(H24,data!$A$4:$A$316,1,FALSE)","v":{"$error":"#N/A"}}]
[null,"Brandon Residential Treatment Center","043015339","Day","Intensive Day","2003-06-30",11,"5160C",216,216,80784.039999999994,80784.039999999994,374.00018518518516,null,null,{"$f":"VLOOKUP(H25,data!$A$4:$A$316,1,FALSE)","v":{"$error":"#N/A"}}]
[null,"Brandon Residential Treatment Center","043015339","Res Ed","Intensive Res.","2003-06-30",12,"5160D",365,366,205455.61,206018.50208219176,562.89208219178079,null,null,{"$f":"VLOOKUP(H26,data!$A$4:$A$316,1,FALSE)","v":{"$error":"#N/A"}}]
[null,"Broccoli Hall, Inc.","043379875","Day","Corwin-Russell","2003-06-30","01","5165A",180,180,39236.949999999997,39236.949999999997,217.98305555555555,"1(FY21)",null,{"$f":"VLOOKUP(H27,data!$A$4:$A$316,1,FALSE)","v":{"$error":"#N/A"}}]
[null,"Camp Sunshine Day","042541474","Day","Reed Academy Day","2011-06-30","2","5947C",216,216,62754.26,62754.26,290.52898148148148,"1 (FY21) ",null,{"$f":"VLOOKUP(H28,data!$A$4:$A$316,1,FALSE)","v":{"$error":"#N/A"}}]
[null,"Cardinal Cushing School & Training Ctr.","042104871","Day","Braintree St. Coletta","2003-06-30",11,"6012A",216,216,89234.39,89234.39,413.12217592592594,"2019-11-01",null,{"$f":"VLOOKUP(H29,data!$A$4:$A$316,1,FALSE)","v":{"$error":"#N/A"}}]
[null,"Cardinal Cushing School & Training Ctr.","042104871","Day","Day/Vocational","2003-06-30",1,"5296A",216,216,95345.67,95345.67,441.41513888888886,"2019-11-01",null,{"$f":"VLOOKUP(H30,data!$A$4:$A$316,1,FALSE)","v":{"$error":"#N/A"}}]
{"$rows_left_out":183}