{"text_format":"1","workbook":"xlsx","n_sheets":9,"sheets":["code436","notes","leas","membership","tuitioncalc","eoy","rate summary","dataout","webmessage"],"not_rendered":{"charts":0,"images":0,"macros":1,"external_links":43,"defined_names":46,"comments":0,"pivot_tables":0},"unopened":[],"bounds":{"document_bytes":16777216,"sheet_cells":100000,"rows_first":2000,"rows_last":500,"rows_between":2000,"halvings":0,"cell_chars":16384,"cell_head_chars":4096},"cells_cut":0,"cells_raw":0,"read":"whole","date_system":"1900"}

{"sheet":"code436","index":0,"n_rows":447,"n_cols":10,"rows_kept":447,"cut":false,"hidden":true,"merged":[]}
[null,null,null,null,null,null,1,"district_code","district_short_name","Select an lea"]
[null,null,null,null,null,null,2,"001","ABINGTON                     ",{"$f":"H2&\" \"&I2","v":"001 ABINGTON                     "}]
[null,null,null,null,null,null,3,"002","ACTON                        ",{"$f":"H3&\" \"&I3","v":"002 ACTON                        "}]
[null,null,null,null,null,null,4,"003","ACUSHNET                     ","003 ACUSHNET                     "]
[null,null,null,null,null,null,5,"004","ADAMS                        ","004 ADAMS                        "]
[null,null,null,null,null,null,6,"005","AGAWAM                       ","005 AGAWAM                       "]
[null,null,null,null,null,null,7,"006","ALFORD                       ","006 ALFORD                       "]
[null,null,null,null,null,null,8,"007","AMESBURY                     ","007 AMESBURY                     "]
["lea","dist","string","order436","operating",null,9,"008","AMHERST                      ","008 AMHERST                      "]
[1,"ABINGTON                     ","001",1,1,null,10,"009","ANDOVER                      ","009 ANDOVER                      "]
[2,"ACTON                        ","002",2,0,null,11,"010","ARLINGTON                    ","010 ARLINGTON                    "]
[3,"ACUSHNET                     ","003",3,1,null,12,"011","ASHBURNHAM                   ","011 ASHBURNHAM                   "]
[4,"ADAMS                        ","004",4,0,null,13,"012","ASHBY                        ","012 ASHBY                        "]
[5,"AGAWAM                       ","005",5,1,null,14,"013","ASHFIELD                     ","013 ASHFIELD                     "]
[6,"ALFORD                       ","006",6,0,null,15,"014","ASHLAND                      ","014 ASHLAND                      "]
[7,"AMESBURY                     ","007",7,1,null,16,"015","ATHOL                        ","015 ATHOL                        "]
[8,"AMHERST                      ","008",8,1,null,17,"016","ATTLEBORO                    ","016 ATTLEBORO                    "]
[9,"ANDOVER                      ","009",9,1,null,18,"017","AUBURN                       ","017 AUBURN                       "]
[10,"ARLINGTON                    ","010",10,1,null,19,"018","AVON                         ","018 AVON                         "]
[11,"ASHBURNHAM                   ","011",11,0,null,20,"019","AYER                         ","019 AYER                         "]
{"$rows_left_out":428}
{"sheet":"notes","index":1,"n_rows":16,"n_cols":2,"rows_kept":16,"cut":false,"hidden":true,"merged":[]}
["ran december numbers at 5000 for everyone; didn't have time to update these rates in case someone came in below $5000"]
[]
[]
["notes16"]
[]
["2015-12-16","estimated membership because FY15 wasn’t ready, but did want to publish an estimated rate file"]
["2015-12-16","updated eoy sheet"]
["2015-12-16","updated rate summary (just the fiscal year in title)"]
["2015-12-16","redid dataout"]
["2015-12-16","redid webmessage"]
["2015-12-16","updated tuitioncalc--just the fiscal year in title; no changes to the report"]
[]
[null,"for later postings use actual fy15 membership"]
[null,"change wording on rate summary membership description"]
[]
["2016-06-15","re-rah AFTER finalizing distribution for lisa's deadline.  Fortunately none of the rates were affected."]

{"sheet":"leas","index":2,"n_rows":196,"n_cols":12,"rows_kept":196,"cut":false,"hidden":true,"merged":[]}
["first record",187]
["lea",{"$f":"VLOOKUP(B1,order436,2)","v":885},{"$f":"VLOOKUP(leaextract,code436,2)","v":"WHITTIER                     "},{"$f":"VLOOKUP(leaextract,code436,3)","v":"885"}]
[]
["last record",187]
["lastlea",{"$f":"VLOOKUP(B4,order436,2)","v":885},{"$f":"VLOOKUP(lastlea,code436,2)","v":"WHITTIER                     "}]
[null,null,null,null,null,null,null,null,null,null,"from webmessage, 1Y0 or 1T0"]
[null,"To update the list, replace this column"]
[null," jun15"]
["order","lea",null,"leastring",null,null,null,null,null,"lea","dist","ok?"]
[1,{"$f":"VALUE(J10)","v":1},{"$f":"K10","v":"ABINGTON                     "},{"$f":"J10","v":"001"},null,null,null,null,null,"001","ABINGTON                     ","1Y0"]
[2,{"$f":"VALUE(J11)","v":5},{"$f":"K11","v":"AGAWAM                       "},{"$f":"J11","v":"005"},null,null,null,null,null,"005","AGAWAM                       ","1Y0"]
[3,7,"AMESBURY                     ","007",null,null,null,null,null,"007","AMESBURY                     ","1Y0"]
[4,8,"AMHERST                      ","008",null,null,null,null,null,"008","AMHERST                      ","1Y0"]
[5,14,"ASHLAND                      ","014",null,null,null,null,null,"014","ASHLAND                      ","1Y0"]
[6,17,"AUBURN                       ","017",null,null,null,null,null,"017","AUBURN                       ","1Y0"]
[7,18,"AVON                         ","018",null,null,null,null,null,"018","AVON                         ","1Y0"]
[8,20,"BARNSTABLE                   ","020",null,null,null,null,null,"020","BARNSTABLE                   ","1Y0"]
[9,24,"BELCHERTOWN                  ","024",null,null,null,null,null,"024","BELCHERTOWN                  ","1Y0"]
[10,25,"BELLINGHAM                   ","025",null,null,null,null,null,"025","BELLINGHAM                   ","1Y0"]
[11,27,"BERKLEY                      ","027",null,null,null,null,null,"027","BERKLEY                      ","1Y0"]
{"$rows_left_out":177}
{"sheet":"membership","index":3,"n_rows":450,"n_cols":16,"rows_kept":450,"cut":false,"hidden":true,"merged":[]}
[]
[]
[null,null,null,null,null,null,null,"15 - sch 11 jun15, 2016"]
[]
[null,"Estimated FY15 membership",null,null,null,null,null,"In District FTE"]
[null,null,null,null,null,null,null,null,null,"Fix"]
[null,null,null,null,null,null,null,null,null,"to",null,null,null,null,null,"Total"]
[null,null,"Reg Ed","Sped","Voke Ed",null,null,null,null,"District","Reg Ed","Sped","Voke Ed",null,null,"Day"]
["Lea","District","Memb","Memb","Memb","Sum",null,"Lea","District","1 = yes","Memb","Memb","Memb","Sum","diff","Memb"]
[1,"ABINGTON",{"$f":"K10","v":1866.98},{"$f":"L10","v":72.06},0,1939.04,null,1,"ABINGTON",0,1866.98,72.06,0,1939.04,0,1939.04]
[2,"ACTON",{"$f":"K11","v":0},{"$f":"L11","v":0},{"$f":"M11","v":0},{"$f":"N11","v":0},null,2,"ACTON",0,0,0,0,0,0,0]
[3,"ACUSHNET",921.38,46.12,0,967.5,null,3,"ACUSHNET",0,921.38,46.12,0,967.5,0,967.5]
[4,"ADAMS",0,0,0,0,null,4,"ADAMS",0,0,0,0,0,0,0]
[5,"AGAWAM",3706.91,194.26,75.62,3976.79,null,5,"AGAWAM",0,3706.91,194.26,75.62,3976.79,9.9999999997635314E-3,3976.78]
[6,"ALFORD",0,0,0,0,null,6,"ALFORD",0,0,0,0,0,0,0]
[7,"AMESBURY",2094.88,136.32,0,2231.2000000000003,null,7,"AMESBURY",0,2094.88,136.32,0,2231.2000000000003,1.0000000000218279E-2,2231.19]
[8,"AMHERST",1119.98,63.53,0,1183.51,null,8,"AMHERST",0,1119.98,63.53,0,1183.51,0,1183.51]
[9,"ANDOVER",5770.4,357.73,0,6128.1299999999992,null,9,"ANDOVER",0,5770.4,357.73,0,6128.1299999999992,0,6128.13]
[10,"ARLINGTON",5036.62,235.77,0,5272.39,null,10,"ARLINGTON",0,5036.62,235.77,0,5272.39,1.0000000000218279E-2,5272.38]
[11,"ASHBURNHAM",0,0,0,0,null,11,"ASHBURNHAM",0,0,0,0,0,0,0]
{"$rows_left_out":431}
{"sheet":"tuitioncalc","index":4,"n_rows":21,"n_cols":18,"rows_kept":21,"cut":false,"hidden":true,"merged":[[1,0,1,16],[2,0,2,16],[3,0,3,15]]}
[]
["Massachusetts Department of Elementary and Secondary Education"]
["Office of School Finance"]
["FY16 School Choice Rate"]
[]
[null," ------- Instructional Expenditures -------- ",null,null,null," ---------- Expenditures For Pupil Services ------------------",null,null,null," - Expenditures For Administration, Maintenance & Fixed Charges -",null,null,null,null,"Full-Time "]
[null,"From ","From  ",null,null,"From ","From  ",null,null,"From ","From  ",null,null,"Total Expend-","Equivalent ","Average"]
[null,"General","School Choice",null,null,"General","School Choice",null,null,"General","School Choice",null,null,"itures for","Average","Cost","Allowed"]
[null,"Fund","& Tuition Funds","Total",null,"Fund","& Tuition Funds","Total",null,"Fund","& Tuition Funds","Total",null,"Choice Rate","Membership","Per Pupil","Cost"]
[{"$f":"lastlea&\" \"&VLOOKUP(lastlea,code436,2)","v":"885 WHITTIER                     "}]
[]
[]
["Regular Day Total",{"$f":"ROUND(eoy!E822,0)","v":0},{"$f":"ROUND($O13/$O$21*C$21,0)","v":16},{"$f":"B13+C13","v":16},null,{"$f":"ROUND($O13/$O$21*F$21,0)","v":193},{"$f":"ROUND($O13/$O$21*G$21,0)","v":12},{"$f":"F13+G13","v":205},null,{"$f":"ROUND(J$21*(D13/D$21),0)","v":10},{"$f":"ROUND(K$21*(D13/D$21),0)","v":0},{"$f":"J13+K13","v":10},null,{"$f":"D13+H13+L13","v":231},{"$f":"VLOOKUP(leaextract,membership,3)","v":0.13},{"$f":"IF(O13>0,ROUND(N13/O13,0),\" \")","v":1777},{"$f":"IF(O13>0,MINA(5000,ROUND(P13*0.75,0)),0)","v":1333},"ratereg"]
[]
["Special Needs in District",{"$f":"eoy!F822","v":1122595},{"$f":"ROUND($O15/$O$21*C$21,0)","v":10281},{"$f":"B15+C15","v":1132876},null,{"$f":"ROUND($O15/$O$21*F$21,0)","v":122065},{"$f":"ROUND($O15/$O$21*G$21,0)","v":7661},{"$f":"F15+G15","v":129726},null,{"$f":"ROUND(J$21*(D15/D$21),0)","v":702019},{"$f":"ROUND(K$21*(D15/D$21),0)","v":16565},{"$f":"J15+K15","v":718584},null,{"$f":"D15+H15+L15","v":1981186},{"$f":"VLOOKUP(leaextract,membership,4)","v":82.09},{"$f":"IF(O15>0,ROUND(N15/O15,0),\" \")","v":24134}]
[]
["left blank",null,null,null,null,null,null,null,null,null,null,null,null,null,null,{"$f":"IF(O17>0,ROUND(N17/O17,0),\" \")","v":" "},{"$f":"IF(O17>0,MINA(5000,ROUND(P17*0.75,0)),\" \")","v":" "}]
[]
["Occupational Day Senior High",{"$f":"eoy!G822","v":9733662},{"$f":"ROUND($O19/$O$21*C$21,0)","v":149023},{"$f":"B19+C19","v":9882685},null,{"$f":"ROUND($O19/$O$21*F$21,0)","v":1769244},{"$f":"ROUND($O19/$O$21*G$21,0)","v":111039},{"$f":"F19+G19","v":1880283},null,{"$f":"ROUND(J$21*(D19/D$21),0)","v":6124093},{"$f":"ROUND(K$21*(D19/D$21),0)","v":144501},{"$f":"J19+K19","v":6268594},null,{"$f":"D19+H19+L19","v":18031562},{"$f":"VLOOKUP(leaextract,membership,5)","v":1189.8399999999999},{"$f":"IF(O19>0,ROUND(N19/O19,0),\" \")","v":15155},{"$f":"IF(O19>0,MINA(5000,ROUND(P19*0.75,0)),\" \")","v":5000},"rateocced"]
[]
{"$rows_left_out":2}
{"sheet":"eoy","index":5,"n_rows":1305,"n_cols":27,"rows_kept":1305,"cut":false,"hidden":true,"merged":[[3,0,3,10],[4,0,4,10]]}
[null,null,"Copyright 2015 by Massachusetts Department of Elementary and Secondary Education.  Permission is hereby granted to Massachusetts public school officials to "]
[null,null,"to reproduce this document as needed to complete the 2014-2015 End of Year Financial Report.  All other rights reserved."]
[]
["Massachusetts Department of Elementary and Secondary Education"]
["FY15 END OF YEAR FINANCIAL REPORT"]
[null,null,null,null,"2015-10-27"]
[null,null,"885","WHITTIER","For all related information go to:",null,null,"http://www.doe.mass.edu/finance/accounting/eoy/?fy=15"]
[]
[null,null,"SCHEDULE 1",null,"1","2",3,4,5,6]
[null,null,"REVENUE AND EXPENDITURE SUMMARY"]
[null,null,null,null,null,null,"CH 74 VOC-"]
[null,null,null,null,"REGULAR","SPECIAL","ATIONAL/","OTHER","UNDISTRIB-"]
[null,null,"I. REVENUES",null,"DAY","EDUCATION","TECHNICAL","PROGRAMS","UTED","TOTAL"]
["Row",null,"Line","A. REVENUE FROM LOCAL SOURCES"]
[15,null,10,"Assessments Received by Regional Schools",null,null,null,null,12637157,12637157,null,null,null,null,null,null,null,null,null,null,null,null,null,null,null,null,{"$f":"ROW() - A15","v":0}]
[16,null,20,"E & D Fund Appropriations FY15: Revenues to Regional District",null,null,null,null,null,0,null,null,null,null,null,null,null,null,null,null,null,null,null,null,null,null,{"$f":"ROW() - A16","v":0}]
[17,null,30,"Tuition From Individuals",null,null,null,null,null,0,null,null,null,null,null,null,null,null,null,null,null,null,null,null,null,null,0]
[18,null,40,"Tuition From Other Districts in Comm.",null,null,null,null,null,0,null,null,null,null,null,null,null,null,null,null,null,null,null,null,null,null,0]
[19,null,50,"Tuition From Districts in Other States",null,null,45492,null,null,45492,null,null,null,null,null,null,null,null,null,null,null,null,null,null,null,null,0]
[20,null,60,"Previous Yr Unexpended Encumbrances (Carry Forward)",null,null,null,null,3571,3571,null,null,null,null,null,null,null,null,null,null,null,null,null,null,null,null,0]
{"$rows_left_out":1286}
{"sheet":"rate summary","index":6,"n_rows":21,"n_cols":5,"rows_kept":21,"cut":false,"hidden":false,"merged":[[3,1,3,4],[4,1,4,4],[0,0,0,5],[1,0,1,5]]}
["Massachusetts Department of Elementary and Secondary Education"]
["Office of School Finance"]
[]
[{"$f":"A7+1","v":736},"School Choice Rate Summary FY16"]
[{"$f":"IF(A6=1,\"\",VALUE(VLOOKUP(A6,lea_info,2)))","v":735}]
[395]
[735,{"$f":"IF($A$7=\"\",\"\",VLOOKUP($A$7,code436,2))","v":"NORTH MIDDLESEX              "}]
[]
[null,{"$f":"IF(A7=\"\",\"\",IF(VLOOKUP(A7,webmessage,8)=\"\",\"\",VLOOKUP(A7,webmessage,8)))","v":""}]
[]
[null,null,null,"Regular","Vocational"]
[null,"Instructional Services",null,{"$f":"IF($A$7=\"\",\"\",VLOOKUP($A$7,dataout,6))","v":14752761},{"$f":"IF($A$7=\"\",\"\",VLOOKUP($A$7,dataout,14))","v":0}]
[null,"Pupil Services",null,{"$f":"IF($A$7=\"\",\"\",VLOOKUP($A$7,dataout,7))","v":3095579},{"$f":"IF($A$7=\"\",\"\",VLOOKUP($A$7,dataout,15))","v":0}]
[null,"Administration and Fixed Charges",null,{"$f":"IF($A$7=\"\",\"\",VLOOKUP($A$7,dataout,8))","v":8723494},{"$f":"IF($A$7=\"\",\"\",VLOOKUP($A$7,dataout,16))","v":0}]
[null,"Total Expenditure",null,{"$f":"IF($A$7=\"\",\"\",VLOOKUP($A$7,dataout,9))","v":26571834},{"$f":"IF($A$7=\"\",\"\",VLOOKUP($A$7,dataout,17))","v":0}]
[null,"FTE Average Membership",null,{"$f":"IF($A$7=\"\",\"\",VLOOKUP($A$7,dataout,10))","v":3066.36},{"$f":"IF($A$7=\"\",\"\",VLOOKUP($A$7,dataout,18))","v":0}]
[null,"Average Cost",null,{"$f":"IF(A7=\"\",\"\",VLOOKUP($A$7,dataout,11))","v":8666},{"$f":"IF($A$7=\"\",\"\",VLOOKUP($A$7,dataout,19))","v":" "}]
[null,"Eligible Rate*",null,{"$f":"IF(A7=\"\",\"\",VLOOKUP($A$7,dataout,12))","v":5000},{"$f":"IF($A$7=\"\",\"\",VLOOKUP($A$7,dataout,20))","v":" "}]
[]
[]
{"$rows_left_out":2}
{"sheet":"dataout","index":7,"n_rows":447,"n_cols":20,"rows_kept":447,"cut":false,"hidden":true,"merged":[[4,5,4,11],[4,12,4,19]]}
[]
[]
[]
[null,null,{"$f":"COUNTIF(C10:C447,\"Y\")","v":184}]
[null,null,null,null,null,"    -----------------------------------------regular ed -------------------------------------------------",null,null,null,null,null,null,"    -----------------------------------------vocational-------------------------------------------------"]
[null,null,"FY16",null,null,null,null,null,null,"average",null,null,null,null,null,null,null,"average"]
[null,null,"Choice","eoy year or","Date",null,"pupil","fixed",null,"member-","average","allowed",null,null,"pupil","fixed",null,"member-","average","allowed"]
[null,null,"District?","\"not in\"","Run","instructional","services","charges","total","ship","cost","cost",null,"instructional","services","charges","total","ship","cost","cost"]
["lea","district"]
[1,"ABINGTON","Y",null,"2016-06-15",8733024,2076999,4276349,15086372,1866.98,8081,5000,null,0,0,0,0,0," "," "]
[2,"ACTON"]
[3,"ACUSHNET"]
[4,"ADAMS"]
[5,"AGAWAM                       ","Y",null,"2016-06-15",18795316,3499660,10307626,32602602,3706.91,8795,5000,null,813,71392,446,72651,75.62,961,721]
[6,"ALFORD"]
[7,"AMESBURY                     ","Y",null,"2016-06-15",9828206,2264530,5294592,17387328,2094.88,8300,5000,null,0,0,0,0,0," "," "]
[8,"AMHERST","Y",null,"2016-06-15",8025536,1596220,4919781,14541537,1119.98,12984,5000,null,0,0,0,0,0," "," "]
[9,"ANDOVER"]
[10,"ARLINGTON"]
[11,"ASHBURNHAM"]
{"$rows_left_out":428}
{"sheet":"webmessage","index":8,"n_rows":447,"n_cols":21,"rows_kept":447,"cut":false,"hidden":true,"merged":[]}
[null,null,null,null,null,null,null,"updated 6/15/2016"]
[]
[null,null,null,null,null,null,"0NO - don't show, non-op"]
[null,null,null,null,null,null,"1NO - not choice district"]
[null,null,null,null,null,null,"1Y0  - show"]
[null,null,null,null,null,null,"1Y2 - est $5k rate in use"]
[null,null,null,"which",null,null,"1T0 - tuition agreement",null,null,"for input to choicecalc"]
[null,null,null,"year's"]
["lea","opcode","choice?","rate?",null,"dist","Status","comment","lea","choice?","bad","reg","voke",null,null,null,null,"lea"]
[{"$f":"VALUE(E10)","v":1},1,{"$f":"IF(dataout!C10=\"Y\",\"Y\",IF(dataout!C10=\"T\",\"T\",\"N\"))","v":"Y"},{"$f":"IF(AND(dataout!C10=\"Y\",dataout!D10=\"not in\"),2,0)","v":0},"001","ABINGTON                     ",{"$f":"B10&C10&D10","v":"1Y0"},null,{"$f":"A10","v":1},{"$f":"C10","v":"Y"},{"$f":"IF(G10=\"1Y2\",\"bad\",\" \")","v":" "},{"$f":"dataout!L10","v":5000},{"$f":"dataout!T10","v":" "},{"$f":"O10-A10","v":0},1,"ABINGTON",null,252,"ROCKPORT","y","bad"]
[{"$f":"VALUE(E11)","v":2},0,{"$f":"IF(dataout!C11=\"Y\",\"Y\",IF(dataout!C11=\"T\",\"T\",\"N\"))","v":"N"},{"$f":"IF(AND(dataout!C11=\"Y\",dataout!D11=\"not in\"),2,0)","v":0},"002","ACTON                        ",{"$f":"B11&C11&D11","v":"0N0"},"You have chosen a non-operating school district",{"$f":"A11","v":2},{"$f":"C11","v":"N"},{"$f":"IF(G11=\"1Y2\",\"bad\",\" \")","v":" "},{"$f":"dataout!L11","v":0},{"$f":"dataout!T11","v":0},{"$f":"O11-A11","v":0},2,"ACTON",null,337,"WHATELY","y","bad"]
[3,1,{"$f":"IF(dataout!C12=\"Y\",\"Y\",IF(dataout!C12=\"T\",\"T\",\"N\"))","v":"N"},{"$f":"IF(AND(dataout!C12=\"Y\",dataout!D12=\"not in\"),2,0)","v":0},"003","ACUSHNET                     ","1N0","You have chosen a district that does not enroll school choice pupils in FY16",3,"N"," ",{"$f":"dataout!L12","v":0},{"$f":"dataout!T12","v":0},0,3,"ACUSHNET",null,343,"WINCHENDON","y","bad"]
[4,0,{"$f":"IF(dataout!C13=\"Y\",\"Y\",IF(dataout!C13=\"T\",\"T\",\"N\"))","v":"N"},{"$f":"IF(AND(dataout!C13=\"Y\",dataout!D13=\"not in\"),2,0)","v":0},"004","ADAMS                        ","0N0","You have chosen a non-operating school district",4,"N"," ",{"$f":"dataout!L13","v":0},{"$f":"dataout!T13","v":0},0,4,"ADAMS",null,349,"WORTHINGTON","y","bad"]
[5,1,{"$f":"IF(dataout!C14=\"Y\",\"Y\",IF(dataout!C14=\"T\",\"T\",\"N\"))","v":"Y"},{"$f":"IF(AND(dataout!C14=\"Y\",dataout!D14=\"not in\"),2,0)","v":0},"005","AGAWAM                       ","1Y0",null,5,"Y"," ",{"$f":"dataout!L14","v":5000},{"$f":"dataout!T14","v":721},0,5,"AGAWAM                       ",null,750,"PIONEER","y","bad"]
[6,0,{"$f":"IF(dataout!C15=\"Y\",\"Y\",IF(dataout!C15=\"T\",\"T\",\"N\"))","v":"N"},{"$f":"IF(AND(dataout!C15=\"Y\",dataout!D15=\"not in\"),2,0)","v":0},"006","ALFORD                       ","0N0","You have chosen a non-operating school district",6,"N"," ",{"$f":"dataout!L15","v":0},{"$f":"dataout!T15","v":0},0,6,"ALFORD",null,7,"AMESBURY","y","notin"]
[7,1,{"$f":"IF(dataout!C16=\"Y\",\"Y\",IF(dataout!C16=\"T\",\"T\",\"N\"))","v":"Y"},{"$f":"IF(AND(dataout!C16=\"Y\",dataout!D16=\"not in\"),2,0)","v":0},"007","AMESBURY                     ","1Y0",null,7,"Y"," ",{"$f":"dataout!L16","v":5000},{"$f":"dataout!T16","v":" "},0,7,"AMESBURY                     ",null,44,"BROCKTON","y","notin"]
[8,1,{"$f":"IF(dataout!C17=\"Y\",\"Y\",IF(dataout!C17=\"T\",\"T\",\"N\"))","v":"Y"},{"$f":"IF(AND(dataout!C17=\"Y\",dataout!D17=\"not in\"),2,0)","v":0},"008","AMHERST                      ","1Y0",null,8,"Y"," ",{"$f":"dataout!L17","v":5000},{"$f":"dataout!T17","v":" "},0,8,"AMHERST",null,56,"CHELMSFORD","y","notin"]
[9,1,{"$f":"IF(dataout!C18=\"Y\",\"Y\",IF(dataout!C18=\"T\",\"T\",\"N\"))","v":"N"},{"$f":"IF(AND(dataout!C18=\"Y\",dataout!D18=\"not in\"),2,0)","v":0},"009","ANDOVER                      ","1N0","You have chosen a district that does not enroll school choice pupils in FY16",9,"N"," ",{"$f":"dataout!L18","v":0},{"$f":"dataout!T18","v":0},0,9,"ANDOVER",null,64,"CLINTON","y","notin"]
[10,1,{"$f":"IF(dataout!C19=\"Y\",\"Y\",IF(dataout!C19=\"T\",\"T\",\"N\"))","v":"N"},{"$f":"IF(AND(dataout!C19=\"Y\",dataout!D19=\"not in\"),2,0)","v":0},"010","ARLINGTON                    ","1N0","You have chosen a district that does not enroll school choice pupils in FY16",10,"N"," ",{"$f":"dataout!L19","v":0},{"$f":"dataout!T19","v":0},0,10,"ARLINGTON",null,77,"DOUGLAS","y","notin"]
[11,0,{"$f":"IF(dataout!C20=\"Y\",\"Y\",IF(dataout!C20=\"T\",\"T\",\"N\"))","v":"N"},{"$f":"IF(AND(dataout!C20=\"Y\",dataout!D20=\"not in\"),2,0)","v":0},"011","ASHBURNHAM                   ","0N0","You have chosen a non-operating school district",11,"N"," ",{"$f":"dataout!L20","v":0},{"$f":"dataout!T20","v":0},0,11,"ASHBURNHAM",null,97,"FITCHBURG","y","notin"]
{"$rows_left_out":427}