{"text_format":"1","workbook":"xlsx","n_sheets":9,"sheets":["code436","notes","leas","membership","tuitioncalc","eoy","rate summary","dataout","webmessage"],"not_rendered":{"charts":0,"images":0,"macros":1,"external_links":43,"defined_names":46,"comments":0,"pivot_tables":0},"unopened":[],"bounds":{"document_bytes":16777216,"sheet_cells":100000,"rows_first":2000,"rows_last":500,"rows_between":2000,"halvings":0,"cell_chars":16384,"cell_head_chars":4096},"cells_cut":0,"cells_raw":0,"read":"whole","date_system":"1900"}

{"sheet":"code436","index":0,"n_rows":447,"n_cols":10,"rows_kept":447,"cut":false,"hidden":true,"merged":[]}
[null,null,null,null,null,null,1,"district_code","district_short_name","Select an lea"]
[null,null,null,null,null,null,2,"001","ABINGTON                     ",{"$f":"H2&\" \"&I2","v":"001 ABINGTON                     "}]
[null,null,null,null,null,null,3,"002","ACTON                        ",{"$f":"H3&\" \"&I3","v":"002 ACTON                        "}]
[null,null,null,null,null,null,4,"003","ACUSHNET                     ","003 ACUSHNET                     "]
[null,null,null,null,null,null,5,"004","ADAMS                        ","004 ADAMS                        "]
[null,null,null,null,null,null,6,"005","AGAWAM                       ","005 AGAWAM                       "]
[null,null,null,null,null,null,7,"006","ALFORD                       ","006 ALFORD                       "]
[null,null,null,null,null,null,8,"007","AMESBURY                     ","007 AMESBURY                     "]
["lea","dist","string","order436","operating",null,9,"008","AMHERST                      ","008 AMHERST                      "]
[1,"ABINGTON                     ","001",1,1,null,10,"009","ANDOVER                      ","009 ANDOVER                      "]
[2,"ACTON                        ","002",2,0,null,11,"010","ARLINGTON                    ","010 ARLINGTON                    "]
[3,"ACUSHNET                     ","003",3,1,null,12,"011","ASHBURNHAM                   ","011 ASHBURNHAM                   "]
[4,"ADAMS                        ","004",4,0,null,13,"012","ASHBY                        ","012 ASHBY                        "]
[5,"AGAWAM                       ","005",5,1,null,14,"013","ASHFIELD                     ","013 ASHFIELD                     "]
[6,"ALFORD                       ","006",6,0,null,15,"014","ASHLAND                      ","014 ASHLAND                      "]
[7,"AMESBURY                     ","007",7,1,null,16,"015","ATHOL                        ","015 ATHOL                        "]
[8,"AMHERST                      ","008",8,1,null,17,"016","ATTLEBORO                    ","016 ATTLEBORO                    "]
[9,"ANDOVER                      ","009",9,1,null,18,"017","AUBURN                       ","017 AUBURN                       "]
[10,"ARLINGTON                    ","010",10,1,null,19,"018","AVON                         ","018 AVON                         "]
[11,"ASHBURNHAM                   ","011",11,0,null,20,"019","AYER                         ","019 AYER                         "]
[12,"ASHBY                        ","012",12,0,null,21,"020","BARNSTABLE                   ","020 BARNSTABLE                   "]
[13,"ASHFIELD                     ","013",13,0,null,22,"021","BARRE                        ","021 BARRE                        "]
[14,"ASHLAND                      ","014",14,1,null,23,"022","BECKET                       ","022 BECKET                       "]
[15,"ATHOL                        ","015",15,0,null,24,"023","BEDFORD                      ","023 BEDFORD                      "]
[16,"ATTLEBORO                    ","016",16,1,null,25,"024","BELCHERTOWN                  ","024 BELCHERTOWN                  "]
[17,"AUBURN                       ","017",17,1,null,26,"025","BELLINGHAM                   ","025 BELLINGHAM                   "]
[18,"AVON                         ","018",18,1,null,27,"026","BELMONT                      ","026 BELMONT                      "]
[19,"AYER                         ","019",19,0,null,28,"027","BERKLEY                      ","027 BERKLEY                      "]
[20,"BARNSTABLE                   ","020",20,1,null,29,"028","BERLIN                       ","028 BERLIN                       "]
[21,"BARRE                        ","021",21,0,null,30,"029","BERNARDSTON                  ","029 BERNARDSTON                  "]
[22,"BECKET                       ","022",22,0,null,31,"030","BEVERLY                      ","030 BEVERLY                      "]
[23,"BEDFORD                      ","023",23,1,null,32,"031","BILLERICA                    ","031 BILLERICA                    "]
[24,"BELCHERTOWN                  ","024",24,1,null,33,"032","BLACKSTONE                   ","032 BLACKSTONE                   "]
[25,"BELLINGHAM                   ","025",25,1,null,34,"033","BLANDFORD                    ","033 BLANDFORD                    "]
[26,"BELMONT                      ","026",26,1,null,35,"034","BOLTON                       ","034 BOLTON                       "]
[27,"BERKLEY                      ","027",27,1,null,36,"035","BOSTON                       ","035 BOSTON                       "]
[28,"BERLIN                       ","028",28,1,null,37,"036","BOURNE                       ","036 BOURNE                       "]
[29,"BERNARDSTON                  ","029",29,0,null,38,"037","BOXBOROUGH                   ","037 BOXBOROUGH                   "]
[30,"BEVERLY                      ","030",30,1,null,39,"038","BOXFORD                      ","038 BOXFORD                      "]
[31,"BILLERICA                    ","031",31,1,null,40,"039","BOYLSTON                     ","039 BOYLSTON                     "]
[32,"BLACKSTONE                   ","032",32,0,null,41,"040","BRAINTREE                    ","040 BRAINTREE                    "]
[33,"BLANDFORD                    ","033",33,0,null,42,"041","BREWSTER                     ","041 BREWSTER                     "]
[34,"BOLTON                       ","034",34,0,null,43,"042","BRIDGEWATER                  ","042 BRIDGEWATER                  "]
[35,"BOSTON                       ","035",35,1,null,44,"043","BRIMFIELD                    ","043 BRIMFIELD                    "]
[36,"BOURNE                       ","036",36,1,null,45,"044","BROCKTON                     ","044 BROCKTON                     "]
[37,"BOXBOROUGH                   ","037",37,0,null,46,"045","BROOKFIELD                   ","045 BROOKFIELD                   "]
[38,"BOXFORD                      ","038",38,1,null,47,"046","BROOKLINE                    ","046 BROOKLINE                    "]
[39,"BOYLSTON                     ","039",39,1,null,48,"047","BUCKLAND                     ","047 BUCKLAND                     "]
[40,"BRAINTREE                    ","040",40,1,null,49,"048","BURLINGTON                   ","048 BURLINGTON                   "]
[41,"BREWSTER                     ","041",41,1,null,50,"049","CAMBRIDGE                    ","049 CAMBRIDGE                    "]
[42,"BRIDGEWATER                  ","042",42,0,null,51,"050","CANTON                       ","050 CANTON                       "]
[43,"BRIMFIELD                    ","043",43,1,null,52,"051","CARLISLE                     ","051 CARLISLE                     "]
[44,"BROCKTON                     ","044",44,1,null,53,"052","CARVER                       ","052 CARVER                       "]
[45,"BROOKFIELD                   ","045",45,1,null,54,"053","CHARLEMONT                   ","053 CHARLEMONT                   "]
[46,"BROOKLINE                    ","046",46,1,null,55,"054","CHARLTON                     ","054 CHARLTON                     "]
[47,"BUCKLAND                     ","047",47,0,null,56,"055","CHATHAM                      ","055 CHATHAM                      "]
[48,"BURLINGTON                   ","048",48,1,null,57,"056","CHELMSFORD                   ","056 CHELMSFORD                   "]
[49,"CAMBRIDGE                    ","049",49,1,null,58,"057","CHELSEA                      ","057 CHELSEA                      "]
[50,"CANTON                       ","050",50,1,null,59,"058","CHESHIRE                     ","058 CHESHIRE                     "]
[51,"CARLISLE                     ","051",51,1,null,60,"059","CHESTER                      ","059 CHESTER                      "]
[52,"CARVER                       ","052",52,1,null,61,"060","CHESTERFIELD                 ","060 CHESTERFIELD                 "]
[53,"CHARLEMONT                   ","053",53,0,null,62,"061","CHICOPEE                     ","061 CHICOPEE                     "]
[54,"CHARLTON                     ","054",54,0,null,63,"062","CHILMARK                     ","062 CHILMARK                     "]
[55,"CHATHAM                      ","055",55,1,null,64,"063","CLARKSBURG                   ","063 CLARKSBURG                   "]
[56,"CHELMSFORD                   ","056",56,1,null,65,"064","CLINTON                      ","064 CLINTON                      "]
[57,"CHELSEA                      ","057",57,1,null,66,"065","COHASSET                     ","065 COHASSET                     "]
[58,"CHESHIRE                     ","058",58,0,null,67,"066","COLRAIN                      ",{"$f":"H67&\" \"&I67","v":"066 COLRAIN                      "}]
[59,"CHESTER                      ","059",59,0,null,68,"067","CONCORD                      ","067 CONCORD                      "]
[60,"CHESTERFIELD                 ","060",60,0,null,69,"068","CONWAY                       ","068 CONWAY                       "]
[61,"CHICOPEE                     ","061",61,1,null,70,"069","CUMMINGTON                   ","069 CUMMINGTON                   "]
[62,"CHILMARK                     ","062",62,0,null,71,"070","DALTON                       ","070 DALTON                       "]
[63,"CLARKSBURG                   ","063",63,1,null,72,"071","DANVERS                      ","071 DANVERS                      "]
[64,"CLINTON                      ","064",64,1,null,73,"072","DARTMOUTH                    ","072 DARTMOUTH                    "]
[65,"COHASSET                     ","065",65,1,null,74,"073","DEDHAM                       ","073 DEDHAM                       "]
[66,"COLRAIN                      ","066",66,0,null,75,"074","DEERFIELD                    ","074 DEERFIELD                    "]
[67,"CONCORD                      ","067",67,1,null,76,"075","DENNIS                       ","075 DENNIS                       "]
[68,"CONWAY                       ","068",68,1,null,77,"076","DIGHTON                      ","076 DIGHTON                      "]
[69,"CUMMINGTON                   ","069",69,0,null,78,"077","DOUGLAS                      ","077 DOUGLAS                      "]
[70,"DALTON                       ","070",70,0,null,79,"078","DOVER                        ","078 DOVER                        "]
[71,"DANVERS                      ","071",71,1,null,80,"079","DRACUT                       ","079 DRACUT                       "]
[72,"DARTMOUTH                    ","072",72,1,null,81,"080","DUDLEY                       ","080 DUDLEY                       "]
[73,"DEDHAM                       ","073",73,1,null,82,"081","DUNSTABLE                    ","081 DUNSTABLE                    "]
[74,"DEERFIELD                    ","074",74,1,null,83,"082","DUXBURY                      ","082 DUXBURY                      "]
[75,"DENNIS                       ","075",75,0,null,84,"083","EAST BRIDGEWATER             ","083 EAST BRIDGEWATER             "]
[76,"DIGHTON                      ","076",76,0,null,85,"084","EAST BROOKFIELD              ","084 EAST BROOKFIELD              "]
[77,"DOUGLAS                      ","077",77,1,null,86,"085","EASTHAM                      ","085 EASTHAM                      "]
[78,"DOVER                        ","078",78,1,null,87,"086","EASTHAMPTON                  ","086 EASTHAMPTON                  "]
[79,"DRACUT                       ","079",79,1,null,88,"087","EAST LONGMEADOW              ","087 EAST LONGMEADOW              "]
[80,"DUDLEY                       ","080",80,0,null,89,"088","EASTON                       ","088 EASTON                       "]
[81,"DUNSTABLE                    ","081",81,0,null,90,"089","EDGARTOWN                    ","089 EDGARTOWN                    "]
[82,"DUXBURY                      ","082",82,1,null,91,"090","EGREMONT                     ","090 EGREMONT                     "]
[83,"EAST BRIDGEWATER             ","083",83,1,null,92,"091","ERVING                       ","091 ERVING                       "]
[84,"EAST BROOKFIELD              ","084",84,0,null,93,"092","ESSEX                        ","092 ESSEX                        "]
[85,"EASTHAM                      ","085",85,1,null,94,"093","EVERETT                      ","093 EVERETT                      "]
[86,"EASTHAMPTON                  ","086",86,1,null,95,"094","FAIRHAVEN                    ","094 FAIRHAVEN                    "]
[87,"EAST LONGMEADOW              ","087",87,1,null,96,"095","FALL RIVER                   ","095 FALL RIVER                   "]
[88,"EASTON                       ","088",88,1,null,97,"096","FALMOUTH                     ","096 FALMOUTH                     "]
[89,"EDGARTOWN                    ","089",89,1,null,98,"097","FITCHBURG                    ","097 FITCHBURG                    "]
[90,"EGREMONT                     ","090",90,0,null,99,"098","FLORIDA                      ","098 FLORIDA                      "]
[91,"ERVING                       ","091",91,1,null,100,"099","FOXBOROUGH                   ","099 FOXBOROUGH                   "]
[92,"ESSEX                        ","092",92,0,null,101,100,"FRAMINGHAM                   ","100 FRAMINGHAM                   "]
[93,"EVERETT                      ","093",93,1,null,102,101,"FRANKLIN                     ","101 FRANKLIN                     "]
[94,"FAIRHAVEN                    ","094",94,1,null,103,102,"FREETOWN                     ","102 FREETOWN                     "]
[95,"FALL RIVER                   ","095",95,1,null,104,103,"GARDNER                      ","103 GARDNER                      "]
[96,"FALMOUTH                     ","096",96,1,null,105,104,"GAY HEAD                     ","104 GAY HEAD                     "]
[97,"FITCHBURG                    ","097",97,1,null,106,105,"GEORGETOWN                   ","105 GEORGETOWN                   "]
[98,"FLORIDA                      ","098",98,1,null,107,106,"GILL                         ","106 GILL                         "]
[99,"FOXBOROUGH                   ","099",99,1,null,108,107,"GLOUCESTER                   ","107 GLOUCESTER                   "]
[100,"FRAMINGHAM                   ","100",100,1,null,109,108,"GOSHEN                       ","108 GOSHEN                       "]
[101,"FRANKLIN                     ","101",101,1,null,110,109,"GOSNOLD                      ","109 GOSNOLD                      "]
[102,"FREETOWN                     ","102",102,0,null,111,110,"GRAFTON                      ","110 GRAFTON                      "]
[103,"GARDNER                      ","103",103,1,null,112,111,"GRANBY                       ","111 GRANBY                       "]
[104,"GAY HEAD                     ","104",104,0,null,113,112,"GRANVILLE                    ","112 GRANVILLE                    "]
[105,"GEORGETOWN                   ","105",105,1,null,114,113,"GREAT BARRINGTON             ","113 GREAT BARRINGTON             "]
[106,"GILL                         ","106",106,0,null,115,114,"GREENFIELD                   ","114 GREENFIELD                   "]
[107,"GLOUCESTER                   ","107",107,1,null,116,115,"GROTON                       ","115 GROTON                       "]
[108,"GOSHEN                       ","108",108,0,null,117,116,"GROVELAND                    ","116 GROVELAND                    "]
[109,"GOSNOLD                      ","109",109,0,null,118,117,"HADLEY                       ","117 HADLEY                       "]
[110,"GRAFTON                      ","110",110,1,null,119,118,"HALIFAX                      ","118 HALIFAX                      "]
[111,"GRANBY                       ","111",111,1,null,120,119,"HAMILTON                     ","119 HAMILTON                     "]
[112,"GRANVILLE                    ","112",112,1,null,121,120,"HAMPDEN                      ","120 HAMPDEN                      "]
[113,"GREAT BARRINGTON             ","113",113,0,null,122,121,"HANCOCK                      ","121 HANCOCK                      "]
[114,"GREENFIELD                   ","114",114,1,null,123,122,"HANOVER                      ","122 HANOVER                      "]
[115,"GROTON                       ","115",115,0,null,124,123,"HANSON                       ","123 HANSON                       "]
[116,"GROVELAND                    ","116",116,0,null,125,124,"HARDWICK                     ","124 HARDWICK                     "]
[117,"HADLEY                       ","117",117,1,null,126,125,"HARVARD                      ","125 HARVARD                      "]
[118,"HALIFAX                      ","118",118,1,null,127,126,"HARWICH                      ","126 HARWICH                      "]
[119,"HAMILTON                     ","119",119,0,null,128,127,"HATFIELD                     ","127 HATFIELD                     "]
[120,"HAMPDEN                      ","120",120,0,null,129,128,"HAVERHILL                    ","128 HAVERHILL                    "]
[121,"HANCOCK                      ","121",121,1,null,130,129,"HAWLEY                       ","129 HAWLEY                       "]
[122,"HANOVER                      ","122",122,1,null,131,130,"HEATH                        ",{"$f":"H131&\" \"&I131","v":"130 HEATH                        "}]
[123,"HANSON                       ","123",123,0,null,132,131,"HINGHAM                      ","131 HINGHAM                      "]
[124,"HARDWICK                     ","124",124,0,null,133,132,"HINSDALE                     ","132 HINSDALE                     "]
[125,"HARVARD                      ","125",125,1,null,134,133,"HOLBROOK                     ","133 HOLBROOK                     "]
[126,"HARWICH                      ","126",126,1,null,135,134,"HOLDEN                       ","134 HOLDEN                       "]
[127,"HATFIELD                     ","127",127,1,null,136,135,"HOLLAND                      ","135 HOLLAND                      "]
[128,"HAVERHILL                    ","128",128,1,null,137,136,"HOLLISTON                    ","136 HOLLISTON                    "]
[129,"HAWLEY                       ","129",129,0,null,138,137,"HOLYOKE                      ","137 HOLYOKE                      "]
[130,"HEATH                        ","130",130,0,null,139,138,"HOPEDALE                     ","138 HOPEDALE                     "]
[131,"HINGHAM                      ","131",131,1,null,140,139,"HOPKINTON                    ","139 HOPKINTON                    "]
[132,"HINSDALE                     ","132",132,0,null,141,140,"HUBBARDSTON                  ","140 HUBBARDSTON                  "]
[133,"HOLBROOK                     ","133",133,1,null,142,141,"HUDSON                       ","141 HUDSON                       "]
[134,"HOLDEN                       ","134",134,0,null,143,142,"HULL                         ","142 HULL                         "]
[135,"HOLLAND                      ","135",135,1,null,144,143,"HUNTINGTON                   ","143 HUNTINGTON                   "]
[136,"HOLLISTON                    ","136",136,1,null,145,144,"IPSWICH                      ","144 IPSWICH                      "]
[137,"HOLYOKE                      ","137",137,1,null,146,145,"KINGSTON                     ","145 KINGSTON                     "]
[138,"HOPEDALE                     ","138",138,1,null,147,146,"LAKEVILLE                    ","146 LAKEVILLE                    "]
[139,"HOPKINTON                    ","139",139,1,null,148,147,"LANCASTER                    ","147 LANCASTER                    "]
[140,"HUBBARDSTON                  ","140",140,0,null,149,148,"LANESBOROUGH                 ","148 LANESBOROUGH                 "]
[141,"HUDSON                       ","141",141,1,null,150,149,"LAWRENCE                     ","149 LAWRENCE                     "]
[142,"HULL                         ","142",142,1,null,151,150,"LEE                          ","150 LEE                          "]
[143,"HUNTINGTON                   ","143",143,0,null,152,151,"LEICESTER                    ","151 LEICESTER                    "]
[144,"IPSWICH                      ","144",144,1,null,153,152,"LENOX                        ","152 LENOX                        "]
[145,"KINGSTON                     ","145",145,1,null,154,153,"LEOMINSTER                   ","153 LEOMINSTER                   "]
[146,"LAKEVILLE                    ","146",146,0,null,155,154,"LEVERETT                     ","154 LEVERETT                     "]
[147,"LANCASTER                    ","147",147,0,null,156,155,"LEXINGTON                    ","155 LEXINGTON                    "]
[148,"LANESBOROUGH                 ","148",148,1,null,157,156,"LEYDEN                       ","156 LEYDEN                       "]
[149,"LAWRENCE                     ","149",149,1,null,158,157,"LINCOLN                      ","157 LINCOLN                      "]
[150,"LEE                          ","150",150,1,null,159,158,"LITTLETON                    ","158 LITTLETON                    "]
[151,"LEICESTER                    ","151",151,1,null,160,159,"LONGMEADOW                   ","159 LONGMEADOW                   "]
[152,"LENOX                        ","152",152,1,null,161,160,"LOWELL                       ","160 LOWELL                       "]
[153,"LEOMINSTER                   ","153",153,1,null,162,161,"LUDLOW                       ","161 LUDLOW                       "]
[154,"LEVERETT                     ","154",154,1,null,163,162,"LUNENBURG                    ","162 LUNENBURG                    "]
[155,"LEXINGTON                    ","155",155,1,null,164,163,"LYNN                         ","163 LYNN                         "]
[156,"LEYDEN                       ","156",156,0,null,165,164,"LYNNFIELD                    ","164 LYNNFIELD                    "]
[157,"LINCOLN                      ","157",157,1,null,166,165,"MALDEN                       ","165 MALDEN                       "]
[158,"LITTLETON                    ","158",158,1,null,167,166,"MANCHESTER                   ","166 MANCHESTER                   "]
[159,"LONGMEADOW                   ","159",159,1,null,168,167,"MANSFIELD                    ","167 MANSFIELD                    "]
[160,"LOWELL                       ","160",160,1,null,169,168,"MARBLEHEAD                   ","168 MARBLEHEAD                   "]
[161,"LUDLOW                       ","161",161,1,null,170,169,"MARION                       ","169 MARION                       "]
[162,"LUNENBURG                    ","162",162,1,null,171,170,"MARLBOROUGH                  ","170 MARLBOROUGH                  "]
[163,"LYNN                         ","163",163,1,null,172,171,"MARSHFIELD                   ","171 MARSHFIELD                   "]
[164,"LYNNFIELD                    ","164",164,1,null,173,172,"MASHPEE                      ","172 MASHPEE                      "]
[165,"MALDEN                       ","165",165,1,null,174,173,"MATTAPOISETT                 ","173 MATTAPOISETT                 "]
[166,"MANCHESTER                   ","166",166,0,null,175,174,"MAYNARD                      ","174 MAYNARD                      "]
[167,"MANSFIELD                    ","167",167,1,null,176,175,"MEDFIELD                     ","175 MEDFIELD                     "]
[168,"MARBLEHEAD                   ","168",168,1,null,177,176,"MEDFORD                      ","176 MEDFORD                      "]
[169,"MARION                       ","169",169,1,null,178,177,"MEDWAY                       ","177 MEDWAY                       "]
[170,"MARLBOROUGH                  ","170",170,1,null,179,178,"MELROSE                      ","178 MELROSE                      "]
[171,"MARSHFIELD                   ","171",171,1,null,180,179,"MENDON                       ","179 MENDON                       "]
[172,"MASHPEE                      ","172",172,1,null,181,180,"MERRIMAC                     ","180 MERRIMAC                     "]
[173,"MATTAPOISETT                 ","173",173,1,null,182,181,"METHUEN                      ","181 METHUEN                      "]
[174,"MAYNARD                      ","174",174,1,null,183,182,"MIDDLEBOROUGH                ","182 MIDDLEBOROUGH                "]
[175,"MEDFIELD                     ","175",175,1,null,184,183,"MIDDLEFIELD                  ","183 MIDDLEFIELD                  "]
[176,"MEDFORD                      ","176",176,1,null,185,184,"MIDDLETON                    ","184 MIDDLETON                    "]
[177,"MEDWAY                       ","177",177,1,null,186,185,"MILFORD                      ","185 MILFORD                      "]
[178,"MELROSE                      ","178",178,1,null,187,186,"MILLBURY                     ","186 MILLBURY                     "]
[179,"MENDON                       ","179",179,0,null,188,187,"MILLIS                       ","187 MILLIS                       "]
[180,"MERRIMAC                     ","180",180,0,null,189,188,"MILLVILLE                    ","188 MILLVILLE                    "]
[181,"METHUEN                      ","181",181,1,null,190,189,"MILTON                       ","189 MILTON                       "]
[182,"MIDDLEBOROUGH                ","182",182,1,null,191,190,"MONROE                       ","190 MONROE                       "]
[183,"MIDDLEFIELD                  ","183",183,0,null,192,191,"MONSON                       ","191 MONSON                       "]
[184,"MIDDLETON                    ","184",184,1,null,193,192,"MONTAGUE                     ","192 MONTAGUE                     "]
[185,"MILFORD                      ","185",185,1,null,194,193,"MONTEREY                     ","193 MONTEREY                     "]
[186,"MILLBURY                     ","186",186,1,null,195,194,"MONTGOMERY                   ",{"$f":"H195&\" \"&I195","v":"194 MONTGOMERY                   "}]
[187,"MILLIS                       ","187",187,1,null,196,195,"MOUNT WASHINGTON             ","195 MOUNT WASHINGTON             "]
[188,"MILLVILLE                    ","188",188,0,null,197,196,"NAHANT                       ","196 NAHANT                       "]
[189,"MILTON                       ","189",189,1,null,198,197,"NANTUCKET                    ","197 NANTUCKET                    "]
[190,"MONROE                       ","190",190,0,null,199,198,"NATICK                       ","198 NATICK                       "]
[191,"MONSON                       ","191",191,1,null,200,199,"NEEDHAM                      ","199 NEEDHAM                      "]
[192,"MONTAGUE                     ","192",192,0,null,201,200,"NEW ASHFORD                  ","200 NEW ASHFORD                  "]
[193,"MONTEREY                     ","193",193,0,null,202,201,"NEW BEDFORD                  ","201 NEW BEDFORD                  "]
[194,"MONTGOMERY                   ","194",194,0,null,203,202,"NEW BRAINTREE                ","202 NEW BRAINTREE                "]
[195,"MOUNT WASHINGTON             ","195",195,0,null,204,203,"NEWBURY                      ","203 NEWBURY                      "]
[196,"NAHANT                       ","196",196,1,null,205,204,"NEWBURYPORT                  ","204 NEWBURYPORT                  "]
[197,"NANTUCKET                    ","197",197,1,null,206,205,"NEW MARLBOROUGH              ","205 NEW MARLBOROUGH              "]
[198,"NATICK                       ","198",198,1,null,207,206,"NEW SALEM                    ","206 NEW SALEM                    "]
[199,"NEEDHAM                      ","199",199,1,null,208,207,"NEWTON                       ","207 NEWTON                       "]
[200,"NEW ASHFORD                  ","200",200,0,null,209,208,"NORFOLK                      ","208 NORFOLK                      "]
[201,"NEW BEDFORD                  ","201",201,1,null,210,209,"NORTH ADAMS                  ","209 NORTH ADAMS                  "]
[202,"NEW BRAINTREE                ","202",202,0,null,211,210,"NORTHAMPTON                  ","210 NORTHAMPTON                  "]
[203,"NEWBURY                      ","203",203,0,null,212,211,"NORTH ANDOVER                ","211 NORTH ANDOVER                "]
[204,"NEWBURYPORT                  ","204",204,1,null,213,212,"NORTH ATTLEBOROUGH           ","212 NORTH ATTLEBOROUGH           "]
[205,"NEW MARLBOROUGH              ","205",205,0,null,214,213,"NORTHBOROUGH                 ","213 NORTHBOROUGH                 "]
[206,"NEW SALEM                    ","206",206,0,null,215,214,"NORTHBRIDGE                  ","214 NORTHBRIDGE                  "]
[207,"NEWTON                       ","207",207,1,null,216,215,"NORTH BROOKFIELD             ","215 NORTH BROOKFIELD             "]
[208,"NORFOLK                      ","208",208,1,null,217,216,"NORTHFIELD                   ","216 NORTHFIELD                   "]
[209,"NORTH ADAMS                  ","209",209,1,null,218,217,"NORTH READING                ","217 NORTH READING                "]
[210,"NORTHAMPTON                  ","210",210,1,null,219,218,"NORTON                       ","218 NORTON                       "]
[211,"NORTH ANDOVER                ","211",211,1,null,220,219,"NORWELL                      ","219 NORWELL                      "]
[212,"NORTH ATTLEBOROUGH           ","212",212,1,null,221,220,"NORWOOD                      ","220 NORWOOD                      "]
[213,"NORTHBOROUGH                 ","213",213,1,null,222,221,"OAK BLUFFS                   ","221 OAK BLUFFS                   "]
[214,"NORTHBRIDGE                  ","214",214,1,null,223,222,"OAKHAM                       ","222 OAKHAM                       "]
[215,"NORTH BROOKFIELD             ","215",215,1,null,224,223,"ORANGE                       ","223 ORANGE                       "]
[216,"NORTHFIELD                   ","216",216,0,null,225,224,"ORLEANS                      ","224 ORLEANS                      "]
[217,"NORTH READING                ","217",217,1,null,226,225,"OTIS                         ","225 OTIS                         "]
[218,"NORTON                       ","218",218,1,null,227,226,"OXFORD                       ","226 OXFORD                       "]
[219,"NORWELL                      ","219",219,1,null,228,227,"PALMER                       ","227 PALMER                       "]
[220,"NORWOOD                      ","220",220,1,null,229,228,"PAXTON                       ","228 PAXTON                       "]
[221,"OAK BLUFFS                   ","221",221,1,null,230,229,"PEABODY                      ","229 PEABODY                      "]
[222,"OAKHAM                       ","222",222,0,null,231,230,"PELHAM                       ","230 PELHAM                       "]
[223,"ORANGE                       ","223",223,1,null,232,231,"PEMBROKE                     ","231 PEMBROKE                     "]
[224,"ORLEANS                      ","224",224,1,null,233,232,"PEPPERELL                    ","232 PEPPERELL                    "]
[225,"OTIS                         ","225",225,0,null,234,233,"PERU                         ","233 PERU                         "]
[226,"OXFORD                       ","226",226,1,null,235,234,"PETERSHAM                    ","234 PETERSHAM                    "]
[227,"PALMER                       ","227",227,1,null,236,235,"PHILLIPSTON                  ","235 PHILLIPSTON                  "]
[228,"PAXTON                       ","228",228,0,null,237,236,"PITTSFIELD                   ","236 PITTSFIELD                   "]
[229,"PEABODY                      ","229",229,1,null,238,237,"PLAINFIELD                   ","237 PLAINFIELD                   "]
[230,"PELHAM                       ","230",230,1,null,239,238,"PLAINVILLE                   ","238 PLAINVILLE                   "]
[231,"PEMBROKE                     ","231",231,1,null,240,239,"PLYMOUTH                     ","239 PLYMOUTH                     "]
[232,"PEPPERELL                    ","232",232,0,null,241,240,"PLYMPTON                     ","240 PLYMPTON                     "]
[233,"PERU                         ","233",233,0,null,242,241,"PRINCETON                    ","241 PRINCETON                    "]
[234,"PETERSHAM                    ","234",234,1,null,243,242,"PROVINCETOWN                 ","242 PROVINCETOWN                 "]
[235,"PHILLIPSTON                  ","235",235,0,null,244,243,"QUINCY                       ","243 QUINCY                       "]
[236,"PITTSFIELD                   ","236",236,1,null,245,244,"RANDOLPH                     ","244 RANDOLPH                     "]
[237,"PLAINFIELD                   ","237",237,0,null,246,245,"RAYNHAM                      ","245 RAYNHAM                      "]
[238,"PLAINVILLE                   ","238",238,1,null,247,246,"READING                      ","246 READING                      "]
[239,"PLYMOUTH                     ","239",239,1,null,248,247,"REHOBOTH                     ","247 REHOBOTH                     "]
[240,"PLYMPTON                     ","240",240,1,null,249,248,"REVERE                       ","248 REVERE                       "]
[241,"PRINCETON                    ","241",241,0,null,250,249,"RICHMOND                     ","249 RICHMOND                     "]
[242,"PROVINCETOWN                 ","242",242,1,null,251,250,"ROCHESTER                    ","250 ROCHESTER                    "]
[243,"QUINCY                       ","243",243,1,null,252,251,"ROCKLAND                     ","251 ROCKLAND                     "]
[244,"RANDOLPH                     ","244",244,1,null,253,252,"ROCKPORT                     ","252 ROCKPORT                     "]
[245,"RAYNHAM                      ","245",245,0,null,254,253,"ROWE                         ","253 ROWE                         "]
[246,"READING                      ","246",246,1,null,255,254,"ROWLEY                       ","254 ROWLEY                       "]
[247,"REHOBOTH                     ","247",247,0,null,256,255,"ROYALSTON                    ","255 ROYALSTON                    "]
[248,"REVERE                       ","248",248,1,null,257,256,"RUSSELL                      ","256 RUSSELL                      "]
[249,"RICHMOND                     ","249",249,1,null,258,257,"RUTLAND                      ","257 RUTLAND                      "]
[250,"ROCHESTER                    ","250",250,1,null,259,258,"SALEM                        ",{"$f":"H259&\" \"&I259","v":"258 SALEM                        "}]
[251,"ROCKLAND                     ","251",251,1,null,260,259,"SALISBURY                    ","259 SALISBURY                    "]
[252,"ROCKPORT                     ","252",252,1,null,261,260,"SANDISFIELD                  ","260 SANDISFIELD                  "]
[253,"ROWE                         ","253",253,1,null,262,261,"SANDWICH                     ","261 SANDWICH                     "]
[254,"ROWLEY                       ","254",254,0,null,263,262,"SAUGUS                       ","262 SAUGUS                       "]
[255,"ROYALSTON                    ","255",255,0,null,264,263,"SAVOY                        ","263 SAVOY                        "]
[256,"RUSSELL                      ","256",256,0,null,265,264,"SCITUATE                     ","264 SCITUATE                     "]
[257,"RUTLAND                      ","257",257,0,null,266,265,"SEEKONK                      ","265 SEEKONK                      "]
[258,"SALEM                        ","258",258,1,null,267,266,"SHARON                       ","266 SHARON                       "]
[259,"SALISBURY                    ","259",259,0,null,268,267,"SHEFFIELD                    ","267 SHEFFIELD                    "]
[260,"SANDISFIELD                  ","260",260,0,null,269,268,"SHELBURNE                    ","268 SHELBURNE                    "]
[261,"SANDWICH                     ","261",261,1,null,270,269,"SHERBORN                     ","269 SHERBORN                     "]
[262,"SAUGUS                       ","262",262,1,null,271,270,"SHIRLEY                      ","270 SHIRLEY                      "]
[263,"SAVOY                        ","263",263,1,null,272,271,"SHREWSBURY                   ","271 SHREWSBURY                   "]
[264,"SCITUATE                     ","264",264,1,null,273,272,"SHUTESBURY                   ","272 SHUTESBURY                   "]
[265,"SEEKONK                      ","265",265,1,null,274,273,"SOMERSET                     ","273 SOMERSET                     "]
[266,"SHARON                       ","266",266,1,null,275,274,"SOMERVILLE                   ","274 SOMERVILLE                   "]
[267,"SHEFFIELD                    ","267",267,0,null,276,275,"SOUTHAMPTON                  ","275 SOUTHAMPTON                  "]
[268,"SHELBURNE                    ","268",268,0,null,277,276,"SOUTHBOROUGH                 ","276 SOUTHBOROUGH                 "]
[269,"SHERBORN                     ","269",269,1,null,278,277,"SOUTHBRIDGE                  ","277 SOUTHBRIDGE                  "]
[270,"SHIRLEY                      ","270",270,0,null,279,278,"SOUTH HADLEY                 ","278 SOUTH HADLEY                 "]
[271,"SHREWSBURY                   ","271",271,1,null,280,279,"SOUTHWICK                    ","279 SOUTHWICK                    "]
[272,"SHUTESBURY                   ","272",272,1,null,281,280,"SPENCER                      ","280 SPENCER                      "]
[273,"SOMERSET                     ","273",273,1,null,282,281,"SPRINGFIELD                  ","281 SPRINGFIELD                  "]
[274,"SOMERVILLE                   ","274",274,1,null,283,282,"STERLING                     ","282 STERLING                     "]
[275,"SOUTHAMPTON                  ","275",275,1,null,284,283,"STOCKBRIDGE                  ","283 STOCKBRIDGE                  "]
[276,"SOUTHBOROUGH                 ","276",276,1,null,285,284,"STONEHAM                     ","284 STONEHAM                     "]
[277,"SOUTHBRIDGE                  ","277",277,1,null,286,285,"STOUGHTON                    ","285 STOUGHTON                    "]
[278,"SOUTH HADLEY                 ","278",278,1,null,287,286,"STOW                         ","286 STOW                         "]
[279,"SOUTHWICK                    ","279",279,0,null,288,287,"STURBRIDGE                   ","287 STURBRIDGE                   "]
[280,"SPENCER                      ","280",280,0,null,289,288,"SUDBURY                      ","288 SUDBURY                      "]
[281,"SPRINGFIELD                  ","281",281,1,null,290,289,"SUNDERLAND                   ","289 SUNDERLAND                   "]
[282,"STERLING                     ","282",282,0,null,291,290,"SUTTON                       ","290 SUTTON                       "]
[283,"STOCKBRIDGE                  ","283",283,0,null,292,291,"SWAMPSCOTT                   ","291 SWAMPSCOTT                   "]
[284,"STONEHAM                     ","284",284,1,null,293,292,"SWANSEA                      ","292 SWANSEA                      "]
[285,"STOUGHTON                    ","285",285,1,null,294,293,"TAUNTON                      ","293 TAUNTON                      "]
[286,"STOW                         ","286",286,0,null,295,294,"TEMPLETON                    ","294 TEMPLETON                    "]
[287,"STURBRIDGE                   ","287",287,1,null,296,295,"TEWKSBURY                    ","295 TEWKSBURY                    "]
[288,"SUDBURY                      ","288",288,1,null,297,296,"TISBURY                      ","296 TISBURY                      "]
[289,"SUNDERLAND                   ","289",289,1,null,298,297,"TOLLAND                      ","297 TOLLAND                      "]
[290,"SUTTON                       ","290",290,1,null,299,298,"TOPSFIELD                    ","298 TOPSFIELD                    "]
[291,"SWAMPSCOTT                   ","291",291,1,null,300,299,"TOWNSEND                     ","299 TOWNSEND                     "]
[292,"SWANSEA                      ","292",292,1,null,301,300,"TRURO                        ","300 TRURO                        "]
[293,"TAUNTON                      ","293",293,1,null,302,301,"TYNGSBOROUGH                 ","301 TYNGSBOROUGH                 "]
[294,"TEMPLETON                    ","294",294,0,null,303,302,"TYRINGHAM                    ","302 TYRINGHAM                    "]
[295,"TEWKSBURY                    ","295",295,1,null,304,303,"UPTON                        ","303 UPTON                        "]
[296,"TISBURY                      ","296",296,1,null,305,304,"UXBRIDGE                     ","304 UXBRIDGE                     "]
[297,"TOLLAND                      ","297",297,0,null,306,305,"WAKEFIELD                    ","305 WAKEFIELD                    "]
[298,"TOPSFIELD                    ","298",298,1,null,307,306,"WALES                        ","306 WALES                        "]
[299,"TOWNSEND                     ","299",299,0,null,308,307,"WALPOLE                      ","307 WALPOLE                      "]
[300,"TRURO                        ","300",300,1,null,309,308,"WALTHAM                      ","308 WALTHAM                      "]
[301,"TYNGSBOROUGH                 ","301",301,1,null,310,309,"WARE                         ","309 WARE                         "]
[302,"TYRINGHAM                    ","302",302,0,null,311,310,"WAREHAM                      ","310 WAREHAM                      "]
[303,"UPTON                        ","303",303,0,null,312,311,"WARREN                       ","311 WARREN                       "]
[304,"UXBRIDGE                     ","304",304,1,null,313,312,"WARWICK                      ","312 WARWICK                      "]
[305,"WAKEFIELD                    ","305",305,1,null,314,313,"WASHINGTON                   ","313 WASHINGTON                   "]
[306,"WALES                        ","306",306,1,null,315,314,"WATERTOWN                    ","314 WATERTOWN                    "]
[307,"WALPOLE                      ","307",307,1,null,316,315,"WAYLAND                      ","315 WAYLAND                      "]
[308,"WALTHAM                      ","308",308,1,null,317,316,"WEBSTER                      ","316 WEBSTER                      "]
[309,"WARE                         ","309",309,1,null,318,317,"WELLESLEY                    ","317 WELLESLEY                    "]
[310,"WAREHAM                      ","310",310,1,null,319,318,"WELLFLEET                    ","318 WELLFLEET                    "]
[311,"WARREN                       ","311",311,0,null,320,319,"WENDELL                      ","319 WENDELL                      "]
[312,"WARWICK                      ","312",312,0,null,321,320,"WENHAM                       ","320 WENHAM                       "]
[313,"WASHINGTON                   ","313",313,0,null,322,321,"WESTBOROUGH                  ","321 WESTBOROUGH                  "]
[314,"WATERTOWN                    ","314",314,1,null,323,322,"WEST BOYLSTON                ",{"$f":"H323&\" \"&I323","v":"322 WEST BOYLSTON                "}]
[315,"WAYLAND                      ","315",315,1,null,324,323,"WEST BRIDGEWATER             ","323 WEST BRIDGEWATER             "]
[316,"WEBSTER                      ","316",316,1,null,325,324,"WEST BROOKFIELD              ","324 WEST BROOKFIELD              "]
[317,"WELLESLEY                    ","317",317,1,null,326,325,"WESTFIELD                    ","325 WESTFIELD                    "]
[318,"WELLFLEET                    ","318",318,1,null,327,326,"WESTFORD                     ","326 WESTFORD                     "]
[319,"WENDELL                      ","319",319,0,null,328,327,"WESTHAMPTON                  ","327 WESTHAMPTON                  "]
[320,"WENHAM                       ","320",320,0,null,329,328,"WESTMINSTER                  ","328 WESTMINSTER                  "]
[321,"WESTBOROUGH                  ","321",321,1,null,330,329,"WEST NEWBURY                 ","329 WEST NEWBURY                 "]
[322,"WEST BOYLSTON                ","322",322,1,null,331,330,"WESTON                       ","330 WESTON                       "]
[323,"WEST BRIDGEWATER             ","323",323,1,null,332,331,"WESTPORT                     ","331 WESTPORT                     "]
[324,"WEST BROOKFIELD              ","324",324,0,null,333,332,"WEST SPRINGFIELD             ","332 WEST SPRINGFIELD             "]
[325,"WESTFIELD                    ","325",325,1,null,334,333,"WEST STOCKBRIDGE             ","333 WEST STOCKBRIDGE             "]
[326,"WESTFORD                     ","326",326,1,null,335,334,"WEST TISBURY                 ","334 WEST TISBURY                 "]
[327,"WESTHAMPTON                  ","327",327,1,null,336,335,"WESTWOOD                     ","335 WESTWOOD                     "]
[328,"WESTMINSTER                  ","328",328,0,null,337,336,"WEYMOUTH                     ","336 WEYMOUTH                     "]
[329,"WEST NEWBURY                 ","329",329,0,null,338,337,"WHATELY                      ","337 WHATELY                      "]
[330,"WESTON                       ","330",330,1,null,339,338,"WHITMAN                      ","338 WHITMAN                      "]
[331,"WESTPORT                     ","331",331,1,null,340,339,"WILBRAHAM                    ","339 WILBRAHAM                    "]
[332,"WEST SPRINGFIELD             ","332",332,1,null,341,340,"WILLIAMSBURG                 ","340 WILLIAMSBURG                 "]
[333,"WEST STOCKBRIDGE             ","333",333,0,null,342,341,"WILLIAMSTOWN                 ","341 WILLIAMSTOWN                 "]
[334,"WEST TISBURY                 ","334",334,0,null,343,342,"WILMINGTON                   ","342 WILMINGTON                   "]
[335,"WESTWOOD                     ","335",335,1,null,344,343,"WINCHENDON                   ","343 WINCHENDON                   "]
[336,"WEYMOUTH                     ","336",336,1,null,345,344,"WINCHESTER                   ","344 WINCHESTER                   "]
[337,"WHATELY                      ","337",337,1,null,346,345,"WINDSOR                      ","345 WINDSOR                      "]
[338,"WHITMAN                      ","338",338,0,null,347,346,"WINTHROP                     ","346 WINTHROP                     "]
[339,"WILBRAHAM                    ","339",339,0,null,348,347,"WOBURN","347 WOBURN"]
[340,"WILLIAMSBURG                 ","340",340,1,null,349,348,"WORCESTER                    ","348 WORCESTER                    "]
[341,"WILLIAMSTOWN                 ","341",341,1,null,350,349,"WORTHINGTON                  ","349 WORTHINGTON                  "]
[342,"WILMINGTON                   ","342",342,1,null,351,350,"WRENTHAM                     ","350 WRENTHAM                     "]
[343,"WINCHENDON                   ","343",343,1,null,352,351,"YARMOUTH                     ","351 YARMOUTH                     "]
[344,"WINCHESTER                   ","344",344,1,null,353,406,"NORTHAMPTON SMITH            ",{"$f":"H353&\" \"&I353","v":"406 NORTHAMPTON SMITH            "}]
[345,"WINDSOR                      ","345",345,0,null,354,600,"ACTON BOXBOROUGH             ","600 ACTON BOXBOROUGH             "]
[346,"WINTHROP                     ","346",346,1,null,355,603,"ADAMS CHESHIRE               ","603 ADAMS CHESHIRE               "]
[347,"WOBURN","347",347,1,null,356,605,"AMHERST PELHAM               ","605 AMHERST PELHAM               "]
[348,"WORCESTER                    ","348",348,1,null,357,610,"ASHBURNHAM WESTMINSTER       ","610 ASHBURNHAM WESTMINSTER       "]
[349,"WORTHINGTON                  ","349",349,0,null,358,615,"ATHOL ROYALSTON              ","615 ATHOL ROYALSTON              "]
[350,"WRENTHAM                     ","350",350,1,null,359,616,"AYER SHIRLEY","616 AYER SHIRLEY"]
[351,"YARMOUTH                     ","351",351,0,null,360,618,"BERKSHIRE HILLS              ","618 BERKSHIRE HILLS              "]
[406,"NORTHAMPTON SMITH            ","406",352,1,null,361,620,"BERLIN BOYLSTON              ","620 BERLIN BOYLSTON              "]
[600,"ACTON BOXBOROUGH             ","600",353,1,null,362,622,"BLACKSTONE MILLVILLE         ","622 BLACKSTONE MILLVILLE         "]
[603,"ADAMS CHESHIRE               ","603",354,1,null,363,625,"BRIDGEWATER RAYNHAM          ","625 BRIDGEWATER RAYNHAM          "]
[605,"AMHERST PELHAM               ","605",355,1,null,364,632,"CHESTERFIELD GOSHEN","632 CHESTERFIELD GOSHEN"]
[610,"ASHBURNHAM WESTMINSTER       ","610",356,1,null,365,635,"CENTRAL BERKSHIRE            ","635 CENTRAL BERKSHIRE            "]
[615,"ATHOL ROYALSTON              ","615",357,1,null,366,640,"CONCORD CARLISLE             ","640 CONCORD CARLISLE             "]
[616,"AYER SHIRLEY","616",358,1,null,367,645,"DENNIS YARMOUTH              ","645 DENNIS YARMOUTH              "]
[618,"BERKSHIRE HILLS              ","618",359,1,null,368,650,"DIGHTON REHOBOTH             ","650 DIGHTON REHOBOTH             "]
[620,"BERLIN BOYLSTON              ","620",360,1,null,369,655,"DOVER SHERBORN               ","655 DOVER SHERBORN               "]
[622,"BLACKSTONE MILLVILLE         ","622",361,1,null,370,658,"DUDLEY CHARLTON              ","658 DUDLEY CHARLTON              "]
[625,"BRIDGEWATER RAYNHAM          ","625",362,1,null,371,660,"NAUSET                       ","660 NAUSET                       "]
[632,"CHESTERFIELD GOSHEN","632",363,1,null,372,662,"FARMINGTON RIVER","662 FARMINGTON RIVER"]
[635,"CENTRAL BERKSHIRE            ","635",364,1,null,373,665,"FREETOWN LAKEVILLE           ","665 FREETOWN LAKEVILLE           "]
[640,"CONCORD CARLISLE             ","640",365,1,null,374,670,"FRONTIER                     ","670 FRONTIER                     "]
[645,"DENNIS YARMOUTH              ","645",366,1,null,375,672,"GATEWAY                      ","672 GATEWAY                      "]
[650,"DIGHTON REHOBOTH             ","650",367,1,null,376,673,"GROTON DUNSTABLE             ","673 GROTON DUNSTABLE             "]
[655,"DOVER SHERBORN               ","655",368,1,null,377,674,"GILL MONTAGUE                ","674 GILL MONTAGUE                "]
[658,"DUDLEY CHARLTON              ","658",369,1,null,378,675,"HAMILTON WENHAM              ","675 HAMILTON WENHAM              "]
[660,"NAUSET                       ","660",370,1,null,379,680,"HAMPDEN WILBRAHAM            ","680 HAMPDEN WILBRAHAM            "]
[662,"FARMINGTON RIVER","662",371,1,null,380,683,"HAMPSHIRE                    ","683 HAMPSHIRE                    "]
[665,"FREETOWN LAKEVILLE           ","665",372,1,null,381,685,"HAWLEMONT                    ","685 HAWLEMONT                    "]
[670,"FRONTIER                     ","670",373,1,null,382,690,"KING PHILIP                  ","690 KING PHILIP                  "]
[672,"GATEWAY                      ","672",374,1,null,383,695,"LINCOLN SUDBURY              ","695 LINCOLN SUDBURY              "]
[673,"GROTON DUNSTABLE             ","673",375,1,null,384,698,"MANCHESTER ESSEX","698 MANCHESTER ESSEX"]
[674,"GILL MONTAGUE                ","674",376,1,null,385,700,"MARTHAS VINEYARD             ","700 MARTHAS VINEYARD             "]
[675,"HAMILTON WENHAM              ","675",377,1,null,386,705,"MASCONOMET                   ","705 MASCONOMET                   "]
[680,"HAMPDEN WILBRAHAM            ","680",378,1,null,387,710,"MENDON UPTON                 ","710 MENDON UPTON                 "]
[683,"HAMPSHIRE                    ","683",379,1,null,388,712,"MONOMOY","712 MONOMOY"]
[685,"HAWLEMONT                    ","685",380,1,null,389,715,"MOUNT GREYLOCK               ","715 MOUNT GREYLOCK               "]
[690,"KING PHILIP                  ","690",381,1,null,390,717,"MOHAWK TRAIL                 ","717 MOHAWK TRAIL                 "]
[695,"LINCOLN SUDBURY              ","695",382,1,null,391,720,"NARRAGANSETT                 ","720 NARRAGANSETT                 "]
[698,"MANCHESTER ESSEX",698,383,1,null,392,725,"NASHOBA                      ","725 NASHOBA                      "]
[700,"MARTHAS VINEYARD             ","700",384,1,null,393,728,"NEW SALEM WENDELL            ","728 NEW SALEM WENDELL            "]
[705,"MASCONOMET                   ","705",385,1,null,394,730,"NORTHBORO SOUTHBORO          ","730 NORTHBORO SOUTHBORO          "]
[710,"MENDON UPTON                 ","710",386,1,null,395,735,"NORTH MIDDLESEX              ","735 NORTH MIDDLESEX              "]
[712,"MONOMOY",712,387,1,null,396,740,"OLD ROCHESTER                ","740 OLD ROCHESTER                "]
[715,"MOUNT GREYLOCK               ","715",388,null,null,397,745,"PENTUCKET                    ","745 PENTUCKET                    "]
[717,"MOHAWK TRAIL                 ","717",389,1,null,398,750,"PIONEER                      ","750 PIONEER                      "]
[720,"NARRAGANSETT                 ","720",390,1,null,399,753,"QUABBIN                      ","753 QUABBIN                      "]
[725,"NASHOBA                      ","725",391,1,null,400,755,"RALPH C MAHAR                ","755 RALPH C MAHAR                "]
[728,"NEW SALEM WENDELL            ","728",392,1,null,401,760,"SILVER LAKE                  ","760 SILVER LAKE                  "]
[730,"NORTHBORO SOUTHBORO          ","730",393,1,null,402,763,"SOMERSET BERKLEY","763 SOMERSET BERKLEY"]
[735,"NORTH MIDDLESEX              ","735",394,1,null,403,765,"SOUTHERN BERKSHIRE           ","765 SOUTHERN BERKSHIRE           "]
[740,"OLD ROCHESTER                ","740",395,1,null,404,766,"SOUTHWICK TOLLAND","766 SOUTHWICK TOLLAND"]
[745,"PENTUCKET                    ","745",396,1,null,405,767,"SPENCER EAST BROOKFIELD      ","767 SPENCER EAST BROOKFIELD      "]
[750,"PIONEER                      ","750",397,1,null,406,770,"TANTASQUA                    ","770 TANTASQUA                    "]
[753,"QUABBIN                      ","753",398,1,null,407,773,"TRITON                       ","773 TRITON                       "]
[755,"RALPH C MAHAR                ","755",399,1,null,408,774,"UPISLAND","774 UPISLAND"]
[760,"SILVER LAKE                  ","760",400,1,null,409,775,"WACHUSETT                    ","775 WACHUSETT                    "]
[763,"SOMERSET BERKLEY","763",401,1,null,410,778,"QUABOAG","778 QUABOAG"]
[765,"SOUTHERN BERKSHIRE           ","765",402,null,null,411,780,"WHITMAN HANSON               ","780 WHITMAN HANSON               "]
[766,"SOUTHWICK TOLLAND","766",403,1,null,412,801,"ASSABET VALLEY               ","801 ASSABET VALLEY               "]
[767,"SPENCER EAST BROOKFIELD      ","767",404,1,null,413,805,"BLACKSTONE VALLEY            ","805 BLACKSTONE VALLEY            "]
[770,"TANTASQUA                    ","770",405,1,null,414,806,"BLUE HILLS                   ","806 BLUE HILLS                   "]
[773,"TRITON                       ","773",406,1,null,415,810,"BRISTOL PLYMOUTH             ","810 BRISTOL PLYMOUTH             "]
[774,"UPISLAND","774",407,1,null,416,815,"CAPE COD                     ","815 CAPE COD                     "]
[775,"WACHUSETT                    ","775",408,1,null,417,817,"ESSEX NORTH SHORE","817 ESSEX NORTH SHORE"]
[778,"QUABOAG","778",409,1,null,418,818,"FRANKLIN COUNTY              ",{"$f":"H418&\" \"&I418","v":"818 FRANKLIN COUNTY              "}]
[780,"WHITMAN HANSON               ","780",410,1,null,419,821,"GREATER FALL RIVER           ","821 GREATER FALL RIVER           "]
[801,"ASSABET VALLEY               ","801",411,1,null,420,823,"GREATER LAWRENCE             ","823 GREATER LAWRENCE             "]
[805,"BLACKSTONE VALLEY            ","805",412,1,null,421,825,"GREATER NEW BEDFORD          ","825 GREATER NEW BEDFORD          "]
[806,"BLUE HILLS                   ","806",413,1,null,422,828,"GREATER LOWELL               ","828 GREATER LOWELL               "]
[810,"BRISTOL PLYMOUTH             ","810",414,1,null,423,829,"SOUTH MIDDLESEX              ","829 SOUTH MIDDLESEX              "]
[815,"CAPE COD                     ","815",415,1,null,424,830,"MINUTEMAN                    ","830 MINUTEMAN                    "]
[817,"ESSEX NORTH SHORE",817,416,1,null,425,832,"MONTACHUSETT                 ","832 MONTACHUSETT                 "]
[818,"FRANKLIN COUNTY              ","818",417,1,null,426,851,"NORTHERN BERKSHIRE           ","851 NORTHERN BERKSHIRE           "]
[821,"GREATER FALL RIVER           ","821",418,1,null,427,852,"NASHOBA VALLEY               ","852 NASHOBA VALLEY               "]
[823,"GREATER LAWRENCE             ","823",419,1,null,428,853,"NORTHEAST METROPOLITAN       ","853 NORTHEAST METROPOLITAN       "]
[825,"GREATER NEW BEDFORD          ","825",420,1,null,429,855,"OLD COLONY                   ",{"$f":"H429&\" \"&I429","v":"855 OLD COLONY                   "}]
[828,"GREATER LOWELL               ","828",421,1,null,430,860,"PATHFINDER                   ","860 PATHFINDER                   "]
[829,"SOUTH MIDDLESEX              ","829",422,1,null,431,871,"SHAWSHEEN VALLEY             ","871 SHAWSHEEN VALLEY             "]
[830,"MINUTEMAN                    ","830",423,1,null,432,872,"SOUTHEASTERN                 ","872 SOUTHEASTERN                 "]
[832,"MONTACHUSETT                 ","832",424,1,null,433,873,"SOUTH SHORE                  ","873 SOUTH SHORE                  "]
[851,"NORTHERN BERKSHIRE           ","851",425,1,null,434,876,"SOUTHERN WORCESTER           ","876 SOUTHERN WORCESTER           "]
[852,"NASHOBA VALLEY               ","852",426,1,null,435,878,"TRI COUNTY                   ","878 TRI COUNTY                   "]
[853,"NORTHEAST METROPOLITAN       ","853",427,1,null,436,879,"UPPER CAPE COD               ","879 UPPER CAPE COD               "]
[855,"OLD COLONY                   ","855",428,1,null,437,885,"WHITTIER                     ","885 WHITTIER                     "]
[860,"PATHFINDER                   ","860",429,1,null,438,910,"BRISTOL COUNTY               ","910 BRISTOL COUNTY               "]
[871,"SHAWSHEEN VALLEY             ","871",430,1,null,439,915,"NORFOLK COUNTY               ",{"$f":"H439&\" \"&I439","v":"915 NORFOLK COUNTY               "}]
[872,"SOUTHEASTERN                 ","872",431,1,null,440,999,"State Total","999 State Total"]
[873,"SOUTH SHORE                  ","873",432,1]
[876,"SOUTHERN WORCESTER           ","876",433,1,null,null,null,null," "]
[878,"TRI COUNTY                   ","878",434,1]
[879,"UPPER CAPE COD               ","879",435,1]
[885,"WHITTIER                     ","885",436,1]
[910,"BRISTOL COUNTY               ","910",437,1]
[915,"NORFOLK COUNTY               ","915",438,1]

{"sheet":"notes","index":1,"n_rows":16,"n_cols":2,"rows_kept":16,"cut":false,"hidden":true,"merged":[]}
["ran december numbers at 5000 for everyone; didn't have time to update these rates in case someone came in below $5000"]
[]
[]
["notes16"]
[]
["2015-12-16","estimated membership because FY15 wasn’t ready, but did want to publish an estimated rate file"]
["2015-12-16","updated eoy sheet"]
["2015-12-16","updated rate summary (just the fiscal year in title)"]
["2015-12-16","redid dataout"]
["2015-12-16","redid webmessage"]
["2015-12-16","updated tuitioncalc--just the fiscal year in title; no changes to the report"]
[]
[null,"for later postings use actual fy15 membership"]
[null,"change wording on rate summary membership description"]
[]
["2016-06-15","re-rah AFTER finalizing distribution for lisa's deadline.  Fortunately none of the rates were affected."]

{"sheet":"leas","index":2,"n_rows":196,"n_cols":12,"rows_kept":196,"cut":false,"hidden":true,"merged":[]}
["first record",187]
["lea",{"$f":"VLOOKUP(B1,order436,2)","v":885},{"$f":"VLOOKUP(leaextract,code436,2)","v":"WHITTIER                     "},{"$f":"VLOOKUP(leaextract,code436,3)","v":"885"}]
[]
["last record",187]
["lastlea",{"$f":"VLOOKUP(B4,order436,2)","v":885},{"$f":"VLOOKUP(lastlea,code436,2)","v":"WHITTIER                     "}]
[null,null,null,null,null,null,null,null,null,null,"from webmessage, 1Y0 or 1T0"]
[null,"To update the list, replace this column"]
[null," jun15"]
["order","lea",null,"leastring",null,null,null,null,null,"lea","dist","ok?"]
[1,{"$f":"VALUE(J10)","v":1},{"$f":"K10","v":"ABINGTON                     "},{"$f":"J10","v":"001"},null,null,null,null,null,"001","ABINGTON                     ","1Y0"]
[2,{"$f":"VALUE(J11)","v":5},{"$f":"K11","v":"AGAWAM                       "},{"$f":"J11","v":"005"},null,null,null,null,null,"005","AGAWAM                       ","1Y0"]
[3,7,"AMESBURY                     ","007",null,null,null,null,null,"007","AMESBURY                     ","1Y0"]
[4,8,"AMHERST                      ","008",null,null,null,null,null,"008","AMHERST                      ","1Y0"]
[5,14,"ASHLAND                      ","014",null,null,null,null,null,"014","ASHLAND                      ","1Y0"]
[6,17,"AUBURN                       ","017",null,null,null,null,null,"017","AUBURN                       ","1Y0"]
[7,18,"AVON                         ","018",null,null,null,null,null,"018","AVON                         ","1Y0"]
[8,20,"BARNSTABLE                   ","020",null,null,null,null,null,"020","BARNSTABLE                   ","1Y0"]
[9,24,"BELCHERTOWN                  ","024",null,null,null,null,null,"024","BELCHERTOWN                  ","1Y0"]
[10,25,"BELLINGHAM                   ","025",null,null,null,null,null,"025","BELLINGHAM                   ","1Y0"]
[11,27,"BERKLEY                      ","027",null,null,null,null,null,"027","BERKLEY                      ","1Y0"]
[12,28,"BERLIN                       ","028",null,null,null,null,null,"028","BERLIN                       ","1Y0"]
[13,30,"BEVERLY                      ","030",null,null,null,null,null,"030","BEVERLY                      ","1Y0"]
[14,36,"BOURNE                       ","036",null,null,null,null,null,"036","BOURNE                       ","1Y0"]
[15,39,"BOYLSTON                     ","039",null,null,null,null,null,"039","BOYLSTON                     ","1Y0"]
[16,44,"BROCKTON                     ","044",null,null,null,null,null,"044","BROCKTON                     ","1Y0"]
[17,45,"BROOKFIELD                   ","045",null,null,null,null,null,"045","BROOKFIELD                   ","1Y0"]
[18,48,"BURLINGTON                   ","048",null,null,null,null,null,"048","BURLINGTON                   ","1Y0"]
[19,52,"CARVER                       ","052",null,null,null,null,null,"052","CARVER                       ","1Y0"]
[20,56,"CHELMSFORD                   ","056",null,null,null,null,null,"056","CHELMSFORD                   ","1Y0"]
[21,61,"CHICOPEE                     ","061",null,null,null,null,null,"061","CHICOPEE                     ","1Y0"]
[22,63,"CLARKSBURG                   ","063",null,null,null,null,null,"063","CLARKSBURG                   ","1Y0"]
[23,64,"CLINTON                      ","064",null,null,null,null,null,"064","CLINTON                      ","1Y0"]
[24,68,"CONWAY                       ","068",null,null,null,null,null,"068","CONWAY                       ","1Y0"]
[25,74,"DEERFIELD                    ","074",null,null,null,null,null,"074","DEERFIELD                    ","1Y0"]
[26,77,"DOUGLAS                      ","077",null,null,null,null,null,"077","DOUGLAS                      ","1T0"]
[27,79,"DRACUT                       ","079",null,null,null,null,null,"079","DRACUT                       ","1Y0"]
[28,83,"EAST BRIDGEWATER             ","083",null,null,null,null,null,"083","EAST BRIDGEWATER             ","1Y0"]
[29,86,"EASTHAMPTON                  ","086",null,null,null,null,null,"086","EASTHAMPTON                  ","1Y0"]
[30,89,"EDGARTOWN                    ","089",null,null,null,null,null,"089","EDGARTOWN                    ","1Y0"]
[31,94,"FAIRHAVEN                    ","094",null,null,null,null,null,"094","FAIRHAVEN                    ","1Y0"]
[32,95,"FALL RIVER                   ","095",null,null,null,null,null,"095","FALL RIVER                   ","1Y0"]
[33,96,"FALMOUTH                     ","096",null,null,null,null,null,"096","FALMOUTH                     ","1Y0"]
[34,97,"FITCHBURG                    ","097",null,null,null,null,null,"097","FITCHBURG                    ","1Y0"]
[35,98,"FLORIDA                      ","098",null,null,null,null,null,"098","FLORIDA                      ","1Y0"]
[36,101,"FRANKLIN                     ",101,null,null,null,null,null,101,"FRANKLIN                     ","1Y0"]
[37,103,"GARDNER                      ",103,null,null,null,null,null,103,"GARDNER                      ","1Y0"]
[38,105,"GEORGETOWN                   ",105,null,null,null,null,null,105,"GEORGETOWN                   ","1Y0"]
[39,107,"GLOUCESTER                   ",107,null,null,null,null,null,107,"GLOUCESTER                   ","1Y0"]
[40,110,"GRAFTON                      ",110,null,null,null,null,null,110,"GRAFTON                      ","1Y0"]
[41,111,"GRANBY                       ",111,null,null,null,null,null,111,"GRANBY                       ","1Y0"]
[42,114,"GREENFIELD                   ",114,null,null,null,null,null,114,"GREENFIELD                   ","1Y0"]
[43,117,"HADLEY                       ",117,null,null,null,null,null,117,"HADLEY                       ","1Y0"]
[44,121,"HANCOCK                      ",121,null,null,null,null,null,121,"HANCOCK                      ","1Y0"]
[45,125,"HARVARD                      ",125,null,null,null,null,null,125,"HARVARD                      ","1Y0"]
[46,127,"HATFIELD                     ",127,null,null,null,null,null,127,"HATFIELD                     ","1Y0"]
[47,128,"HAVERHILL                    ",128,null,null,null,null,null,128,"HAVERHILL                    ","1Y0"]
[48,133,"HOLBROOK                     ",133,null,null,null,null,null,133,"HOLBROOK                     ","1Y0"]
[49,135,"HOLLAND                      ",135,null,null,null,null,null,135,"HOLLAND                      ","1Y0"]
[50,136,"HOLLISTON                    ",136,null,null,null,null,null,136,"HOLLISTON                    ","1Y0"]
[51,137,"HOLYOKE                      ",137,null,null,null,null,null,137,"HOLYOKE                      ","1Y0"]
[52,138,"HOPEDALE                     ",138,null,null,null,null,null,138,"HOPEDALE                     ","1Y0"]
[53,141,"HUDSON                       ",141,null,null,null,null,null,141,"HUDSON                       ","1Y0"]
[54,144,"IPSWICH                      ",144,null,null,null,null,null,144,"IPSWICH                      ","1Y0"]
[55,148,"LANESBOROUGH                 ",148,null,null,null,null,null,148,"LANESBOROUGH                 ","1Y0"]
[56,150,"LEE                          ",150,null,null,null,null,null,150,"LEE                          ","1Y0"]
[57,151,"LEICESTER                    ",151,null,null,null,null,null,151,"LEICESTER                    ","1Y0"]
[58,152,"LENOX                        ",152,null,null,null,null,null,152,"LENOX                        ","1Y0"]
[59,153,"LEOMINSTER                   ",153,null,null,null,null,null,153,"LEOMINSTER                   ","1Y0"]
[60,154,"LEVERETT                     ",154,null,null,null,null,null,154,"LEVERETT                     ","1Y0"]
[61,158,"LITTLETON                    ",158,null,null,null,null,null,158,"LITTLETON                    ","1Y0"]
[62,159,"LONGMEADOW                   ",159,null,null,null,null,null,159,"LONGMEADOW                   ","1Y0"]
[63,161,"LUDLOW                       ",161,null,null,null,null,null,161,"LUDLOW                       ","1T0"]
[64,162,"LUNENBURG                    ",162,null,null,null,null,null,162,"LUNENBURG                    ","1Y0"]
[65,171,"MARSHFIELD                   ",171,null,null,null,null,null,171,"MARSHFIELD                   ","1Y0"]
[66,{"$f":"VALUE(J75)","v":172},{"$f":"K75","v":"MASHPEE                      "},{"$f":"J75","v":172},null,null,null,null,null,172,"MASHPEE                      ","1Y0"]
[67,173,"MATTAPOISETT                 ",173,null,null,null,null,null,173,"MATTAPOISETT                 ","1Y0"]
[68,174,"MAYNARD                      ",174,null,null,null,null,null,174,"MAYNARD                      ","1Y0"]
[69,177,"MEDWAY                       ",177,null,null,null,null,null,177,"MEDWAY                       ","1Y0"]
[70,178,"MELROSE                      ",178,null,null,null,null,null,178,"MELROSE                      ","1Y0"]
[71,182,"MIDDLEBOROUGH                ",182,null,null,null,null,null,182,"MIDDLEBOROUGH                ","1Y0"]
[72,185,"MILFORD                      ",185,null,null,null,null,null,185,"MILFORD                      ","1Y0"]
[73,187,"MILLIS                       ",187,null,null,null,null,null,187,"MILLIS                       ","1Y0"]
[74,191,"MONSON                       ",191,null,null,null,null,null,191,"MONSON                       ","1Y0"]
[75,198,"NATICK                       ",198,null,null,null,null,null,198,"NATICK                       ","1Y0"]
[76,201,"NEW BEDFORD                  ",201,null,null,null,null,null,201,"NEW BEDFORD                  ","1Y0"]
[77,204,"NEWBURYPORT                  ",204,null,null,null,null,null,204,"NEWBURYPORT                  ","1Y0"]
[78,209,"NORTH ADAMS                  ",209,null,null,null,null,null,209,"NORTH ADAMS                  ","1Y0"]
[79,210,"NORTHAMPTON                  ",210,null,null,null,null,null,210,"NORTHAMPTON                  ","1Y0"]
[80,214,"NORTHBRIDGE                  ",214,null,null,null,null,null,214,"NORTHBRIDGE                  ","1Y0"]
[81,215,"NORTH BROOKFIELD             ",215,null,null,null,null,null,215,"NORTH BROOKFIELD             ","1Y0"]
[82,218,"NORTON                       ",{"$f":"J91","v":218},null,null,null,null,null,218,"NORTON                       ","1Y0"]
[83,221,"OAK BLUFFS                   ",221,null,null,null,null,null,221,"OAK BLUFFS                   ","1Y0"]
[84,223,"ORANGE                       ",223,null,null,null,null,null,223,"ORANGE                       ","1Y0"]
[85,224,"ORLEANS                      ",224,null,null,null,null,null,224,"ORLEANS                      ","1Y0"]
[86,226,"OXFORD                       ",226,null,null,null,null,null,226,"OXFORD                       ","1Y0"]
[87,227,"PALMER                       ",227,null,null,null,null,null,227,"PALMER                       ","1Y0"]
[88,229,"PEABODY                      ",229,null,null,null,null,null,229,"PEABODY                      ","1Y0"]
[89,230,"PELHAM                       ",230,null,null,null,null,null,230,"PELHAM                       ","1Y0"]
[90,234,"PETERSHAM                    ",234,null,null,null,null,null,234,"PETERSHAM                    ","1Y0"]
[91,236,"PITTSFIELD                   ",236,null,null,null,null,null,236,"PITTSFIELD                   ","1Y0"]
[92,240,"PLYMPTON                     ",240,null,null,null,null,null,240,"PLYMPTON                     ","1T0"]
[93,242,"PROVINCETOWN                 ",242,null,null,null,null,null,242,"PROVINCETOWN                 ","1Y0"]
[94,244,"RANDOLPH                     ",244,null,null,null,null,null,244,"RANDOLPH                     ","1Y0"]
[95,249,"RICHMOND                     ",249,null,null,null,null,null,249,"RICHMOND                     ","1Y0"]
[96,251,"ROCKLAND                     ",251,null,null,null,null,null,251,"ROCKLAND                     ","1Y0"]
[97,252,"ROCKPORT                     ",252,null,null,null,null,null,252,"ROCKPORT                     ","1Y0"]
[98,253,"ROWE                         ",253,null,null,null,null,null,253,"ROWE                         ","1Y0"]
[99,261,"SANDWICH                     ",261,null,null,null,null,null,261,"SANDWICH                     ","1Y0"]
[100,263,"SAVOY                        ",263,null,null,null,null,null,263,"SAVOY                        ","1Y0"]
[101,275,"SOUTHAMPTON                  ",275,null,null,null,null,null,275,"SOUTHAMPTON                  ","1Y0"]
[102,277,"SOUTHBRIDGE                  ",277,null,null,null,null,null,277,"SOUTHBRIDGE                  ","1Y0"]
[103,278,"SOUTH HADLEY                 ",278,null,null,null,null,null,278,"SOUTH HADLEY                 ","1Y0"]
[104,281,"SPRINGFIELD                  ",281,null,null,null,null,null,281,"SPRINGFIELD                  ","1Y0"]
[105,289,"SUNDERLAND                   ",289,null,null,null,null,null,289,"SUNDERLAND                   ","1Y0"]
[106,290,"SUTTON                       ",290,null,null,null,null,null,290,"SUTTON                       ","1Y0"]
[107,291,"SWAMPSCOTT                   ",291,null,null,null,null,null,291,"SWAMPSCOTT                   ","1Y0"]
[108,293,"TAUNTON                      ",293,null,null,null,null,null,293,"TAUNTON                      ","1Y0"]
[109,296,"TISBURY                      ",296,null,null,null,null,null,296,"TISBURY                      ","1Y0"]
[110,300,"TRURO                        ",300,null,null,null,null,null,300,"TRURO                        ","1Y0"]
[111,301,"TYNGSBOROUGH                 ",301,null,null,null,null,null,301,"TYNGSBOROUGH                 ","1Y0"]
[112,304,"UXBRIDGE                     ",304,null,null,null,null,null,304,"UXBRIDGE                     ","1Y0"]
[113,306,"WALES                        ",306,null,null,null,null,null,306,"WALES                        ","1Y0"]
[114,309,"WARE                         ",309,null,null,null,null,null,309,"WARE                         ","1Y0"]
[115,310,"WAREHAM                      ",310,null,null,null,null,null,310,"WAREHAM                      ","1Y0"]
[116,316,"WEBSTER                      ",316,null,null,null,null,null,316,"WEBSTER                      ","1Y0"]
[117,322,"WEST BOYLSTON                ",322,null,null,null,null,null,322,"WEST BOYLSTON                ","1Y0"]
[118,323,"WEST BRIDGEWATER             ",323,null,null,null,null,null,323,"WEST BRIDGEWATER             ","1Y0"]
[119,325,"WESTFIELD                    ",325,null,null,null,null,null,325,"WESTFIELD                    ","1Y0"]
[120,326,"WESTFORD                     ",326,null,null,null,null,null,326,"WESTFORD                     ","1Y0"]
[121,327,"WESTHAMPTON                  ",327,null,null,null,null,null,327,"WESTHAMPTON                  ","1Y0"]
[122,332,"WEST SPRINGFIELD             ",332,null,null,null,null,null,332,"WEST SPRINGFIELD             ","1Y0"]
[123,337,"WHATELY                      ",337,null,null,null,null,null,337,"WHATELY                      ","1Y0"]
[124,340,"WILLIAMSBURG                 ",340,null,null,null,null,null,340,"WILLIAMSBURG                 ","1Y0"]
[125,341,"WILLIAMSTOWN                 ",341,null,null,null,null,null,341,"WILLIAMSTOWN                 ","1Y0"]
[126,343,"WINCHENDON                   ",343,null,null,null,null,null,343,"WINCHENDON                   ","1Y0"]
[127,346,"WINTHROP                     ",346,null,null,null,null,null,346,"WINTHROP                     ","1Y0"]
[128,348,"WORCESTER                    ",348,null,null,null,null,null,348,"WORCESTER                    ","1Y0"]
[129,349,"WORTHINGTON                  ",349,null,null,null,null,null,349,"WORTHINGTON                  ","1Y0"]
[130,{"$f":"VALUE(J139)","v":600},{"$f":"K139","v":"ACTON BOXBOROUGH             "},600,null,null,null,null,null,600,"ACTON BOXBOROUGH             ","1Y0"]
[131,603,"ADAMS CHESHIRE               ",603,null,null,null,null,null,603,"ADAMS CHESHIRE               ","1Y0"]
[132,605,"AMHERST PELHAM               ",605,null,null,null,null,null,605,"AMHERST PELHAM               ","1Y0"]
[133,610,"ASHBURNHAM WESTMINSTER       ",610,null,null,null,null,null,610,"ASHBURNHAM WESTMINSTER       ","1Y0"]
[134,615,"ATHOL ROYALSTON              ",615,null,null,null,null,null,615,"ATHOL ROYALSTON              ","1Y0"]
[135,616,"AYER SHIRLEY","616",null,null,null,null,null,"616","AYER SHIRLEY","1Y0"]
[136,618,"BERKSHIRE HILLS              ",618,null,null,null,null,null,618,"BERKSHIRE HILLS              ","1Y0"]
[137,620,"BERLIN BOYLSTON              ",620,null,null,null,null,null,620,"BERLIN BOYLSTON              ","1Y0"]
[138,622,"BLACKSTONE MILLVILLE         ",622,null,null,null,null,null,622,"BLACKSTONE MILLVILLE         ","1Y0"]
[139,625,"BRIDGEWATER RAYNHAM          ",625,null,null,null,null,null,625,"BRIDGEWATER RAYNHAM          ","1Y0"]
[140,632,"CHESTERFIELD GOSHEN",632,null,null,null,null,null,632,"CHESTERFIELD GOSHEN","1Y0"]
[141,635,"CENTRAL BERKSHIRE            ",635,null,null,null,null,null,635,"CENTRAL BERKSHIRE            ","1Y0"]
[142,645,"DENNIS YARMOUTH              ",645,null,null,null,null,null,645,"DENNIS YARMOUTH              ","1Y0"]
[143,650,"DIGHTON REHOBOTH             ",650,null,null,null,null,null,650,"DIGHTON REHOBOTH             ","1Y0"]
[144,658,"DUDLEY CHARLTON              ",658,null,null,null,null,null,658,"DUDLEY CHARLTON              ","1Y0"]
[145,660,"NAUSET                       ",660,null,null,null,null,null,660,"NAUSET                       ","1Y0"]
[146,662,"FARMINGTON RIVER",{"$f":"J155","v":662},null,null,null,null,null,662,"FARMINGTON RIVER","1Y0"]
[147,665,"FREETOWN LAKEVILLE           ",665,null,null,null,null,null,665,"FREETOWN LAKEVILLE           ","1Y0"]
[148,670,"FRONTIER                     ",670,null,null,null,null,null,670,"FRONTIER                     ","1Y0"]
[149,672,"GATEWAY                      ",672,null,null,null,null,null,672,"GATEWAY                      ","1Y0"]
[150,673,"GROTON DUNSTABLE             ",673,null,null,null,null,null,673,"GROTON DUNSTABLE             ","1Y0"]
[151,674,"GILL MONTAGUE                ",674,null,null,null,null,null,674,"GILL MONTAGUE                ","1Y0"]
[152,675,"HAMILTON WENHAM              ",675,null,null,null,null,null,675,"HAMILTON WENHAM              ","1Y0"]
[153,680,"HAMPDEN WILBRAHAM            ",680,null,null,null,null,null,680,"HAMPDEN WILBRAHAM            ","1Y0"]
[154,683,"HAMPSHIRE                    ",683,null,null,null,null,null,683,"HAMPSHIRE                    ","1Y0"]
[155,685,"HAWLEMONT                    ",685,null,null,null,null,null,685,"HAWLEMONT                    ","1Y0"]
[156,698,"MANCHESTER ESSEX",698,null,null,null,null,null,698,"MANCHESTER ESSEX","1Y0"]
[157,710,"MENDON UPTON                 ",710,null,null,null,null,null,710,"MENDON UPTON                 ","1Y0"]
[158,712,"MONOMOY","712",null,null,null,null,null,"712","MONOMOY","1Y0"]
[159,715,"MOUNT GREYLOCK               ",715,null,null,null,null,null,715,"MOUNT GREYLOCK               ","1Y0"]
[160,717,"MOHAWK TRAIL                 ",717,null,null,null,null,null,717,"MOHAWK TRAIL                 ","1Y0"]
[161,720,"NARRAGANSETT                 ",720,null,null,null,null,null,720,"NARRAGANSETT                 ","1Y0"]
[162,725,"NASHOBA                      ",725,null,null,null,null,null,725,"NASHOBA                      ","1Y0"]
[163,{"$f":"VALUE(J172)","v":728},{"$f":"K172","v":"NEW SALEM WENDELL            "},728,null,null,null,null,null,728,"NEW SALEM WENDELL            ","1Y0"]
[164,735,"NORTH MIDDLESEX              ",735,null,null,null,null,null,735,"NORTH MIDDLESEX              ","1Y0"]
[165,740,"OLD ROCHESTER                ",740,null,null,null,null,null,740,"OLD ROCHESTER                ","1Y0"]
[166,745,"PENTUCKET                    ",745,null,null,null,null,null,745,"PENTUCKET                    ","1Y0"]
[167,750,"PIONEER                      ",750,null,null,null,null,null,750,"PIONEER                      ","1Y0"]
[168,753,"QUABBIN                      ",753,null,null,null,null,null,753,"QUABBIN                      ","1Y0"]
[169,755,"RALPH C MAHAR                ",755,null,null,null,null,null,755,"RALPH C MAHAR                ","1Y0"]
[170,763,"SOMERSET BERKLEY",763,null,null,null,null,null,763,"SOMERSET BERKLEY","1Y0"]
[171,765,"SOUTHERN BERKSHIRE           ",765,null,null,null,null,null,765,"SOUTHERN BERKSHIRE           ","1Y0"]
[172,766,"SOUTHWICK TOLLAND",766,null,null,null,null,null,766,"SOUTHWICK TOLLAND","1Y0"]
[173,767,"SPENCER EAST BROOKFIELD      ",767,null,null,null,null,null,767,"SPENCER EAST BROOKFIELD      ","1Y0"]
[174,770,"TANTASQUA                    ",770,null,null,null,null,null,770,"TANTASQUA                    ","1Y0"]
[175,773,"TRITON                       ",773,null,null,null,null,null,773,"TRITON                       ","1Y0"]
[176,774,"UPISLAND",774,null,null,null,null,null,774,"UPISLAND","1Y0"]
[177,775,"WACHUSETT                    ",775,null,null,null,null,null,775,"WACHUSETT                    ","1Y0"]
[178,778,"QUABOAG",778,null,null,null,null,null,778,"QUABOAG","1Y0"]
[179,780,"WHITMAN HANSON               ",780,null,null,null,null,null,780,"WHITMAN HANSON               ","1Y0"]
[180,817,"ESSEX NORTH SHORE","817",null,null,null,null,null,"817","ESSEX NORTH SHORE","1Y0"]
[181,823,"GREATER LAWRENCE             ",823,null,null,null,null,null,823,"GREATER LAWRENCE             ","1Y0"]
[182,828,"GREATER LOWELL               ",828,null,null,null,null,null,828,"GREATER LOWELL               ","1Y0"]
[183,832,"MONTACHUSETT                 ",832,null,null,null,null,null,832,"MONTACHUSETT                 ","1Y0"]
[184,852,"NASHOBA VALLEY               ",852,null,null,null,null,null,852,"NASHOBA VALLEY               ","1Y0"]
[185,853,"NORTHEAST METROPOLITAN       ",853,null,null,null,null,null,853,"NORTHEAST METROPOLITAN       ","1Y0"]
[186,860,"PATHFINDER                   ",860,null,null,null,null,null,860,"PATHFINDER                   ","1Y0"]
[187,{"$f":"VALUE(J196)","v":885},{"$f":"K196","v":"WHITTIER                     "},{"$f":"J196","v":885},null,null,null,null,null,885,"WHITTIER                     ","1Y0"]

{"sheet":"membership","index":3,"n_rows":450,"n_cols":16,"rows_kept":450,"cut":false,"hidden":true,"merged":[]}
[]
[]
[null,null,null,null,null,null,null,"15 - sch 11 jun15, 2016"]
[]
[null,"Estimated FY15 membership",null,null,null,null,null,"In District FTE"]
[null,null,null,null,null,null,null,null,null,"Fix"]
[null,null,null,null,null,null,null,null,null,"to",null,null,null,null,null,"Total"]
[null,null,"Reg Ed","Sped","Voke Ed",null,null,null,null,"District","Reg Ed","Sped","Voke Ed",null,null,"Day"]
["Lea","District","Memb","Memb","Memb","Sum",null,"Lea","District","1 = yes","Memb","Memb","Memb","Sum","diff","Memb"]
[1,"ABINGTON",{"$f":"K10","v":1866.98},{"$f":"L10","v":72.06},0,1939.04,null,1,"ABINGTON",0,1866.98,72.06,0,1939.04,0,1939.04]
[2,"ACTON",{"$f":"K11","v":0},{"$f":"L11","v":0},{"$f":"M11","v":0},{"$f":"N11","v":0},null,2,"ACTON",0,0,0,0,0,0,0]
[3,"ACUSHNET",921.38,46.12,0,967.5,null,3,"ACUSHNET",0,921.38,46.12,0,967.5,0,967.5]
[4,"ADAMS",0,0,0,0,null,4,"ADAMS",0,0,0,0,0,0,0]
[5,"AGAWAM",3706.91,194.26,75.62,3976.79,null,5,"AGAWAM",0,3706.91,194.26,75.62,3976.79,9.9999999997635314E-3,3976.78]
[6,"ALFORD",0,0,0,0,null,6,"ALFORD",0,0,0,0,0,0,0]
[7,"AMESBURY",2094.88,136.32,0,2231.2000000000003,null,7,"AMESBURY",0,2094.88,136.32,0,2231.2000000000003,1.0000000000218279E-2,2231.19]
[8,"AMHERST",1119.98,63.53,0,1183.51,null,8,"AMHERST",0,1119.98,63.53,0,1183.51,0,1183.51]
[9,"ANDOVER",5770.4,357.73,0,6128.1299999999992,null,9,"ANDOVER",0,5770.4,357.73,0,6128.1299999999992,0,6128.13]
[10,"ARLINGTON",5036.62,235.77,0,5272.39,null,10,"ARLINGTON",0,5036.62,235.77,0,5272.39,1.0000000000218279E-2,5272.38]
[11,"ASHBURNHAM",0,0,0,0,null,11,"ASHBURNHAM",0,0,0,0,0,0,0]
[12,"ASHBY",0,0,0,0,null,12,"ASHBY",0,0,0,0,0,0,0]
[13,"ASHFIELD",0,0,0,0,null,13,"ASHFIELD",0,0,0,0,0,0,0]
[14,"ASHLAND",2476.98,109.57,0,2586.5500000000002,null,14,"ASHLAND",0,2476.98,109.57,0,2586.5500000000002,0,2586.5500000000002]
[15,"ATHOL",0,0,0,0,null,15,"ATHOL",0,0,0,0,0,0,0]
[16,"ATTLEBORO",4545.72,362.73,890.26,5798.7100000000009,null,16,"ATTLEBORO",0,4545.72,362.73,890.26,5798.7100000000009,-9.999999999308784E-3,5798.72]
[17,"AUBURN",2284.17,67.06,0,2351.23,null,17,"AUBURN",0,2284.17,67.06,0,2351.23,0,2351.23]
[18,"AVON",695.36,33.46,0,728.82,null,18,"AVON",0,695.36,33.46,0,728.82,0,728.82]
[19,"AYER",0,0,0,0,null,19,"AYER",0,0,0,0,0,0,0]
[20,"BARNSTABLE",4602.7299999999996,264.08,0,4866.8099999999995,null,20,"BARNSTABLE",0,4602.7299999999996,264.08,0,4866.8099999999995,0,4866.8100000000004]
[21,"BARRE",0,0,0,0,null,21,"BARRE",0,0,0,0,0,0,0]
[22,"BECKET",0,0,0,0,null,22,"BECKET",0,0,0,0,0,0,0]
[23,"BEDFORD",2410.21,111.34,0,2521.5500000000002,null,23,"BEDFORD",0,2410.21,111.34,0,2521.5500000000002,0,2521.5500000000002]
[24,"BELCHERTOWN",2201.42,147.63,0,2349.0500000000002,null,24,"BELCHERTOWN",0,2201.42,147.63,0,2349.0500000000002,-9.9999999997635314E-3,2349.06]
[25,"BELLINGHAM",2227.6999999999998,132.22,0,2359.9199999999996,null,25,"BELLINGHAM",0,2227.6999999999998,132.22,0,2359.9199999999996,0,2359.92]
[26,"BELMONT",4140.93,83.51,0,4224.4400000000005,null,26,"BELMONT",0,4140.93,83.51,0,4224.4400000000005,0,4224.4399999999996]
[27,"BERKLEY",801.72,48.98,0,850.7,null,27,"BERKLEY",0,801.72,48.98,0,850.7,0,850.7]
[28,"BERLIN",176.31,11.25,0,187.56,null,28,"BERLIN",0,176.31,11.25,0,187.56,-9.9999999999909051E-3,187.57]
[29,"BERNARDSTON",0,0,0,0,null,29,"BERNARDSTON",0,0,0,0,0,0,0]
[30,"BEVERLY",4193.82,288.02999999999997,0,4481.8499999999995,null,30,"BEVERLY",0,4193.82,288.02999999999997,0,4481.8499999999995,0,4481.8500000000004]
[31,"BILLERICA",4787.4799999999996,294.57,0,5082.0499999999993,null,31,"BILLERICA",0,4787.4799999999996,294.57,0,5082.0499999999993,9.999999999308784E-3,5082.04]
[32,"BLACKSTONE",0,0,0,0,null,32,"BLACKSTONE",0,0,0,0,0,0,0]
[33,"BLANDFORD",0,0,0,0,null,33,"BLANDFORD",0,0,0,0,0,0,0]
[34,"BOLTON",0,0,0,0,null,34,"BOLTON",0,0,0,0,0,0,0]
[35,"BOSTON",48649.65,5104.8100000000004,659.35,54413.81,null,35,"BOSTON",0,48649.65,5104.8100000000004,659.35,54413.81,-1.0000000002037268E-2,54413.82]
[36,"BOURNE",1900.7,99.17,0,1999.8700000000001,null,36,"BOURNE",0,1900.7,99.17,0,1999.8700000000001,0,1999.87]
[37,"BOXBOROUGH",0,0,0,0,null,37,"BOXBOROUGH",0,0,0,0,0,0,0]
[38,"BOXFORD",705.35,43.64,0,748.99,null,38,"BOXFORD",0,705.35,43.64,0,748.99,0,748.99]
[39,"BOYLSTON",288.72000000000003,8.93,0,297.65000000000003,null,39,"BOYLSTON",0,288.72000000000003,8.93,0,297.65000000000003,0,297.64999999999998]
[40,"BRAINTREE",5248.6,412.01,0,5660.6100000000006,null,40,"BRAINTREE",0,5248.6,412.01,0,5660.6100000000006,-9.999999999308784E-3,5660.62]
[41,"BREWSTER",448.21,19.88,0,468.09,null,41,"BREWSTER",0,448.21,19.88,0,468.09,0,468.09]
[42,"BRIDGEWATER",0,0,0,0,null,42,"BRIDGEWATER",0,0,0,0,0,0,0]
[43,"BRIMFIELD",277.33999999999997,11.13,0,288.46999999999997,null,43,"BRIMFIELD",0,277.33999999999997,11.13,0,288.46999999999997,-1.0000000000047748E-2,288.48]
[44,"BROCKTON",15819.33,837.85,201.33,16858.510000000002,null,44,"BROCKTON",0,15819.33,837.85,201.33,16858.510000000002,0,16858.509999999998]
[45,"BROOKFIELD",319.86,12.35,0,332.21000000000004,null,45,"BROOKFIELD",0,319.86,12.35,0,332.21000000000004,0,332.21]
[46,"BROOKLINE",7127.88,372.48,0,7500.3600000000006,null,46,"BROOKLINE",0,7127.88,372.48,0,7500.3600000000006,-9.999999999308784E-3,7500.37]
[47,"BUCKLAND",0,0,0,0,null,47,"BUCKLAND",0,0,0,0,0,0,0]
[48,"BURLINGTON",3343.09,108.42,0,3451.51,null,48,"BURLINGTON",0,3343.09,108.42,0,3451.51,0,3451.51]
[49,"CAMBRIDGE",5569.63,408.33,450.06,6428.02,null,49,"CAMBRIDGE",0,5569.63,408.33,450.06,6428.02,0,6428.02]
[50,"CANTON",2909.37,103.1,0,3012.47,null,50,"CANTON",1,2909.37,103.1,0,3012.47,-346.93000000000711,3359.4000000000069]
[51,"CARLISLE",614,24.75,0,638.75,null,51,"CARLISLE",0,614,24.75,0,638.75,-9.9999999999909051E-3,638.76]
[52,"CARVER",1523.14,101.95,0,1625.0900000000001,null,52,"CARVER",0,1523.14,101.95,0,1625.0900000000001,0,1625.09]
[53,"CHARLEMONT",0,0,0,0,null,53,"CHARLEMONT",0,0,0,0,0,0,0]
[54,"CHARLTON",0,0,0,0,null,54,"CHARLTON",0,0,0,0,0,0,0]
[55,"CHATHAM",0,0,0,0,null,55,"CHATHAM",0,0,0,0,0,0,0]
[56,"CHELMSFORD",4806.9399999999996,221.5,0,5028.4399999999996,null,56,"CHELMSFORD",0,4806.9399999999996,221.5,0,5028.4399999999996,0,5028.4399999999996]
[57,"CHELSEA",6028.87,271.54000000000002,0,6300.41,null,57,"CHELSEA",0,6028.87,271.54000000000002,0,6300.41,0,6300.41]
[58,"CHESHIRE",0,0,0,0,null,58,"CHESHIRE",0,0,0,0,0,0,0]
[59,"CHESTER",0,0,0,0,null,59,"CHESTER",0,0,0,0,0,0,0]
[60,"CHESTERFIELD",0,0,0,0,null,60,"CHESTERFIELD",0,0,0,0,0,0,0]
[61,"CHICOPEE",6622.64,543.66999999999996,452.04,7618.35,null,61,"CHICOPEE",0,6622.64,543.66999999999996,452.04,7618.35,1.0000000000218279E-2,7618.34]
[62,"CHILMARK",0,0,0,0,null,62,"CHILMARK",0,0,0,0,0,0,0]
[63,"CLARKSBURG",159.18,11.28,0,170.46,null,63,"CLARKSBURG",0,159.18,11.28,0,170.46,0,170.46]
[64,"CLINTON",1716.73,140.59,0,1857.32,null,64,"CLINTON",0,1716.73,140.59,0,1857.32,0,1857.32]
[65,"COHASSET",1545.89,47.57,0,1593.46,null,65,"COHASSET",0,1545.89,47.57,0,1593.46,0,1593.46]
[66,"COLRAIN",{"$f":"K75","v":0},{"$f":"L75","v":0},{"$f":"M75","v":0},{"$f":"N75","v":0},null,66,"COLRAIN",0,0,0,0,0,0,0]
[67,"CONCORD",1993.64,101.3,0,2094.94,null,67,"CONCORD",0,1993.64,101.3,0,2094.94,0,2094.94]
[68,"CONWAY",157.1,10.94,0,168.04,null,68,"CONWAY",0,157.1,10.94,0,168.04,0,168.04]
[69,"CUMMINGTON",0,0,0,0,null,69,"CUMMINGTON",0,0,0,0,0,0,0]
[70,"DALTON",0,0,0,0,null,70,"DALTON",0,0,0,0,0,0,0]
[71,"DANVERS",3387.76,177.13,0,3564.8900000000003,null,71,"DANVERS",0,3387.76,177.13,0,3564.8900000000003,0,3564.89]
[72,"DARTMOUTH",3552.42,145.43,0,3697.85,null,72,"DARTMOUTH",0,3552.42,145.43,0,3697.85,0,3697.85]
[73,"DEDHAM",2565.3000000000002,176.47,0,2741.77,null,73,"DEDHAM",0,2565.3000000000002,176.47,0,2741.77,0,2741.77]
[74,"DEERFIELD",405.36,25.54,0,430.90000000000003,null,74,"DEERFIELD",0,405.36,25.54,0,430.90000000000003,0,430.9]
[75,"DENNIS",0,0,0,0,null,75,"DENNIS",0,0,0,0,0,0,0]
[76,"DIGHTON",0,0,0,0,null,76,"DIGHTON",0,0,0,0,0,0,0]
[77,"DOUGLAS",1453.58,77.19,0,1530.77,null,77,"DOUGLAS",0,1453.58,77.19,0,1530.77,0,1530.77]
[78,"DOVER",454.06,22.25,0,476.31,null,78,"DOVER",0,454.06,22.25,0,476.31,0,476.31]
[79,"DRACUT",3495.47,177.13,0,3672.6,null,79,"DRACUT",0,3495.47,177.13,0,3672.6,0,3672.6]
[80,"DUDLEY",0,0,0,0,null,80,"DUDLEY",0,0,0,0,0,0,0]
[81,"DUNSTABLE",0,0,0,0,null,81,"DUNSTABLE",0,0,0,0,0,0,0]
[82,"DUXBURY",3098.19,106.25,0,3204.44,null,82,"DUXBURY",0,3098.19,106.25,0,3204.44,0,3204.44]
[83,"EAST BRIDGEWATER",2147.6799999999998,133.12,0,2280.7999999999997,null,83,"EAST BRIDGEWATER",0,2147.6799999999998,133.12,0,2280.7999999999997,-1.0000000000218279E-2,2280.81]
[84,"EAST BROOKFIELD",0,0,0,0,null,84,"EAST BROOKFIELD",0,0,0,0,0,0,0]
[85,"EASTHAM",167.8,6.98,0,174.78,null,85,"EASTHAM",0,167.8,6.98,0,174.78,0,174.78]
[86,"EASTHAMPTON",1385.96,85.24,57.91,1529.1100000000001,null,86,"EASTHAMPTON",0,1385.96,85.24,57.91,1529.1100000000001,-9.9999999997635314E-3,1529.12]
[87,"EAST LONGMEADOW",2510.46,152.32,7.88,2670.6600000000003,null,87,"EAST LONGMEADOW",0,2510.46,152.32,7.88,2670.6600000000003,0,2670.66]
[88,"EASTON",3588.83,171.83,0,3760.66,null,88,"EASTON",0,3588.83,171.83,0,3760.66,0,3760.66]
[89,"EDGARTOWN",323.27,30.17,0,353.44,null,89,"EDGARTOWN",0,323.27,30.17,0,353.44,0,353.44]
[90,"EGREMONT",0,0,0,0,null,90,"EGREMONT",0,0,0,0,0,0,0]
[91,"ERVING",131.08000000000001,8.5299999999999994,0,139.61000000000001,null,91,"ERVING",0,131.08000000000001,8.5299999999999994,0,139.61000000000001,-9.9999999999909051E-3,139.62]
[92,"ESSEX",0,0,0,0,null,92,"ESSEX",0,0,0,0,0,0,0]
[93,"EVERETT",6713.32,317.14,0,7030.46,null,93,"EVERETT",0,6713.32,317.14,0,7030.46,0,7030.46]
[94,"FAIRHAVEN",1922.44,87.71,0,2010.15,null,94,"FAIRHAVEN",0,1922.44,87.71,0,2010.15,0,2010.15]
[95,"FALL RIVER",9002.35,794.13,367.9,10164.379999999999,null,95,"FALL RIVER",0,9002.35,794.13,367.9,10164.379999999999,9.9999999983992893E-3,10164.370000000001]
[96,"FALMOUTH",3124.3,201.03,203.75,3529.0800000000004,null,96,"FALMOUTH",0,3124.3,201.03,203.75,3529.0800000000004,0,3529.08]
[97,"FITCHBURG",4579.55,357.84,0,4937.3900000000003,null,97,"FITCHBURG",0,4579.55,357.84,0,4937.3900000000003,0,4937.3900000000003]
[98,"FLORIDA",77.67,7.48,0,85.15,null,98,"FLORIDA",0,77.67,7.48,0,85.15,1.0000000000005116E-2,85.14]
[99,"FOXBOROUGH",2524.66,154,0,2678.66,null,99,"FOXBOROUGH",0,2524.66,154,0,2678.66,0,2678.66]
[100,"FRAMINGHAM",7613.1,707.35,0,8320.4500000000007,null,100,"FRAMINGHAM",0,7613.1,707.35,0,8320.4500000000007,0,8320.4500000000007]
[101,"FRANKLIN",5370.36,264.58,0,5634.94,null,101,"FRANKLIN",0,5370.36,264.58,0,5634.94,0,5634.94]
[102,"FREETOWN",0,0,0,0,null,102,"FREETOWN",0,0,0,0,0,0,0]
[103,"GARDNER",2246.17,180.09,0,2426.2600000000002,null,103,"GARDNER",0,2246.17,180.09,0,2426.2600000000002,-9.9999999997635314E-3,2426.27]
[104,"AQUINNAH",0,0,0,0,null,104,"AQUINNAH",0,0,0,0,0,0,0]
[105,"GEORGETOWN",1409.14,59.86,0,1469,null,105,"GEORGETOWN",0,1409.14,59.86,0,1469,0,1469]
[106,"GILL",0,0,0,0,null,106,"GILL",0,0,0,0,0,0,0]
[107,"GLOUCESTER",2583.46,221.51,118.5,2923.4700000000003,null,107,"GLOUCESTER",0,2583.46,221.51,118.5,2923.4700000000003,0,2923.47]
[108,"GOSHEN",0,0,0,0,null,108,"GOSHEN",0,0,0,0,0,0,0]
[109,"GOSNOLD",2,0,0,2,null,109,"GOSNOLD",0,2,0,0,2,0,2]
[110,"GRAFTON",2971.32,147.79,0,3119.11,null,110,"GRAFTON",0,2971.32,147.79,0,3119.11,0,3119.11]
[111,"GRANBY",828.83,45.91,0,874.74,null,111,"GRANBY",0,828.83,45.91,0,874.74,0,874.74]
[112,"GRANVILLE",0,0,0,0,null,112,"GRANVILLE",0,0,0,0,0,0,0]
[113,"GREAT BARRINGTON",0,0,0,0,null,113,"GREAT BARRINGTON",0,0,0,0,0,0,0]
[114,"GREENFIELD",1581.44,95.23,0,1676.67,null,114,"GREENFIELD",0,1581.44,95.23,0,1676.67,0,1676.67]
[115,"GROTON",0,0,0,0,null,115,"GROTON",0,0,0,0,0,0,0]
[116,"GROVELAND",0,0,0,0,null,116,"GROVELAND",0,0,0,0,0,0,0]
[117,"HADLEY",593.42999999999995,24.2,0,617.63,null,117,"HADLEY",0,593.42999999999995,24.2,0,617.63,0,617.63]
[118,"HALIFAX",541.83000000000004,20.64,0,562.47,null,118,"HALIFAX",0,541.83000000000004,20.64,0,562.47,0,562.47]
[119,"HAMILTON",0,0,0,0,null,119,"HAMILTON",0,0,0,0,0,0,0]
[120,"HAMPDEN",0,0,0,0,null,120,"HAMPDEN",0,0,0,0,0,0,0]
[121,"HANCOCK",39.380000000000003,2.4,0,41.78,null,121,"HANCOCK",0,39.380000000000003,2.4,0,41.78,0,41.78]
[122,"HANOVER",2487,143.52000000000001,0,2630.52,null,122,"HANOVER",0,2487,143.52000000000001,0,2630.52,0,2630.52]
[123,"HANSON",0,0,0,0,null,123,"HANSON",0,0,0,0,0,0,0]
[124,"HARDWICK",0,0,0,0,null,124,"HARDWICK",0,0,0,0,0,0,0]
[125,"HARVARD",1114.19,35.409999999999997,0,1149.6000000000001,null,125,"HARVARD",0,1114.19,35.409999999999997,0,1149.6000000000001,0,1149.5999999999999]
[126,"HARWICH",0,0,0,0,null,126,"HARWICH",0,0,0,0,0,0,0]
[127,"HATFIELD",429.16,22.45,0,451.61,null,127,"HATFIELD",0,429.16,22.45,0,451.61,0,451.61]
[128,"HAVERHILL",6601.06,600.91999999999996,0,7201.9800000000005,null,128,"HAVERHILL",0,6601.06,600.91999999999996,0,7201.9800000000005,0,7201.98]
[129,"HAWLEY",0,0,0,0,null,129,"HAWLEY",0,0,0,0,0,0,0]
[130,"HEATH",{"$f":"K139","v":0},{"$f":"L139","v":0},{"$f":"M139","v":0},{"$f":"N139","v":0},null,130,"HEATH",0,0,0,0,0,0,0]
[131,"HINGHAM",4116.16,148.91,0,4265.07,null,131,"HINGHAM",0,4116.16,148.91,0,4265.07,-1.0000000000218279E-2,4265.08]
[132,"HINSDALE",0,0,0,0,null,132,"HINSDALE",0,0,0,0,0,0,0]
[133,"HOLBROOK",1110.8,58.88,0,1169.68,null,133,"HOLBROOK",0,1110.8,58.88,0,1169.68,-9.9999999999909051E-3,1169.69]
[134,"HOLDEN",0,0,0,0,null,134,"HOLDEN",0,0,0,0,0,0,0]
[135,"HOLLAND",226.11,13.25,0,239.36,null,135,"HOLLAND",0,226.11,13.25,0,239.36,0,239.36]
[136,"HOLLISTON",2682.39,137.91999999999999,0,2820.31,null,136,"HOLLISTON",0,2682.39,137.91999999999999,0,2820.31,0,2820.31]
[137,"HOLYOKE",4652.67,520.79999999999995,285.83,5459.3,null,137,"HOLYOKE",0,4652.67,520.79999999999995,285.83,5459.3,0,5459.3]
[138,"HOPEDALE",1159.23,61.73,0,1220.96,null,138,"HOPEDALE",0,1159.23,61.73,0,1220.96,0,1220.96]
[139,"HOPKINTON",3304.07,121.24,0,3425.31,null,139,"HOPKINTON",0,3304.07,121.24,0,3425.31,0,3425.31]
[140,"HUBBARDSTON",0,0,0,0,null,140,"HUBBARDSTON",0,0,0,0,0,0,0]
[141,"HUDSON",2700.18,152.9,0,2853.08,null,141,"HUDSON",0,2700.18,152.9,0,2853.08,0,2853.08]
[142,"HULL",984.01,39.14,0,1023.15,null,142,"HULL",0,984.01,39.14,0,1023.15,9.9999999999909051E-3,1023.14]
[143,"HUNTINGTON",0,0,0,0,null,143,"HUNTINGTON",0,0,0,0,0,0,0]
[144,"IPSWICH",1821.95,71.55,0,1893.5,null,144,"IPSWICH",0,1821.95,71.55,0,1893.5,9.9999999999909051E-3,1893.49]
[145,"KINGSTON",1012.18,54.88,0,1067.06,null,145,"KINGSTON",0,1012.18,54.88,0,1067.06,0,1067.06]
[146,"LAKEVILLE",0,0,0,0,null,146,"LAKEVILLE",0,0,0,0,0,0,0]
[147,"LANCASTER",0,0,0,0,null,147,"LANCASTER",0,0,0,0,0,0,0]
[148,"LANESBOROUGH",201.65,13.84,0,215.49,null,148,"LANESBOROUGH",0,201.65,13.84,0,215.49,0,215.49]
[149,"LAWRENCE",12932.12,913.07,0,13845.19,null,149,"LAWRENCE",0,12932.12,913.07,0,13845.19,0,13845.19]
[150,"LEE",657.03,27.31,0,684.33999999999992,null,150,"LEE",0,657.03,27.31,0,684.33999999999992,0,684.34]
[151,"LEICESTER",1527.8,73.180000000000007,0,1600.98,null,151,"LEICESTER",0,1527.8,73.180000000000007,0,1600.98,0,1600.98]
[152,"LENOX",710.93,20.13,0,731.06,null,152,"LENOX",0,710.93,20.13,0,731.06,0,731.06]
[153,"LEOMINSTER",5042.74,421.14,597.4,6061.28,null,153,"LEOMINSTER",0,5042.74,421.14,597.4,6061.28,9.999999999308784E-3,6061.27]
[154,"LEVERETT",126.92,6.58,0,133.5,null,154,"LEVERETT",0,126.92,6.58,0,133.5,9.9999999999909051E-3,133.49]
[155,"LEXINGTON",6520.04,257.29000000000002,0,6777.33,null,155,"LEXINGTON",0,6520.04,257.29000000000002,0,6777.33,0,6777.33]
[156,"LEYDEN",0,0,0,0,null,156,"LEYDEN",0,0,0,0,0,0,0]
[157,"LINCOLN",1150.6600000000001,50.63,0,1201.2900000000002,null,157,"LINCOLN",0,1150.6600000000001,50.63,0,1201.2900000000002,0,1201.29]
[158,"LITTLETON",1512.94,84.01,0,1596.95,null,158,"LITTLETON",0,1512.94,84.01,0,1596.95,0,1596.95]
[159,"LONGMEADOW",2722.64,137.04,6.77,2866.45,null,159,"LONGMEADOW",0,2722.64,137.04,6.77,2866.45,-1.0000000000218279E-2,2866.46]
[160,"LOWELL",12898.29,817.16,241.8,13957.25,null,160,"LOWELL",0,12898.29,817.16,241.8,13957.25,1.0000000000218279E-2,13957.24]
[161,"LUDLOW",2476.37,171.49,35.36,2683.22,null,161,"LUDLOW",0,2476.37,171.49,35.36,2683.22,0,2683.22]
[162,"LUNENBURG",1470.97,92.31,0,1563.28,null,162,"LUNENBURG",0,1470.97,92.31,0,1563.28,0,1563.28]
[163,"LYNN",13329.47,984.76,620.88,14935.109999999999,null,163,"LYNN",0,13329.47,984.76,620.88,14935.109999999999,0,14935.11]
[164,"LYNNFIELD",2090.14,104.7,0,2194.8399999999997,null,164,"LYNNFIELD",0,2090.14,104.7,0,2194.8399999999997,0,2194.84]
[165,"MALDEN",6147.37,367.75,0,6515.12,null,165,"MALDEN",0,6147.37,367.75,0,6515.12,0,6515.12]
[166,"MANCHESTER",0,0,0,0,null,166,"MANCHESTER",0,0,0,0,0,0,0]
[167,"MANSFIELD",3914.51,211.41,0,4125.92,null,167,"MANSFIELD",0,3914.51,211.41,0,4125.92,0,4125.92]
[168,"MARBLEHEAD",2992.45,231.32,0,3223.77,null,168,"MARBLEHEAD",0,2992.45,231.32,0,3223.77,0,3223.77]
[169,"MARION",412.63,19.75,0,432.38,null,169,"MARION",0,412.63,19.75,0,432.38,0,432.38]
[170,"MARLBOROUGH",4226.53,334.44,0,4560.9699999999993,null,170,"MARLBOROUGH",0,4226.53,334.44,0,4560.9699999999993,9.999999999308784E-3,4560.96]
[171,"MARSHFIELD",3960.79,196.94,47.55,4205.28,null,171,"MARSHFIELD",0,3960.79,196.94,47.55,4205.28,0,4205.28]
[172,"MASHPEE",1582.44,95.35,0,1677.79,null,172,"MASHPEE",0,1582.44,95.35,0,1677.79,0,1677.79]
[173,"MATTAPOISETT",488.59,12.89,0,501.47999999999996,null,173,"MATTAPOISETT",0,488.59,12.89,0,501.47999999999996,0,501.48]
[174,"MAYNARD",1342.39,75.930000000000007,0,1418.3200000000002,null,174,"MAYNARD",0,1342.39,75.930000000000007,0,1418.3200000000002,0,1418.32]
[175,"MEDFIELD",2508.89,81.790000000000006,0,2590.6799999999998,null,175,"MEDFIELD",0,2508.89,81.790000000000006,0,2590.6799999999998,0,2590.6799999999998]
[176,"MEDFORD",3975.84,278.68,181.38,4435.9000000000005,null,176,"MEDFORD",0,3975.84,278.68,181.38,4435.9000000000005,1.0000000000218279E-2,4435.8900000000003]
[177,"MEDWAY",2305.96,88.98,0,2394.94,null,177,"MEDWAY",0,2305.96,88.98,0,2394.94,0,2394.94]
[178,"MELROSE",3535.91,155.85,0,3691.7599999999998,null,178,"MELROSE",0,3535.91,155.85,0,3691.7599999999998,0,3691.76]
[179,"MENDON",0,0,0,0,null,179,"MENDON",0,0,0,0,0,0,0]
[180,"MERRIMAC",0,0,0,0,null,180,"MERRIMAC",0,0,0,0,0,0,0]
[181,"METHUEN",6383.39,362.1,206.52,6952.0100000000011,null,181,"METHUEN",0,6383.39,362.1,206.52,6952.0100000000011,0,6952.01]
[182,"MIDDLEBOROUGH",2922.94,179.81,0,3102.75,null,182,"MIDDLEBOROUGH",0,2922.94,179.81,0,3102.75,-1.0000000000218279E-2,3102.76]
[183,"MIDDLEFIELD",0,0,0,0,null,183,"MIDDLEFIELD",0,0,0,0,0,0,0]
[184,"MIDDLETON",708.95,43.63,0,752.58,null,184,"MIDDLETON",0,708.95,43.63,0,752.58,0,752.58]
[185,"MILFORD",3884.65,223.46,16.899999999999999,4125.0099999999993,null,185,"MILFORD",0,3884.65,223.46,16.899999999999999,4125.0099999999993,0,4125.01]
[186,"MILLBURY",1599.78,94.41,0,1694.19,null,186,"MILLBURY",0,1599.78,94.41,0,1694.19,0,1694.19]
[187,"MILLIS",1330.03,39.33,0,1369.36,null,187,"MILLIS",0,1330.03,39.33,0,1369.36,0,1369.36]
[188,"MILLVILLE",0,0,0,0,null,188,"MILLVILLE",0,0,0,0,0,0,0]
[189,"MILTON",3821.21,170.34,0,3991.55,null,189,"MILTON",0,3821.21,170.34,0,3991.55,0,3991.55]
[190,"MONROE",0,0,0,0,null,190,"MONROE",0,0,0,0,0,0,0]
[191,"MONSON",1031.98,53.58,0,1085.56,null,191,"MONSON",0,1031.98,53.58,0,1085.56,0,1085.56]
[192,"MONTAGUE",0,0,0,0,null,192,"MONTAGUE",0,0,0,0,0,0,0]
[193,"MONTEREY",0,0,0,0,null,193,"MONTEREY",0,0,0,0,0,0,0]
[194,"MONTGOMERY",{"$f":"K203","v":0},{"$f":"L203","v":0},{"$f":"M203","v":0},{"$f":"N203","v":0},null,194,"MONTGOMERY",0,0,0,0,0,0,0]
[195,"MOUNT WASHINGTON",0,0,0,0,null,195,"MOUNT WASHINGTON",0,0,0,0,0,0,0]
[196,"NAHANT",168.09,6.48,0,174.57,null,196,"NAHANT",0,168.09,6.48,0,174.57,0,174.57]
[197,"NANTUCKET",1457.35,67.66,0,1525.01,null,197,"NANTUCKET",0,1457.35,67.66,0,1525.01,0,1525.01]
[198,"NATICK",5065.07,274.3,0,5339.37,null,198,"NATICK",0,5065.07,274.3,0,5339.37,0,5339.37]
[199,"NEEDHAM",5282.9,251.68,0,5534.58,null,199,"NEEDHAM",0,5282.9,251.68,0,5534.58,1.0000000000218279E-2,5534.57]
[200,"NEW ASHFORD",0,0,0,0,null,200,"NEW ASHFORD",0,0,0,0,0,0,0]
[201,"NEW BEDFORD",11512.06,1052.19,0,12564.25,null,201,"NEW BEDFORD",0,11512.06,1052.19,0,12564.25,1.0000000000218279E-2,12564.24]
[202,"NEW BRAINTREE",0,0,0,0,null,202,"NEW BRAINTREE",0,0,0,0,0,0,0]
[203,"NEWBURY",0,0,0,0,null,203,"NEWBURY",0,0,0,0,0,0,0]
[204,"NEWBURYPORT",2256.88,83.21,0,2340.09,null,204,"NEWBURYPORT",0,2256.88,83.21,0,2340.09,1.0000000000218279E-2,2340.08]
[205,"NEW MARLBOROUGH",0,0,0,0,null,205,"NEW MARLBOROUGH",0,0,0,0,0,0,0]
[206,"NEW SALEM",0,0,0,0,null,206,"NEW SALEM",0,0,0,0,0,0,0]
[207,"NEWTON",11420.72,710.09,375.38,12506.189999999999,null,207,"NEWTON",0,11420.72,710.09,375.38,12506.189999999999,0,12506.19]
[208,"NORFOLK",851.61,39.19,0,890.8,null,208,"NORFOLK",0,851.61,39.19,0,890.8,0,890.8]
[209,"NORTH ADAMS",1354.58,115.07,0,1469.6499999999999,null,209,"NORTH ADAMS",0,1354.58,115.07,0,1469.6499999999999,0,1469.65]
[210,"NORTHAMPTON",2482.9499999999998,181.67,0,2664.62,null,210,"NORTHAMPTON",0,2482.9499999999998,181.67,0,2664.62,0,2664.62]
[211,"NORTH ANDOVER",4552.5,212.07,0,4764.57,null,211,"NORTH ANDOVER",0,4552.5,212.07,0,4764.57,0,4764.57]
[212,"NORTH ATTLEBOROUGH",4286.58,270.81,0,4557.3900000000003,null,212,"NORTH ATTLEBOROUGH",0,4286.58,270.81,0,4557.3900000000003,0,4557.3900000000003]
[213,"NORTHBOROUGH",1717.22,80.650000000000006,0,1797.8700000000001,null,213,"NORTHBOROUGH",0,1717.22,80.650000000000006,0,1797.8700000000001,-9.9999999999909051E-3,1797.88]
[214,"NORTHBRIDGE",2284.23,126.36,0,2410.59,null,214,"NORTHBRIDGE",0,2284.23,126.36,0,2410.59,0,2410.59]
[215,"NORTH BROOKFIELD",538.35,31.85,0,570.20000000000005,null,215,"NORTH BROOKFIELD",0,538.35,31.85,0,570.20000000000005,0,570.20000000000005]
[216,"NORTHFIELD",0,0,0,0,null,216,"NORTHFIELD",0,0,0,0,0,0,0]
[217,"NORTH READING",2408.88,137.31,0,2546.19,null,217,"NORTH READING",0,2408.88,137.31,0,2546.19,0,2546.19]
[218,"NORTON",2390.83,160.85,0,2551.6799999999998,null,218,"NORTON",0,2390.83,160.85,0,2551.6799999999998,0,2551.6799999999998]
[219,"NORWELL",2159.87,74.97,0,2234.8399999999997,null,219,"NORWELL",0,2159.87,74.97,0,2234.8399999999997,0,2234.84]
[220,"NORWOOD",3204.32,222.49,0,3426.8100000000004,null,220,"NORWOOD",0,3204.32,222.49,0,3426.8100000000004,0,3426.81]
[221,"OAK BLUFFS",383.66,23.54,0,407.20000000000005,null,221,"OAK BLUFFS",0,383.66,23.54,0,407.20000000000005,-9.9999999999340616E-3,407.21]
[222,"OAKHAM",0,0,0,0,null,222,"OAKHAM",0,0,0,0,0,0,0]
[223,"ORANGE",590.45000000000005,50.42,0,640.87,null,223,"ORANGE",0,590.45000000000005,50.42,0,640.87,0,640.87]
[224,"ORLEANS",210.4,11.5,0,221.9,null,224,"ORLEANS",0,210.4,11.5,0,221.9,0,221.9]
[225,"OTIS",0,0,0,0,null,225,"OTIS",0,0,0,0,0,0,0]
[226,"OXFORD",1737.12,102.21,0,1839.33,null,226,"OXFORD",0,1737.12,102.21,0,1839.33,0,1839.33]
[227,"PALMER",1325.49,99.99,0,1425.48,null,227,"PALMER",0,1325.49,99.99,0,1425.48,-9.9999999999909051E-3,1425.49]
[228,"PAXTON",0,0,0,0,null,228,"PAXTON",0,0,0,0,0,0,0]
[229,"PEABODY",5206.53,395.61,391.31,5993.45,null,229,"PEABODY",0,5206.53,395.61,391.31,5993.45,1.0000000000218279E-2,5993.44]
[230,"PELHAM",115.47,7.16,0,122.63,null,230,"PELHAM",0,115.47,7.16,0,122.63,0,122.63]
[231,"PEMBROKE",3078.07,123.15,0,3201.2200000000003,null,231,"PEMBROKE",0,3078.07,123.15,0,3201.2200000000003,0,3201.22]
[232,"PEPPERELL",0,0,0,0,null,232,"PEPPERELL",0,0,0,0,0,0,0]
[233,"PERU",0,0,0,0,null,233,"PERU",0,0,0,0,0,0,0]
[234,"PETERSHAM",110.72,5.05,0,115.77,null,234,"PETERSHAM",0,110.72,5.05,0,115.77,0,115.77]
[235,"PHILLIPSTON",0,0,0,0,null,235,"PHILLIPSTON",0,0,0,0,0,0,0]
[236,"PITTSFIELD",4986.37,443.07,348.05,5777.49,null,236,"PITTSFIELD",0,4986.37,443.07,348.05,5777.49,-1.0000000000218279E-2,5777.5]
[237,"PLAINFIELD",0,0,0,0,null,237,"PLAINFIELD",0,0,0,0,0,0,0]
[238,"PLAINVILLE",698.48,35.369999999999997,0,733.85,null,238,"PLAINVILLE",0,698.48,35.369999999999997,0,733.85,0,733.85]
[239,"PLYMOUTH",6638.21,465.06,597.1,7700.3700000000008,null,239,"PLYMOUTH",0,6638.21,465.06,597.1,7700.3700000000008,0,7700.37]
[240,"PLYMPTON",209.64,8.2100000000000009,0,217.85,null,240,"PLYMPTON",0,209.64,8.2100000000000009,0,217.85,0,217.85]
[241,"PRINCETON",0,0,0,0,null,241,"PRINCETON",0,0,0,0,0,0,0]
[242,"PROVINCETOWN",105.94,6.25,0,112.19,null,242,"PROVINCETOWN",0,105.94,6.25,0,112.19,0,112.19]
[243,"QUINCY",7314.87,552.41999999999996,1177.06,9044.35,null,243,"QUINCY",0,7314.87,552.41999999999996,1177.06,9044.35,-1.0000000000218279E-2,9044.36]
[244,"RANDOLPH",2695.09,271.89999999999998,0,2966.9900000000002,null,244,"RANDOLPH",0,2695.09,271.89999999999998,0,2966.9900000000002,0,2966.99]
[245,"RAYNHAM",0,0,0,0,null,245,"RAYNHAM",0,0,0,0,0,0,0]
[246,"READING",4152.8500000000004,222.84,0,4375.6900000000005,null,246,"READING",0,4152.8500000000004,222.84,0,4375.6900000000005,0,4375.6899999999996]
[247,"REHOBOTH",0,0,0,0,null,247,"REHOBOTH",0,0,0,0,0,0,0]
[248,"REVERE",6641.12,335.74,0,6976.86,null,248,"REVERE",0,6641.12,335.74,0,6976.86,0,6976.86]
[249,"RICHMOND",157.34,1.1599999999999999,0,158.5,null,249,"RICHMOND",0,157.34,1.1599999999999999,0,158.5,0,158.5]
[250,"ROCHESTER",451.33,24.15,0,475.47999999999996,null,250,"ROCHESTER",0,451.33,24.15,0,475.47999999999996,0,475.48]
[251,"ROCKLAND",2125.91,134.59,0,2260.5,null,251,"ROCKLAND",0,2125.91,134.59,0,2260.5,-1.0000000000218279E-2,2260.5100000000002]
[252,"ROCKPORT",907.3,49.39,0,956.68999999999994,null,252,"ROCKPORT",0,907.3,49.39,0,956.68999999999994,9.9999999999909051E-3,956.68]
[253,"ROWE",62.41,3.36,0,65.77,null,253,"ROWE",0,62.41,3.36,0,65.77,0,65.77]
[254,"ROWLEY",0,0,0,0,null,254,"ROWLEY",0,0,0,0,0,0,0]
[255,"ROYALSTON",0,0,0,0,null,255,"ROYALSTON",0,0,0,0,0,0,0]
[256,"RUSSELL",0,0,0,0,null,256,"RUSSELL",0,0,0,0,0,0,0]
[257,"RUTLAND",0,0,0,0,null,257,"RUTLAND",0,0,0,0,0,0,0]
[258,"SALEM",{"$f":"K267","v":3482.85},{"$f":"L267","v":299.44},{"$f":"M267","v":352.05},{"$f":"N267","v":4134.34},null,258,"SALEM",0,3482.85,299.44,352.05,4134.34,-1.0000000000218279E-2,4134.3500000000004]
[259,"SALISBURY",0,0,0,0,null,259,"SALISBURY",0,0,0,0,0,0,0]
[260,"SANDISFIELD",0,0,0,0,null,260,"SANDISFIELD",0,0,0,0,0,0,0]
[261,"SANDWICH",2746.67,122.78,0,2869.4500000000003,null,261,"SANDWICH",0,2746.67,122.78,0,2869.4500000000003,0,2869.45]
[262,"SAUGUS",2556.6,141.96,0,2698.56,null,262,"SAUGUS",0,2556.6,141.96,0,2698.56,0,2698.56]
[263,"SAVOY",35.979999999999997,2.4,0,38.379999999999995,null,263,"SAVOY",0,35.979999999999997,2.4,0,38.379999999999995,0,38.380000000000003]
[264,"SCITUATE",2947.25,123.84,0,3071.09,null,264,"SCITUATE",0,2947.25,123.84,0,3071.09,0,3071.09]
[265,"SEEKONK",1861.41,93.93,0,1955.3400000000001,null,265,"SEEKONK",0,1861.41,93.93,0,1955.3400000000001,0,1955.34]
[266,"SHARON",3379.81,135.78,0,3515.59,null,266,"SHARON",0,3379.81,135.78,0,3515.59,0,3515.59]
[267,"SHEFFIELD",0,0,0,0,null,267,"SHEFFIELD",0,0,0,0,0,0,0]
[268,"SHELBURNE",0,0,0,0,null,268,"SHELBURNE",0,0,0,0,0,0,0]
[269,"SHERBORN",378.14,10.91,0,389.05,null,269,"SHERBORN",0,378.14,10.91,0,389.05,9.9999999999909051E-3,389.04]
[270,"SHIRLEY",0,0,0,0,null,270,"SHIRLEY",0,0,0,0,0,0,0]
[271,"SHREWSBURY",5644.37,223.79,0,5868.16,null,271,"SHREWSBURY",0,5644.37,223.79,0,5868.16,0,5868.16]
[272,"SHUTESBURY",148.19999999999999,7.68,0,155.88,null,272,"SHUTESBURY",0,148.19999999999999,7.68,0,155.88,0,155.88]
[273,"SOMERSET",1754.43,71.510000000000005,0,1825.94,null,273,"SOMERSET",0,1754.43,71.510000000000005,0,1825.94,0,1825.94]
[274,"SOMERVILLE",4086.33,372.15,388.31,4846.79,null,274,"SOMERVILLE",0,4086.33,372.15,388.31,4846.79,0,4846.79]
[275,"SOUTHAMPTON",501.79,34.28,0,536.07000000000005,null,275,"SOUTHAMPTON",0,501.79,34.28,0,536.07000000000005,-9.9999999999909051E-3,536.08000000000004]
[276,"SOUTHBOROUGH",1273.75,50.18,0,1323.93,null,276,"SOUTHBOROUGH",0,1273.75,50.18,0,1323.93,0,1323.93]
[277,"SOUTHBRIDGE",2111.69,125.78,0,2237.4700000000003,null,277,"SOUTHBRIDGE",0,2111.69,125.78,0,2237.4700000000003,0,2237.4699999999998]
[278,"SOUTH HADLEY",1732.78,91.18,30.54,1854.5,null,278,"SOUTH HADLEY",0,1732.78,91.18,30.54,1854.5,0,1854.5]
[279,"SOUTHWICK",0,0,0,0,null,279,"SOUTHWICK",0,0,0,0,0,0,0]
[280,"SPENCER",0,0,0,0,null,280,"SPENCER",0,0,0,0,0,0,0]
[281,"SPRINGFIELD",21922.080000000002,2187.71,991.12,25100.91,null,281,"SPRINGFIELD",0,21922.080000000002,2187.71,991.12,25100.91,0,25100.91]
[282,"STERLING",0,0,0,0,null,282,"STERLING",0,0,0,0,0,0,0]
[283,"STOCKBRIDGE",0,0,0,0,null,283,"STOCKBRIDGE",0,0,0,0,0,0,0]
[284,"STONEHAM",2151.21,116.43,0,2267.64,null,284,"STONEHAM",0,2151.21,116.43,0,2267.64,0,2267.64]
[285,"STOUGHTON",3476.89,183.23,0,3660.12,null,285,"STOUGHTON",0,3476.89,183.23,0,3660.12,0,3660.12]
[286,"STOW",0,0,0,0,null,286,"STOW",0,0,0,0,0,0,0]
[287,"STURBRIDGE",943.55,38.840000000000003,0,982.39,null,287,"STURBRIDGE",0,943.55,38.840000000000003,0,982.39,0,982.39]
[288,"SUDBURY",2735.45,118.43,0,2853.8799999999997,null,288,"SUDBURY",0,2735.45,118.43,0,2853.8799999999997,0,2853.88]
[289,"SUNDERLAND",191.7,12.64,0,204.33999999999997,null,289,"SUNDERLAND",0,191.7,12.64,0,204.33999999999997,0,204.34]
[290,"SUTTON",1422.95,79.33,0,1502.28,null,290,"SUTTON",0,1422.95,79.33,0,1502.28,0,1502.28]
[291,"SWAMPSCOTT",2136.14,98.72,0,2234.8599999999997,null,291,"SWAMPSCOTT",0,2136.14,98.72,0,2234.8599999999997,0,2234.86]
[292,"SWANSEA",1985.96,99.56,0,2085.52,null,292,"SWANSEA",0,1985.96,99.56,0,2085.52,0,2085.52]
[293,"TAUNTON",6645.48,569.62,726.13,7941.23,null,293,"TAUNTON",0,6645.48,569.62,726.13,7941.23,9.999999999308784E-3,7941.22]
[294,"TEMPLETON",0,0,0,0,null,294,"TEMPLETON",0,0,0,0,0,0,0]
[295,"TEWKSBURY",3383.65,241.35,0,3625,null,295,"TEWKSBURY",0,3383.65,241.35,0,3625,0,3625]
[296,"TISBURY",352.39,19.86,0,372.25,null,296,"TISBURY",0,352.39,19.86,0,372.25,9.9999999999909051E-3,372.24]
[297,"TOLLAND",0,0,0,0,null,297,"TOLLAND",0,0,0,0,0,0,0]
[298,"TOPSFIELD",570.91999999999996,36,0,606.91999999999996,null,298,"TOPSFIELD",0,570.91999999999996,36,0,606.91999999999996,-9.9999999999909051E-3,606.92999999999995]
[299,"TOWNSEND",0,0,0,0,null,299,"TOWNSEND",0,0,0,0,0,0,0]
[300,"TRURO",118.61,6.26,0,124.87,null,300,"TRURO",0,118.61,6.26,0,124.87,0,124.87]
[301,"TYNGSBOROUGH",1648.46,76.56,0,1725.02,null,301,"TYNGSBOROUGH",0,1648.46,76.56,0,1725.02,0,1725.02]
[302,"TYRINGHAM",0,0,0,0,null,302,"TYRINGHAM",0,0,0,0,0,0,0]
[303,"UPTON",0,0,0,0,null,303,"UPTON",0,0,0,0,0,0,0]
[304,"UXBRIDGE",1730.34,88.55,0,1818.8899999999999,null,304,"UXBRIDGE",0,1730.34,88.55,0,1818.8899999999999,9.9999999997635314E-3,1818.88]
[305,"WAKEFIELD",3245.43,171.42,0,3416.85,null,305,"WAKEFIELD",0,3245.43,171.42,0,3416.85,0,3416.85]
[306,"WALES",157.72,7,0,164.72,null,306,"WALES",0,157.72,7,0,164.72,0,164.72]
[307,"WALPOLE",3748.4,162.75,0,3911.15,null,307,"WALPOLE",0,3748.4,162.75,0,3911.15,0,3911.15]
[308,"WALTHAM",4469.42,453.48,342.8,5265.7,null,308,"WALTHAM",0,4469.42,453.48,342.8,5265.7,0,5265.7]
[309,"WARE",1143.54,69.569999999999993,0,1213.1099999999999,null,309,"WARE",0,1143.54,69.569999999999993,0,1213.1099999999999,0,1213.1099999999999]
[310,"WAREHAM",2148.96,241.32,234.99,2625.2700000000004,null,310,"WAREHAM",0,2148.96,241.32,234.99,2625.2700000000004,0,2625.27]
[311,"WARREN",0,0,0,0,null,311,"WARREN",0,0,0,0,0,0,0]
[312,"WARWICK",0,0,0,0,null,312,"WARWICK",0,0,0,0,0,0,0]
[313,"WASHINGTON",0,0,0,0,null,313,"WASHINGTON",0,0,0,0,0,0,0]
[314,"WATERTOWN",2386.11,169.12,0,2555.23,null,314,"WATERTOWN",0,2386.11,169.12,0,2555.23,0,2555.23]
[315,"WAYLAND",2532.14,130.56,0,2662.7,null,315,"WAYLAND",0,2532.14,130.56,0,2662.7,-1.0000000000218279E-2,2662.71]
[316,"WEBSTER",1719.74,112.02,26.09,1857.85,null,316,"WEBSTER",0,1719.74,112.02,26.09,1857.85,9.9999999999909051E-3,1857.84]
[317,"WELLESLEY",4799.08,222.91,0,5021.99,null,317,"WELLESLEY",0,4799.08,222.91,0,5021.99,0,5021.99]
[318,"WELLFLEET",104.57,5.28,0,109.85,null,318,"WELLFLEET",0,104.57,5.28,0,109.85,0,109.85]
[319,"WENDELL",0,0,0,0,null,319,"WENDELL",0,0,0,0,0,0,0]
[320,"WENHAM",0,0,0,0,null,320,"WENHAM",0,0,0,0,0,0,0]
[321,"WESTBOROUGH",3422.05,182.58,0,3604.63,null,321,"WESTBOROUGH",0,3422.05,182.58,0,3604.63,0,3604.63]
[322,"WEST BOYLSTON",{"$f":"K331","v":869.84},{"$f":"L331","v":46.73},{"$f":"M331","v":0},{"$f":"N331","v":916.57},null,322,"WEST BOYLSTON",0,869.84,46.73,0,916.57,0,916.57]
[323,"WEST BRIDGEWATER",1259.79,34,0,1293.79,null,323,"WEST BRIDGEWATER",0,1259.79,34,0,1293.79,0,1293.79]
[324,"WEST BROOKFIELD",0,0,0,0,null,324,"WEST BROOKFIELD",0,0,0,0,0,0,0]
[325,"WESTFIELD",4789.1400000000003,345.65,437.95,5572.74,null,325,"WESTFIELD",0,4789.1400000000003,345.65,437.95,5572.74,0,5572.74]
[326,"WESTFORD",4908.43,191.81,0,5100.2400000000007,null,326,"WESTFORD",0,4908.43,191.81,0,5100.2400000000007,1.0000000001127773E-2,5100.2299999999996]
[327,"WESTHAMPTON",133.66,10.74,0,144.4,null,327,"WESTHAMPTON",0,133.66,10.74,0,144.4,1.0000000000019327E-2,144.38999999999999]
[328,"WESTMINSTER",0,0,0,0,null,328,"WESTMINSTER",0,0,0,0,0,0,0]
[329,"WEST NEWBURY",0,0,0,0,null,329,"WEST NEWBURY",0,0,0,0,0,0,0]
[330,"WESTON",2139.08,101.26,0,2240.34,null,330,"WESTON",0,2139.08,101.26,0,2240.34,0,2240.34]
[331,"WESTPORT",1495.03,85.57,0,1580.6,null,331,"WESTPORT",0,1495.03,85.57,0,1580.6,0,1580.6]
[332,"WEST SPRINGFIELD",3609.31,335.62,70.97,4015.8999999999996,null,332,"WEST SPRINGFIELD",0,3609.31,335.62,70.97,4015.8999999999996,-1.0000000000218279E-2,4015.91]
[333,"WEST STOCKBRIDGE",0,0,0,0,null,333,"WEST STOCKBRIDGE",0,0,0,0,0,0,0]
[334,"WEST TISBURY",0,0,0,0,null,334,"WEST TISBURY",0,0,0,0,0,0,0]
[335,"WESTWOOD",3034.83,171.56,0,3206.39,null,335,"WESTWOOD",0,3034.83,171.56,0,3206.39,0,3206.39]
[336,"WEYMOUTH",5788.47,325.20999999999998,463.53,6577.21,null,336,"WEYMOUTH",0,5788.47,325.20999999999998,463.53,6577.21,0,6577.21]
[337,"WHATELY",126.46,4.8,0,131.26,null,337,"WHATELY",0,126.46,4.8,0,131.26,0,131.26]
[338,"WHITMAN",0,0,0,0,null,338,"WHITMAN",0,0,0,0,0,0,0]
[339,"WILBRAHAM",0,0,0,0,null,339,"WILBRAHAM",0,0,0,0,0,0,0]
[340,"WILLIAMSBURG",147.72,7.06,0,154.78,null,340,"WILLIAMSBURG",0,147.72,7.06,0,154.78,0,154.78]
[341,"WILLIAMSTOWN",431.88,14.89,0,446.77,null,341,"WILLIAMSTOWN",0,431.88,14.89,0,446.77,0,446.77]
[342,"WILMINGTON",3228.65,201.12,0,3429.77,null,342,"WILMINGTON",0,3228.65,201.12,0,3429.77,0,3429.77]
[343,"WINCHENDON",1246.42,94.01,0,1340.43,null,343,"WINCHENDON",0,1246.42,94.01,0,1340.43,-9.9999999999909051E-3,1340.44]
[344,"WINCHESTER",4293.24,194.96,0,4488.2,null,344,"WINCHESTER",0,4293.24,194.96,0,4488.2,1.0000000000218279E-2,4488.1899999999996]
[345,"WINDSOR",0,0,0,0,null,345,"WINDSOR",0,0,0,0,0,0,0]
[346,"WINTHROP",1797.02,123.36,0,1920.3799999999999,null,346,"WINTHROP",0,1797.02,123.36,0,1920.3799999999999,0,1920.38]
[347,"WOBURN",4494.84,261.87,0,4756.71,null,347,"WOBURN",0,4494.84,261.87,0,4756.71,0,4756.71]
[348,"WORCESTER",21450.38,1833.92,1741.35,25025.65,null,348,"WORCESTER",0,21450.38,1833.92,1741.35,25025.65,1.0000000002037268E-2,25025.64]
[349,"WORTHINGTON",0,0,0,0,null,349,"WORTHINGTON",0,0,0,0,0,0,0]
[350,"WRENTHAM",988.03,51.91,0,1039.94,null,350,"WRENTHAM",0,988.03,51.91,0,1039.94,0,1039.94]
[351,"YARMOUTH",0,0,0,0,null,351,"YARMOUTH",0,0,0,0,0,0,0]
[352,"DEVENS",0,0,0,0,null,352,"DEVENS",0,0,0,0,0,0,0]
[353,"SOUTHFIELD",0,0,0,0,null,353,"SOUTHFIELD",0,0,0,0,0,0,0]
[406,"NORTHAMPTON SMITH",0.03,37.82,387.55,425.40000000000003,null,406,"NORTHAMPTON SMITH",0,0.03,37.82,387.55,425.40000000000003,1.0000000000047748E-2,425.39]
[600,"ACTON BOXBOROUGH",5407.2,236.37,0,5643.57,null,600,"ACTON BOXBOROUGH",0,5407.2,236.37,0,5643.57,0,5643.57]
[603,"ADAMS CHESHIRE",1284.04,108.73,0,1392.77,null,603,"ADAMS CHESHIRE",0,1284.04,108.73,0,1392.77,0,1392.77]
[605,"AMHERST PELHAM",1336.05,113.84,0,1449.8899999999999,null,605,"AMHERST PELHAM",0,1336.05,113.84,0,1449.8899999999999,0,1449.89]
[610,"ASHBURNHAM WESTMINSTER",2189.0500000000002,133.59,0,2322.6400000000003,null,610,"ASHBURNHAM WESTMINSTER",0,2189.0500000000002,133.59,0,2322.6400000000003,0,2322.64]
[615,"ATHOL ROYALSTON",1244.5,138.26,0,1382.76,null,615,"ATHOL ROYALSTON",0,1244.5,138.26,0,1382.76,0,1382.76]
[616,"AYER SHIRLEY",1522.19,122.44,0,1644.63,null,616,"AYER SHIRLEY",0,1522.19,122.44,0,1644.63,1.0000000000218279E-2,1644.62]
[618,"BERKSHIRE HILLS",1218.98,68.569999999999993,61.6,1349.1499999999999,null,618,"BERKSHIRE HILLS",0,1218.98,68.569999999999993,61.6,1349.1499999999999,-1.0000000000218279E-2,1349.16]
[620,"BERLIN BOYLSTON",520.72,29.36,0,550.08000000000004,null,620,"BERLIN BOYLSTON",0,520.72,29.36,0,550.08000000000004,0,550.08000000000004]
[622,"BLACKSTONE MILLVILLE",1664.58,98.36,0,1762.9399999999998,null,622,"BLACKSTONE MILLVILLE",0,1664.58,98.36,0,1762.9399999999998,0,1762.94]
[625,"BRIDGEWATER RAYNHAM",5022.6099999999997,257.86,0,5280.4699999999993,null,625,"BRIDGEWATER RAYNHAM",0,5022.6099999999997,257.86,0,5280.4699999999993,-1.0000000000218279E-2,5280.48]
[632,"CHESTERFIELD GOSHEN",146.15,6.08,0,152.23000000000002,null,632,"CHESTERFIELD GOSHEN",0,146.15,6.08,0,152.23000000000002,0,152.22999999999999]
[635,"CENTRAL BERKSHIRE",1636.11,76.08,0,1712.1899999999998,null,635,"CENTRAL BERKSHIRE",0,1636.11,76.08,0,1712.1899999999998,0,1712.19]
[640,"CONCORD CARLISLE",1198.95,58.72,0,1257.67,null,640,"CONCORD CARLISLE",0,1198.95,58.72,0,1257.67,0,1257.67]
[645,"DENNIS YARMOUTH",2814.05,150.35,0,2964.4,null,645,"DENNIS YARMOUTH",0,2814.05,150.35,0,2964.4,0,2964.4]
[650,"DIGHTON REHOBOTH",2571.5100000000002,102.49,225.66,2899.66,null,650,"DIGHTON REHOBOTH",0,2571.5100000000002,102.49,225.66,2899.66,9.9999999997635314E-3,2899.65]
[655,"DOVER SHERBORN",1126.31,43.27,0,1169.58,null,655,"DOVER SHERBORN",0,1126.31,43.27,0,1169.58,0,1169.58]
[658,"DUDLEY CHARLTON",3827.83,172.2,0,4000.0299999999997,null,658,"DUDLEY CHARLTON",0,3827.83,172.2,0,4000.0299999999997,0,4000.03]
[660,"NAUSET",1443.04,72.52,0,1515.56,null,660,"NAUSET",0,1443.04,72.52,0,1515.56,0,1515.56]
[662,"FARMINGTON RIVER",118.3,6.32,0,124.62,null,662,"FARMINGTON RIVER",0,118.3,6.32,0,124.62,0,124.62]
[665,"FREETOWN LAKEVILLE",2727.28,113.34,0,2840.6200000000003,null,665,"FREETOWN LAKEVILLE",0,2727.28,113.34,0,2840.6200000000003,0,2840.62]
[670,"FRONTIER",555.84,49.21,0,605.05000000000007,null,670,"FRONTIER",0,555.84,49.21,0,605.05000000000007,0,605.04999999999995]
[672,"GATEWAY",836.83,51.29,53.95,942.07,null,672,"GATEWAY",0,836.83,51.29,53.95,942.07,-9.9999999999909051E-3,942.08]
[673,"GROTON DUNSTABLE",2431.02,116.17,0,2547.19,null,673,"GROTON DUNSTABLE",0,2431.02,116.17,0,2547.19,0,2547.19]
[674,"GILL MONTAGUE",890.08,79.78,0,969.86,null,674,"GILL MONTAGUE",0,890.08,79.78,0,969.86,0,969.86]
[675,"HAMILTON WENHAM",1776.3,68.72,0,1845.02,null,675,"HAMILTON WENHAM",0,1776.3,68.72,0,1845.02,0,1845.02]
[680,"HAMPDEN WILBRAHAM",3044.2,133.94,18,3196.14,null,680,"HAMPDEN WILBRAHAM",0,3044.2,133.94,18,3196.14,0,3196.14]
[683,"HAMPSHIRE",691.1,55.87,0,746.97,null,683,"HAMPSHIRE",0,691.1,55.87,0,746.97,0,746.97]
[685,"HAWLEMONT",102.39,5.84,0,108.23,null,685,"HAWLEMONT",0,102.39,5.84,0,108.23,0,108.23]
[690,"KING PHILIP",1978.14,97.3,0,2075.44,null,690,"KING PHILIP",0,1978.14,97.3,0,2075.44,0,2075.44]
[695,"LINCOLN SUDBURY",1510.17,65.08,0,1575.25,null,695,"LINCOLN SUDBURY",0,1510.17,65.08,0,1575.25,0,1575.25]
[698,"MANCHESTER ESSEX",1433.32,55.45,0,1488.77,null,698,"MANCHESTER ESSEX",0,1433.32,55.45,0,1488.77,9.9999999999909051E-3,1488.76]
[700,"MARTHAS VINEYARD",{"$f":"K395","v":472.71},{"$f":"L395","v":40.83},{"$f":"M395","v":161.74},{"$f":"N395","v":675.28},null,700,"MARTHAS VINEYARD",0,472.71,40.83,161.74,675.28,0,675.28]
[705,"MASCONOMET",1867.24,79.400000000000006,0,1946.64,null,705,"MASCONOMET",0,1867.24,79.400000000000006,0,1946.64,0,1946.64]
[710,"MENDON UPTON",2211.17,115.44,0,2326.61,null,710,"MENDON UPTON",0,2211.17,115.44,0,2326.61,0,2326.61]
[712,"MONOMOY",1823.69,94.66,0,1918.3500000000001,null,712,"MONOMOY",0,1823.69,94.66,0,1918.3500000000001,0,1918.35]
[715,"MOUNT GREYLOCK",514.1,26.52,0,540.62,null,715,"MOUNT GREYLOCK",0,514.1,26.52,0,540.62,0,540.62]
[717,"MOHAWK TRAIL",888.06,69.98,0,958.04,null,717,"MOHAWK TRAIL",0,888.06,69.98,0,958.04,0,958.04]
[720,"NARRAGANSETT",1260.07,64.900000000000006,18.95,1343.92,null,720,"NARRAGANSETT",0,1260.07,64.900000000000006,18.95,1343.92,0,1343.92]
[725,"NASHOBA",3304.31,144.96,0,3449.27,null,725,"NASHOBA",0,3304.31,144.96,0,3449.27,0,3449.27]
[728,"NEW SALEM WENDELL",143,8.81,0,151.81,null,728,"NEW SALEM WENDELL",0,143,8.81,0,151.81,-9.9999999999909051E-3,151.82]
[730,"NORTHBORO SOUTHBORO",1375.63,46.05,0,1421.68,null,730,"NORTHBORO SOUTHBORO",0,1375.63,46.05,0,1421.68,-9.9999999999909051E-3,1421.69]
[735,"NORTH MIDDLESEX",3066.36,203.44,0,3269.8,null,735,"NORTH MIDDLESEX",0,3066.36,203.44,0,3269.8,0,3269.8]
[740,"OLD ROCHESTER",1208.69,44.86,0,1253.55,null,740,"OLD ROCHESTER",0,1208.69,44.86,0,1253.55,0,1253.55]
[745,"PENTUCKET",2538.85,141.84,0,2680.69,null,745,"PENTUCKET",0,2538.85,141.84,0,2680.69,0,2680.69]
[750,"PIONEER",831.81,41.54,0,873.34999999999991,null,750,"PIONEER",0,831.81,41.54,0,873.34999999999991,0,873.35]
[753,"QUABBIN",2307.06,138.12,0,2445.1799999999998,null,753,"QUABBIN",0,2307.06,138.12,0,2445.1799999999998,0,2445.1799999999998]
[755,"RALPH C MAHAR",768.92,42.25,0,811.17,null,755,"RALPH C MAHAR",0,768.92,42.25,0,811.17,0,811.17]
[760,"SILVER LAKE",1510.92,103.68,262.43,1877.0300000000002,null,760,"SILVER LAKE",0,1510.92,103.68,262.43,1877.0300000000002,0,1877.03]
[763,"SOMERSET BERKLEY",846.98,35.049999999999997,44.29,926.31999999999994,null,763,"SOMERSET BERKLEY",0,846.98,35.049999999999997,44.29,926.31999999999994,0,926.32]
[765,"SOUTHERN BERKSHIRE",733.25,32.65,0,765.9,null,765,"SOUTHERN BERKSHIRE",0,733.25,32.65,0,765.9,0,765.9]
[766,"SOUTHWICK TOLLAND",1505.02,91.07,40.85,1636.9399999999998,null,766,"SOUTHWICK TOLLAND",0,1505.02,91.07,40.85,1636.9399999999998,0,1636.94]
[767,"SPENCER EAST BROOKFIELD",1398.09,97.92,177.16,1673.17,null,767,"SPENCER EAST BROOKFIELD",0,1398.09,97.92,177.16,1673.17,0,1673.17]
[770,"TANTASQUA",1258.56,63.87,441.24,1763.6699999999998,null,770,"TANTASQUA",0,1258.56,63.87,441.24,1763.6699999999998,9.9999999997635314E-3,1763.66]
[773,"TRITON",2585.5500000000002,120.23,0,2705.78,null,773,"TRITON",0,2585.5500000000002,120.23,0,2705.78,0,2705.78]
[774,"UPISLAND",330.05,22.15,0,352.2,null,774,"UPISLAND",0,330.05,22.15,0,352.2,-9.9999999999909051E-3,352.21]
[775,"WACHUSETT",6987.41,341.77,0,7329.18,null,775,"WACHUSETT",0,6987.41,341.77,0,7329.18,0,7329.18]
[778,"QUABOAG",1313.42,68.78,0,1382.2,null,778,"QUABOAG",0,1313.42,68.78,0,1382.2,0,1382.2]
[780,"WHITMAN HANSON",3824.04,192.07,0,4016.11,null,780,"WHITMAN HANSON",0,3824.04,192.07,0,4016.11,0,4016.11]
[801,"ASSABET VALLEY",0,83.58,962.07,1045.6500000000001,null,801,"ASSABET VALLEY",0,0,83.58,962.07,1045.6500000000001,-9.9999999999909051E-3,1045.6600000000001]
[805,"BLACKSTONE VALLEY",0,33.619999999999997,1132.46,1166.08,null,805,"BLACKSTONE VALLEY",0,0,33.619999999999997,1132.46,1166.08,0,1166.08]
[806,"BLUE HILLS",0,49.62,784.42,834.04,null,806,"BLUE HILLS",0,0,49.62,784.42,834.04,0,834.04]
[810,"BRISTOL PLYMOUTH",0,53.28,1229.24,1282.52,null,810,"BRISTOL PLYMOUTH",0,0,53.28,1229.24,1282.52,0,1282.52]
[815,"CAPE COD",0,52.45,580.69000000000005,633.1400000000001,null,815,"CAPE COD",0,0,52.45,580.69000000000005,633.1400000000001,0,633.14]
[817,"ESSEX NORTH SHORE",0,61.42,1035.54,1096.96,null,817,"ESSEX NORTH SHORE",0,0,61.42,1035.54,1096.96,0,1096.96]
[818,"FRANKLIN COUNTY",0,41.28,448.97,490.25,null,818,"FRANKLIN COUNTY",0,0,41.28,448.97,490.25,0,490.25]
[821,"GREATER FALL RIVER",4.16,58.17,1316.34,1378.6699999999998,null,821,"GREATER FALL RIVER",0,4.16,58.17,1316.34,1378.6699999999998,-1.0000000000218279E-2,1378.68]
[823,"GREATER LAWRENCE",19.04,74.94,1220.8699999999999,1314.85,null,823,"GREATER LAWRENCE",0,19.04,74.94,1220.8699999999999,1314.85,0,1314.85]
[825,"GREATER NEW BEDFORD",0,58.22,2034.05,2092.27,null,825,"GREATER NEW BEDFORD",0,0,58.22,2034.05,2092.27,0,2092.27]
[828,"GREATER LOWELL",11.7,138.86000000000001,1923.35,2073.91,null,828,"GREATER LOWELL",0,11.7,138.86000000000001,1923.35,2073.91,-1.0000000000218279E-2,2073.92]
[829,"SOUTH MIDDLESEX",4.0199999999999996,82.37,582.97,669.36,null,829,"SOUTH MIDDLESEX",0,4.0199999999999996,82.37,582.97,669.36,0,669.36]
[830,"MINUTEMAN",0,78.709999999999994,582.92999999999995,661.64,null,830,"MINUTEMAN",0,0,78.709999999999994,582.92999999999995,661.64,0,661.64]
[832,"MONTACHUSETT",0,53.66,1340.37,1394.03,null,832,"MONTACHUSETT",0,0,53.66,1340.37,1394.03,0,1394.03]
[851,"NORTHERN BERKSHIRE",0,22.09,441.53,463.61999999999995,null,851,"NORTHERN BERKSHIRE",0,0,22.09,441.53,463.61999999999995,0,463.62]
[852,"NASHOBA VALLEY",0,58.94,658.86,717.8,null,852,"NASHOBA VALLEY",0,0,58.94,658.86,717.8,-9.9999999999909051E-3,717.81]
[853,"NORTHEAST METROPOLITAN",0,81.25,1157.19,1238.44,null,853,"NORTHEAST METROPOLITAN",0,0,81.25,1157.19,1238.44,0,1238.44]
[855,"OLD COLONY",0,29.4,527.09,556.49,null,855,"OLD COLONY",0,0,29.4,527.09,556.49,0,556.49]
[860,"PATHFINDER",0,43.98,559.47,603.45000000000005,null,860,"PATHFINDER",0,0,43.98,559.47,603.45000000000005,9.9999999999909051E-3,603.44000000000005]
[871,"SHAWSHEEN VALLEY",0,85.99,1281.72,1367.71,null,871,"SHAWSHEEN VALLEY",0,0,85.99,1281.72,1367.71,0,1367.71]
[872,"SOUTHEASTERN",0,79.61,1206.75,1286.3599999999999,null,872,"SOUTHEASTERN",0,0,79.61,1206.75,1286.3599999999999,0,1286.3599999999999]
[873,"SOUTH SHORE",1.03,49.62,538.6,589.25,null,873,"SOUTH SHORE",0,1.03,49.62,538.6,589.25,9.9999999999909051E-3,589.24]
[876,"SOUTHERN WORCESTER",0.24,56.15,1026.07,1082.46,null,876,"SOUTHERN WORCESTER",0,0.24,56.15,1026.07,1082.46,-9.9999999999909051E-3,1082.47]
[878,"TRI COUNTY",0,61.06,944.74,1005.8,null,878,"TRI COUNTY",0,0,61.06,944.74,1005.8,0,1005.8]
[879,"UPPER CAPE COD",1.07,28.65,640.74,670.46,null,879,"UPPER CAPE COD",0,1.07,28.65,640.74,670.46,0,670.46]
[885,"WHITTIER",0.13,82.09,1189.8399999999999,1272.06,null,885,"WHITTIER",0,0.13,82.09,1189.8399999999999,1272.06,0,1272.06]
[910,"BRISTOL COUNTY",0,10.94,436.86,447.8,null,910,"BRISTOL COUNTY",0,0,10.94,436.86,447.8,-9.9999999999909051E-3,447.81]
[915,"NORFOLK COUNTY",0,16.75,469.18,485.93,null,915,"NORFOLK COUNTY",0,0,16.75,469.18,485.93,0,485.93]
[999,"STATE TOTAL",{"$f":"K450","v":813730.82000000041},{"$f":"L450","v":53678.300000000039},{"$f":"M450","v":42566.049999999988},{"$f":"N450","v":909975.16999999993},null,999,"STATE TOTAL",null,813730.82000000041,53678.300000000039,42566.049999999988,909975.16999999993,-346.98000000000906,910322.14999999979]

{"sheet":"tuitioncalc","index":4,"n_rows":21,"n_cols":18,"rows_kept":21,"cut":false,"hidden":true,"merged":[[1,0,1,16],[2,0,2,16],[3,0,3,15]]}
[]
["Massachusetts Department of Elementary and Secondary Education"]
["Office of School Finance"]
["FY16 School Choice Rate"]
[]
[null," ------- Instructional Expenditures -------- ",null,null,null," ---------- Expenditures For Pupil Services ------------------",null,null,null," - Expenditures For Administration, Maintenance & Fixed Charges -",null,null,null,null,"Full-Time "]
[null,"From ","From  ",null,null,"From ","From  ",null,null,"From ","From  ",null,null,"Total Expend-","Equivalent ","Average"]
[null,"General","School Choice",null,null,"General","School Choice",null,null,"General","School Choice",null,null,"itures for","Average","Cost","Allowed"]
[null,"Fund","& Tuition Funds","Total",null,"Fund","& Tuition Funds","Total",null,"Fund","& Tuition Funds","Total",null,"Choice Rate","Membership","Per Pupil","Cost"]
[{"$f":"lastlea&\" \"&VLOOKUP(lastlea,code436,2)","v":"885 WHITTIER                     "}]
[]
[]
["Regular Day Total",{"$f":"ROUND(eoy!E822,0)","v":0},{"$f":"ROUND($O13/$O$21*C$21,0)","v":16},{"$f":"B13+C13","v":16},null,{"$f":"ROUND($O13/$O$21*F$21,0)","v":193},{"$f":"ROUND($O13/$O$21*G$21,0)","v":12},{"$f":"F13+G13","v":205},null,{"$f":"ROUND(J$21*(D13/D$21),0)","v":10},{"$f":"ROUND(K$21*(D13/D$21),0)","v":0},{"$f":"J13+K13","v":10},null,{"$f":"D13+H13+L13","v":231},{"$f":"VLOOKUP(leaextract,membership,3)","v":0.13},{"$f":"IF(O13>0,ROUND(N13/O13,0),\" \")","v":1777},{"$f":"IF(O13>0,MINA(5000,ROUND(P13*0.75,0)),0)","v":1333},"ratereg"]
[]
["Special Needs in District",{"$f":"eoy!F822","v":1122595},{"$f":"ROUND($O15/$O$21*C$21,0)","v":10281},{"$f":"B15+C15","v":1132876},null,{"$f":"ROUND($O15/$O$21*F$21,0)","v":122065},{"$f":"ROUND($O15/$O$21*G$21,0)","v":7661},{"$f":"F15+G15","v":129726},null,{"$f":"ROUND(J$21*(D15/D$21),0)","v":702019},{"$f":"ROUND(K$21*(D15/D$21),0)","v":16565},{"$f":"J15+K15","v":718584},null,{"$f":"D15+H15+L15","v":1981186},{"$f":"VLOOKUP(leaextract,membership,4)","v":82.09},{"$f":"IF(O15>0,ROUND(N15/O15,0),\" \")","v":24134}]
[]
["left blank",null,null,null,null,null,null,null,null,null,null,null,null,null,null,{"$f":"IF(O17>0,ROUND(N17/O17,0),\" \")","v":" "},{"$f":"IF(O17>0,MINA(5000,ROUND(P17*0.75,0)),\" \")","v":" "}]
[]
["Occupational Day Senior High",{"$f":"eoy!G822","v":9733662},{"$f":"ROUND($O19/$O$21*C$21,0)","v":149023},{"$f":"B19+C19","v":9882685},null,{"$f":"ROUND($O19/$O$21*F$21,0)","v":1769244},{"$f":"ROUND($O19/$O$21*G$21,0)","v":111039},{"$f":"F19+G19","v":1880283},null,{"$f":"ROUND(J$21*(D19/D$21),0)","v":6124093},{"$f":"ROUND(K$21*(D19/D$21),0)","v":144501},{"$f":"J19+K19","v":6268594},null,{"$f":"D19+H19+L19","v":18031562},{"$f":"VLOOKUP(leaextract,membership,5)","v":1189.8399999999999},{"$f":"IF(O19>0,ROUND(N19/O19,0),\" \")","v":15155},{"$f":"IF(O19>0,MINA(5000,ROUND(P19*0.75,0)),\" \")","v":5000},"rateocced"]
[]
["Total (Including Special Ed)",{"$f":"SUM(B9:B19)","v":10856257},{"$f":"eoy!L583","v":159321},{"$f":"SUM(D13:D19)","v":11015577},null,{"$f":"eoy!I822+eoy!I283+eoy!I291+eoy!I307+eoy!I315+eoy!I323+eoy!I331+eoy!I489+eoy!I491","v":1891502},{"$f":"eoy!L585+eoy!L586+eoy!L588+eoy!L589+eoy!L590+eoy!L591","v":118712},{"$f":"SUM(H13:H19)","v":2010214},null,{"$f":"eoy!I66+eoy!I74+eoy!I82+eoy!I90+eoy!I98+eoy!I106+eoy!I114+eoy!I127+eoy!I339+eoy!I344+eoy!I349+eoy!I357+eoy!I365+eoy!I370+eoy!I378+eoy!I383+eoy!I391+eoy!I399+eoy!I401+eoy!I407+eoy!I412+eoy!I414+eoy!I415+eoy!I416+eoy!I418+eoy!I419+eoy!I481+eoy!I482+eoy!I483+eoy!I484+eoy!I485+eoy!I486+SUM(eoy!I492:'eoy'!I502)+SUM(eoy!I508:'eoy'!I514)+eoy!I516+eoy!I517","v":6826122},{"$f":"SUM(eoy!L546:'eoy'!L554)+SUM(eoy!L592:'eoy'!L609)+eoy!L611+eoy!L612","v":161066},{"$f":"SUM(L13:L19)","v":6987188},null,{"$f":"SUM(N13:N19)","v":20012979},{"$f":"SUM(O13:O19)","v":1272.06}]

{"sheet":"eoy","index":5,"n_rows":1305,"n_cols":27,"rows_kept":1305,"cut":false,"hidden":true,"merged":[[3,0,3,10],[4,0,4,10]]}
[null,null,"Copyright 2015 by Massachusetts Department of Elementary and Secondary Education.  Permission is hereby granted to Massachusetts public school officials to "]
[null,null,"to reproduce this document as needed to complete the 2014-2015 End of Year Financial Report.  All other rights reserved."]
[]
["Massachusetts Department of Elementary and Secondary Education"]
["FY15 END OF YEAR FINANCIAL REPORT"]
[null,null,null,null,"2015-10-27"]
[null,null,"885","WHITTIER","For all related information go to:",null,null,"http://www.doe.mass.edu/finance/accounting/eoy/?fy=15"]
[]
[null,null,"SCHEDULE 1",null,"1","2",3,4,5,6]
[null,null,"REVENUE AND EXPENDITURE SUMMARY"]
[null,null,null,null,null,null,"CH 74 VOC-"]
[null,null,null,null,"REGULAR","SPECIAL","ATIONAL/","OTHER","UNDISTRIB-"]
[null,null,"I. REVENUES",null,"DAY","EDUCATION","TECHNICAL","PROGRAMS","UTED","TOTAL"]
["Row",null,"Line","A. REVENUE FROM LOCAL SOURCES"]
[15,null,10,"Assessments Received by Regional Schools",null,null,null,null,12637157,12637157,null,null,null,null,null,null,null,null,null,null,null,null,null,null,null,null,{"$f":"ROW() - A15","v":0}]
[16,null,20,"E & D Fund Appropriations FY15: Revenues to Regional District",null,null,null,null,null,0,null,null,null,null,null,null,null,null,null,null,null,null,null,null,null,null,{"$f":"ROW() - A16","v":0}]
[17,null,30,"Tuition From Individuals",null,null,null,null,null,0,null,null,null,null,null,null,null,null,null,null,null,null,null,null,null,null,0]
[18,null,40,"Tuition From Other Districts in Comm.",null,null,null,null,null,0,null,null,null,null,null,null,null,null,null,null,null,null,null,null,null,null,0]
[19,null,50,"Tuition From Districts in Other States",null,null,45492,null,null,45492,null,null,null,null,null,null,null,null,null,null,null,null,null,null,null,null,0]
[20,null,60,"Previous Yr Unexpended Encumbrances (Carry Forward)",null,null,null,null,3571,3571,null,null,null,null,null,null,null,null,null,null,null,null,null,null,null,null,0]
[21,null,70,"Transportation Fees",null,null,null,null,null,0,null,null,null,null,null,null,null,null,null,null,null,null,null,null,null,null,0]
[22,null,80,"Earnings on Investments",null,null,null,null,15478,15478,null,null,null,null,null,null,null,null,null,null,null,null,null,null,null,null,0]
[23,null,90,"Rental of School Facilities",null,null,null,null,null,0,null,null,null,null,null,null,null,null,null,null,null,null,null,null,null,null,0]
[24,null,100,"Other Revenue",null,null,null,null,1978,1978,null,null,null,null,null,null,null,null,null,null,null,null,null,null,null,null,0]
[25,null,101,"Medical Care and Assistance",null,47369,null,null,null,47369,null,null,null,null,null,null,null,null,null,null,null,null,null,null,null,null,0]
[26,null,105,"Non Revenue Receipts",null,null,null,null,null,0,null,null,null,null,null,null,null,null,null,null,null,null,null,null,null,null,0]
[27,null,110,"TOTAL REVENUE FROM LOCAL SOURCES",0,47369,45492,0,12658184,12751045,null,null,null,null,null,null,null,null,null,null,null,null,null,null,null,null,0]
[null,null,null,"B. REVENUE FROM STATE AID","  ------------------------State aid is not reported by program ---------------------------",null,null,null,null,null,null,null,null,null,null,null,null,null,null,null,null,null,null,null,null,null,28]
[29,null,125,"School Aid (Chapter 70)",null,null,null,null,8010858.9927000003,8010859,null,null,null,null,null,null,null,null,null,null,null,null,null,null,null,null,0]
[30,null,130,"Mass. School Building Authority Construction Aid","Contract",null,null,"            Other",null,0,null,null,null,null,null,null,null,null,null,null,null,null,null,null,null,null,0]
[31,null,140,"Pupil Transportation (Ch. 71,71A,71B,74)",null,null,null,null,844601.68131662928,844602,null,null,null,null,null,null,null,null,null,null,null,null,null,null,null,null,0]
[32,null,170,"Charter Tuition Reimbursements and Facilities Aid","Charter Reimb",0,null,"Facilities",0,0,null,null,null,null,null,null,null,null,null,null,null,null,null,null,null,null,0]
[33,null,180,"Circuit Breaker",null,null,null,null,0,0,null,null,null,null,null,null,null,null,null,null,null,null,null,null,null,null,0]
[34,null,190,"Foundation Reserve, State Impact Aid, and Regional Bonus Aid",null,null,null,null,0,0,null,null,null,null,null,null,null,null,null,null,null,null,null,null,null,null,0]
[35,null,200,"TOTAL REVENUE FROM STATE AID",null,null,null,null,null,8855461,null,null,null,null,null,null,null,null,null,null,null,null,null,null,null,null,0]
[36,null,null,null,null,null,null,null,null,null,null,null,null,null,null,null,null,null,null,null,null,null,null,null,null,null,0]
[37,null,null,"C. REVENUE FROM FEDERAL GRANTS",null,null,null,null,null,null,null,null,null,null,null,null,null,null,null,null,null,null,null,null,null,null,0]
[38,null,300,"ESE Administered Grants",273644,378805,244515,null,52377,949341,null,null,null,null,null,null,null,null,null,null,null,null,null,null,null,null,0]
[39,null,481,"Other Federal Grants",null,null,null,null,null,0,null,null,null,null,null,null,null,null,null,null,null,null,null,null,null,null,0]
[40,null,490,"TOTAL REVENUE FEDERAL GRANTS",273644,378805,244515,0,52377,949341,null,null,null,null,null,null,null,null,null,null,null,null,null,null,null,null,0]
[null,null,null," D. REVENUE FROM STATE GRANTS",null,null,null,null,null,null,null,null,null,null,null,null,null,null,null,null,null,null,null,null,null,null,41]
[42,null,510,"ESE Administered Grants",0,0,0,null,31109,31109,null,null,null,null,null,null,null,null,null,null,null,null,null,null,null,null,0]
[43,null,590,"Other State Grants",null,null,75030,null,null,75030,null,null,null,null,null,null,null,null,null,null,null,null,null,null,null,null,0]
[44,null,600,"TOTAL REVENUE STATE GRANTS",0,0,75030,0,31109,106139,null,null,null,null,null,null,null,null,null,null,null,null,null,null,null,null,0]
[null,null,null,"E. REVENUE- REVOLVING & SPECIAL FUNDS",null,null,null,null,null,null,null,null,null,null,null,null,null,null,null,null,null,null,null,null,null,null,45]
[46,null,610,"School Lunch Receipts",null,null,null,null,584442,584442,null,null,null,null,null,null,null,null,null,null,null,null,null,null,null,null,0]
[47,null,620,"Athletic Receipts",null,null,null,null,13640,13640,null,null,null,null,null,null,null,null,null,null,null,null,null,null,null,null,0]
[48,null,630,"Tuition Receipts-School Choice",0,51086,698350,null,null,749436,null,null,null,null,null,null,null,null,null,null,null,null,null,null,null,null,0]
[49,null,640,"Tuition Receipts-Other",null,null,58855,275280,null,334135,null,null,null,null,null,null,null,null,null,null,null,null,null,null,null,null,0]
[50,null,650,"Other Local Receipts",null,null,null,null,162480,162480,null,null,null,null,null,null,null,null,null,null,null,null,null,null,null,null,0]
[51,null,660,"Private Grants",0,0,0,null,8996,8996,null,null,null,null,null,null,null,null,null,null,null,null,null,null,null,null,0]
[52,null,670,"TOTAL REVENUE REVOLVING & SPECIAL FUNDS",0,51086,757205,275280,769558,1853129,null,null,null,null,null,null,null,null,null,null,null,null,null,null,null,null,0]
[null,null,null,null,null,null,null,null,null,null,null,null,null,null,null,null,null,null,null,null,null,null,null,null,null,null,53]
[null,null,null,null,null,null,null,null,null,null,null,null,null,null,null,null,null,null,null,null,null,null,null,null,null,null,54]
[null,null,"SCHEDULE 1",null,"1","2",3,4,5,6,null,null,null,null,null,null,null,null,null,null,null,null,null,null,null,null,55]
[null,null,"REVENUE AND EXPENDITURE SUMMARY",null,null,null,null,null,null,null,null,null,null,null,null,null,null,null,null,null,null,null,null,null,null,null,56]
[null,null,null,null,null,null,"CH 74 VOC-",null,null,null,null,null,null,null,null,null,null,null,null,null,null,null,null,null,null,null,57]
[null,null,"II. EXPENDITURES",null,"REGULAR","SPECIAL","ATIONAL/","OTHER","UNDISTRIB-",null,null,null,null,null,null,null,null,null,null,null,null,null,null,null,null,null,58]
[null,null,"A.  BY SCHOOL COMMITTEE",null,"DAY","EDUCATION","TECHNICAL","PROGRAMS","UTED","TOTAL",null,null,null,null,null,null,null,null,null,null,null,null,null,null,null,null,59]
[null,null,null,"School Committee (1110)",null,null,null,null,null,null,null,null,null,null,null,null,null,null,null,null,null,null,null,null,null,null,60]
[61,null,702,"Clerical Salaries (02)",null,null,null,null,null,0,null,null,null,null,null,null,null,null,null,null,null,null,null,null,null,null,0]
[62,null,703,"Other Salaries (03)",null,null,null,null,null,0,null,null,null,null,null,null,null,null,null,null,null,null,null,null,null,null,0]
[63,null,704,"Contracted Services (04)",null,null,null,null,null,0,null,null,null,null,null,null,null,null,null,null,null,null,null,null,null,null,0]
[64,null,705,"Supplies and Materials (05)",null,null,null,null,12719,12719,null,null,null,null,null,null,null,null,null,null,null,null,null,null,null,null,0]
[65,null,706,"Other Expenses (06)",null,null,null,null,57884,57884,null,null,null,null,null,null,null,null,null,null,null,null,null,null,null,null,0]
[66,null,709,"Sub-total",null,null,null,null,70603,70603,null,null,null,null,null,null,null,null,null,null,null,null,null,null,null,null,0]
[null,null,null,"Superintendent (1210)",null,null,null,null,null,null,null,null,null,null,null,null,null,null,null,null,null,null,null,null,null,null,67]
[68,null,721,"Professional Salaries (01)",null,null,null,null,187000,187000,null,null,null,null,null,null,null,null,null,null,null,null,null,null,null,null,0]
[69,null,722,"Clerical Salaries (02)",null,null,null,null,77197,77197,null,null,null,null,null,null,null,null,null,null,null,null,null,null,null,null,0]
[70,null,723,"Other Salaries (03)",null,null,null,null,null,0,null,null,null,null,null,null,null,null,null,null,null,null,null,null,null,null,0]
[71,null,724,"Contracted Services (04)",null,null,null,null,null,0,null,null,null,null,null,null,null,null,null,null,null,null,null,null,null,null,0]
[72,null,725,"Supplies and Materials (05)",null,null,null,null,38049,38049,null,null,null,null,null,null,null,null,null,null,null,null,null,null,null,null,0]
[73,null,726,"Other Expenses (06)",null,null,null,null,40941,40941,null,null,null,null,null,null,null,null,null,null,null,null,null,null,null,null,0]
[74,null,729,"Sub-total",null,null,null,null,343187,343187,null,null,null,null,null,null,null,null,null,null,null,null,null,null,null,null,0]
[null,null,null,"Assistant Superintendents (1220)",null,null,null,null,null,null,null,null,null,null,null,null,null,null,null,null,null,null,null,null,null,null,75]
[76,null,741,"Professional Salaries (01)",null,null,null,null,null,0,null,null,null,null,null,null,null,null,null,null,null,null,null,null,null,null,0]
[77,null,742,"Clerical Salaries (02)",null,null,null,null,null,0,null,null,null,null,null,null,null,null,null,null,null,null,null,null,null,null,0]
[78,null,743,"Other Salaries (03)",null,null,null,null,null,0,null,null,null,null,null,null,null,null,null,null,null,null,null,null,null,null,0]
[79,null,744,"Contracted Services (04)",null,null,null,null,null,0,null,null,null,null,null,null,null,null,null,null,null,null,null,null,null,null,0]
[80,null,745,"Supplies and Materials (05)",null,null,null,null,null,0,null,null,null,null,null,null,null,null,null,null,null,null,null,null,null,null,{"$f":"ROW() - A80","v":0}]
[81,null,746,"Other Expenses (06)",null,null,null,null,null,0,null,null,null,null,null,null,null,null,null,null,null,null,null,null,null,null,0]
[82,null,749,"Sub-total",null,null,null,null,0,0,null,null,null,null,null,null,null,null,null,null,null,null,null,null,null,null,0]
[null,null,null,"Other District-Wide Administration (1230)",null,null,null,null,null,null,null,null,null,null,null,null,null,null,null,null,null,null,null,null,null,null,83]
[84,null,761,"Professional Salaries (01)",null,null,null,null,null,0,null,null,null,null,null,null,null,null,null,null,null,null,null,null,null,null,0]
[85,null,762,"Clerical Salaries (02)",null,null,null,null,null,0,null,null,null,null,null,null,null,null,null,null,null,null,null,null,null,null,0]
[86,null,763,"Other Salaries (03)",null,null,null,null,null,0,null,null,null,null,null,null,null,null,null,null,null,null,null,null,null,null,0]
[87,null,764,"Contracted Services (04)",null,null,null,null,null,0,null,null,null,null,null,null,null,null,null,null,null,null,null,null,null,null,0]
[88,null,765,"Supplies and Materials (05)",null,null,null,null,null,0,null,null,null,null,null,null,null,null,null,null,null,null,null,null,null,null,0]
[89,null,766,"Other Expenses (06)",null,null,null,null,null,0,null,null,null,null,null,null,null,null,null,null,null,null,null,null,null,null,0]
[90,null,769,"Sub-total",null,null,null,null,0,0,null,null,null,null,null,null,null,null,null,null,null,null,null,null,null,null,0]
[null,null,null,"Business and Finance (1410)",null,null,null,null,null,null,null,null,null,null,null,null,null,null,null,null,null,null,null,null,null,null,91]
[92,null,781,"Professional Salaries (01)",null,null,null,null,136555,136555,null,null,null,null,null,null,null,null,null,null,null,null,null,null,null,null,0]
[93,null,782,"Clerical Salaries (02)",null,null,null,null,208209,208209,null,null,null,null,null,null,null,null,null,null,null,null,null,null,null,null,0]
[94,null,783,"Other Salaries (03)",null,null,null,null,null,0,null,null,null,null,null,null,null,null,null,null,null,null,null,null,null,null,0]
[95,null,784,"Contracted Services (04)",null,null,null,null,null,0,null,null,null,null,null,null,null,null,null,null,null,null,null,null,null,null,0]
[96,null,785,"Supplies and Materials (05)",null,null,null,null,null,0,null,null,null,null,null,null,null,null,null,null,null,null,null,null,null,null,0]
[97,null,786,"Other Expenses (06)",null,null,null,null,null,0,null,null,null,null,null,null,null,null,null,null,null,null,null,null,null,null,0]
[98,null,789,"Sub-total",null,null,null,null,344764,344764,null,null,null,null,null,null,null,null,null,null,null,null,null,null,null,null,0]
[null,null,null,"Human Resources and Benefits (1420)",null,null,null,null,null,null,null,null,null,null,null,null,null,null,null,null,null,null,null,null,null,null,99]
[100,null,801,"Professional Salaries (01)",null,null,null,null,null,0,null,null,null,null,null,null,null,null,null,null,null,null,null,null,null,null,0]
[101,null,802,"Clerical Salaries (02)",null,null,null,null,59409,59409,null,null,null,null,null,null,null,null,null,null,null,null,null,null,null,null,0]
[102,null,803,"Other Salaries (03)",null,null,null,null,null,0,null,null,null,null,null,null,null,null,null,null,null,null,null,null,null,null,0]
[103,null,804,"Contracted Services (04)",null,null,null,null,null,0,null,null,null,null,null,null,null,null,null,null,null,null,null,null,null,null,0]
[104,null,805,"Supplies and Materials (05)",null,null,null,null,null,0,null,null,null,null,null,null,null,null,null,null,null,null,null,null,null,null,0]
[105,null,806,"Other Expenses (06)",null,null,null,null,null,0,null,null,null,null,null,null,null,null,null,null,null,null,null,null,null,null,0]
[106,null,809,"Sub-total",null,null,null,null,59409,59409,null,null,null,null,null,null,null,null,null,null,null,null,null,null,null,null,0]
[null,null,null,"Legal Service for School Committee (1430)",null,null,null,null,null,null,null,null,null,null,null,null,null,null,null,null,null,null,null,null,null,null,107]
[108,null,821,"Professional Salaries (01)",null,null,null,null,null,0,null,null,null,null,null,null,null,null,null,null,null,null,null,null,null,null,0]
[109,null,822,"Clerical Salaries (02)",null,null,null,null,null,0,null,null,null,null,null,null,null,null,null,null,null,null,null,null,null,null,0]
[110,null,823,"Other Salaries (03)",null,null,null,null,null,0,null,null,null,null,null,null,null,null,null,null,null,null,null,null,null,null,0]
[111,null,824,"Contracted Services (04)",null,null,null,null,43171,43171,null,null,null,null,null,null,null,null,null,null,null,null,null,null,null,null,0]
[112,null,825,"Supplies and Materials (05)",null,null,null,null,null,0,null,null,null,null,null,null,null,null,null,null,null,null,null,null,null,null,0]
[113,null,826,"Other Expenses (06)",null,null,null,null,null,0,null,null,null,null,null,null,null,null,null,null,null,null,null,null,null,null,0]
[114,null,829,"Sub-total",null,null,null,null,43171,43171,null,null,null,null,null,null,null,null,null,null,null,null,null,null,null,null,0]
[null,null,null,"Legal Settlements (1435)",null,null,null,null,null,null,null,null,null,null,null,null,null,null,null,null,null,null,null,null,null,null,115]
[116,null,844,"Contracted Services (04)",null,null,null,null,null,0,null,null,null,null,null,null,null,null,null,null,null,null,null,null,null,null,0]
[117,null,845,"Supplies and Materials (05)",null,null,null,null,null,0,null,null,null,null,null,null,null,null,null,null,null,null,null,null,null,null,0]
[118,null,846,"Other Expenses (06)",null,null,null,null,null,0,null,null,null,null,null,null,null,null,null,null,null,null,null,null,null,null,0]
[119,null,849,"Sub-total",0,0,0,0,null,0,null,null,null,null,null,null,null,null,null,null,null,null,null,null,null,null,0]
[null,null,null,"District-wide Information Mgmt & Tech (1450)",null,null,null,null,null,null,null,null,null,null,null,null,null,null,null,null,null,null,null,null,null,null,120]
[121,null,861,"Professional Salaries (01)",null,null,null,null,100000,100000,null,null,null,null,null,null,null,null,null,null,null,null,null,null,null,null,0]
[122,null,862,"Clerical Salaries (02)",null,null,null,null,null,0,null,null,null,null,null,null,null,null,null,null,null,null,null,null,null,null,0]
[123,null,863,"Other Salaries (03)",null,null,null,null,79087,79087,null,null,null,null,null,null,null,null,null,null,null,null,null,null,null,null,0]
[124,null,864,"Contracted Services (04)",null,null,null,null,null,0,null,null,null,null,null,null,null,null,null,null,null,null,null,null,null,null,0]
[125,null,865,"Supplies and Materials (05)",null,null,null,null,null,0,null,null,null,null,null,null,null,null,null,null,null,null,null,null,null,null,0]
[126,null,866,"Other Expenses (06)",null,null,null,null,null,0,null,null,null,null,null,null,null,null,null,null,null,null,null,null,null,null,0]
[127,null,869,"Sub-total",null,null,null,null,179087,179087,null,null,null,null,null,null,null,null,null,null,null,null,null,null,null,null,0]
[null,null,null,"Curriculum Directors  (Supervisory) (2110)",null,null,null,null,null,null,null,null,null,null,null,null,null,null,null,null,null,null,null,null,null,null,128]
[129,null,881,"Professional Salaries (01)",0,133533,251556,0,null,385089,null,null,null,null,null,null,null,null,null,null,null,null,null,null,null,null,0]
[130,null,882,"Clerical Salaries (02)",0,0,94419,0,null,94419,null,null,null,null,null,null,null,null,null,null,null,null,null,null,null,null,0]
[131,null,883,"Other Salaries (03)",0,0,0,0,null,0,null,null,null,null,null,null,null,null,null,null,null,null,null,null,null,null,0]
[132,null,884,"Contracted Services (04)",0,0,0,0,null,0,null,null,null,null,null,null,null,null,null,null,null,null,null,null,null,null,0]
[133,null,885,"Supplies and Materials (05)",0,0,0,0,null,0,null,null,null,null,null,null,null,null,null,null,null,null,null,null,null,null,0]
[134,null,886,"Other Expenses (06)",0,0,0,0,null,0,null,null,null,null,null,null,null,null,null,null,null,null,null,null,null,null,0]
[135,null,889,"Sub-total",0,133533,345975,0,null,479508,null,null,null,null,null,null,null,null,null,null,null,null,null,null,null,null,0]
[null,null,null,"Department Heads  (Non-Supervisory) (2120)",null,null,null,null,null,null,null,null,null,null,null,null,null,null,null,null,null,null,null,null,null,null,136]
[137,null,901,"Professional Salaries (01)",0,0,70663,0,null,70663,null,null,null,null,null,null,null,null,null,null,null,null,null,null,null,null,0]
[138,null,902,"Clerical Salaries (02)",0,0,0,0,null,0,null,null,null,null,null,null,null,null,null,null,null,null,null,null,null,null,0]
[139,null,903,"Other Salaries (03)",0,0,0,0,null,0,null,null,null,null,null,null,null,null,null,null,null,null,null,null,null,null,0]
[140,null,904,"Contracted Services (04)",0,0,0,0,null,0,null,null,null,null,null,null,null,null,null,null,null,null,null,null,null,null,0]
[141,null,905,"Supplies and Materials (05)",0,0,0,0,null,0,null,null,null,null,null,null,null,null,null,null,null,null,null,null,null,null,0]
[142,null,906,"Other Expenses (06)",0,0,0,0,null,0,null,null,null,null,null,null,null,null,null,null,null,null,null,null,null,null,0]
[143,null,909,"Sub-total",0,0,70663,0,null,70663,null,null,null,null,null,null,null,null,null,null,null,null,null,null,null,null,0]
[null,null,null,"School Leadership-Building (2210)",null,null,null,null,null,null,null,null,null,null,null,null,null,null,null,null,null,null,null,null,null,null,{"$f":"ROW() - A144","v":144}]
[145,null,921,"Professional Salaries (01)",null,null,null,null,558798,558798,null,null,null,null,null,null,null,null,null,null,null,null,null,null,null,null,0]
[146,null,922,"Clerical Salaries (02)",null,null,null,null,92801,92801,null,null,null,null,null,null,null,null,null,null,null,null,null,null,null,null,0]
[147,null,923,"Other Salaries (03)",null,null,null,null,0,0,null,null,null,null,null,null,null,null,null,null,null,null,null,null,null,null,0]
[148,null,924,"Contracted Services (04)",null,null,null,null,5500,5500,null,null,null,null,null,null,null,null,null,null,null,null,null,null,null,null,0]
[149,null,925,"Supplies and Materials (05)",null,null,null,null,14186,14186,null,null,null,null,null,null,null,null,null,null,null,null,null,null,null,null,0]
[150,null,926,"Other Expenses (06)",null,null,null,null,1460,1460,null,null,null,null,null,null,null,null,null,null,null,null,null,null,null,null,0]
[151,null,929,"Sub-total",null,null,null,null,672745,672745,null,null,null,null,null,null,null,null,null,null,null,null,null,null,null,null,0]
[null,null,null,"School Curriculum Leaders/Department Heads-Building Level (2220)",null,null,null,null,null,null,null,null,null,null,null,null,null,null,null,null,null,null,null,null,null,null,152]
[153,null,941,"Professional Salaries (01)",0,0,0,0,null,0,null,null,null,null,null,null,null,null,null,null,null,null,null,null,null,null,0]
[154,null,942,"Clerical Salaries (02)",0,0,0,0,null,0,null,null,null,null,null,null,null,null,null,null,null,null,null,null,null,null,0]
[155,null,943,"Other Salaries (03)",0,0,0,0,null,0,null,null,null,null,null,null,null,null,null,null,null,null,null,null,null,null,0]
[156,null,944,"Contracted Services (04)",0,0,0,0,null,0,null,null,null,null,null,null,null,null,null,null,null,null,null,null,null,null,0]
[157,null,945,"Supplies and Materials (05)",0,0,0,0,null,0,null,null,null,null,null,null,null,null,null,null,null,null,null,null,null,null,0]
[158,null,946,"Other Expenses (06)",0,0,0,0,null,0,null,null,null,null,null,null,null,null,null,null,null,null,null,null,null,null,0]
[159,null,949,"Sub-total",0,0,0,0,null,0,null,null,null,null,null,null,null,null,null,null,null,null,null,null,null,null,0]
[null,null,null,"Building Technology (2250)",null,null,null,null,null,null,null,null,null,null,null,null,null,null,null,null,null,null,null,null,null,null,160]
[161,null,961,"Professional Salaries (01)",null,null,null,null,0,0,null,null,null,null,null,null,null,null,null,null,null,null,null,null,null,null,0]
[162,null,962,"Clerical Salaries (02)",null,null,null,null,0,0,null,null,null,null,null,null,null,null,null,null,null,null,null,null,null,null,0]
[163,null,963,"Other Salaries (03)",null,null,null,null,0,0,null,null,null,null,null,null,null,null,null,null,null,null,null,null,null,null,0]
[164,null,964,"Contracted Services (04)",null,null,null,null,0,0,null,null,null,null,null,null,null,null,null,null,null,null,null,null,null,null,0]
[165,null,965,"Supplies and Materials (05)",null,null,null,null,0,0,null,null,null,null,null,null,null,null,null,null,null,null,null,null,null,null,0]
[166,null,966,"Other Expenses (06)",null,null,null,null,0,0,null,null,null,null,null,null,null,null,null,null,null,null,null,null,null,null,0]
[167,null,969,"Sub-total",null,null,null,null,0,0,null,null,null,null,null,null,null,null,null,null,null,null,null,null,null,null,0]
[null,null,null,"Teachers, Classroom (2305)",null,null,null,null,null,null,null,null,null,null,null,null,null,null,null,null,null,null,null,null,null,null,168]
[169,null,981,"Professional Salaries (01)",0,787807,7463922,0,null,8251729,null,null,null,null,null,null,null,null,null,null,null,null,null,null,null,null,0]
[null,null,null,"Teachers, Specialists  (2310)",null,null,null,null,null,null,null,null,null,null,null,null,null,null,null,null,null,null,null,null,null,null,170]
[171,null,1001,"Professional Salaries (01)",0,0,0,0,null,0,null,null,null,null,null,null,null,null,null,null,null,null,null,null,null,null,0]
[null,null,null,"Instructional Coordinators and Team Leaders (Non-Supervisory) (2315)",null,null,null,null,null,null,null,null,null,null,null,null,null,null,null,null,null,null,null,null,null,null,172]
[173,null,1021,"Professional Salaries (01)",0,0,0,0,null,0,null,null,null,null,null,null,null,null,null,null,null,null,null,null,null,null,0]
[174,null,1022,"Clerical Salaries (02)",0,0,0,0,null,0,null,null,null,null,null,null,null,null,null,null,null,null,null,null,null,null,0]
[175,null,1023,"Other Salaries (03)",0,0,0,0,null,0,null,null,null,null,null,null,null,null,null,null,null,null,null,null,null,null,0]
[176,null,1029,"Sub-total",0,0,0,0,null,0,null,null,null,null,null,null,null,null,null,null,null,null,null,null,null,null,0]
[null,null,null,"Medical/ Therapeutic Services (2320)",null,null,null,null,null,null,null,null,null,null,null,null,null,null,null,null,null,null,null,null,null,null,177]
[178,null,1041,"Professional Salaries (01)",0,0,0,0,null,0,null,null,null,null,null,null,null,null,null,null,null,null,null,null,null,null,0]
[179,null,1042,"Clerical Salaries (02)",0,0,0,0,null,0,null,null,null,null,null,null,null,null,null,null,null,null,null,null,null,null,0]
[180,null,1043,"Other Salaries (03)",0,0,0,0,null,0,null,null,null,null,null,null,null,null,null,null,null,null,null,null,null,null,0]
[181,null,1044,"Contracted Services (04)",0,0,0,0,null,0,null,null,null,null,null,null,null,null,null,null,null,null,null,null,null,null,0]
[182,null,1049,"Sub-total",0,0,0,0,null,0,null,null,null,null,null,null,null,null,null,null,null,null,null,null,null,null,0]
[null,null,null,"Substitute Teachers (2325)",null,null,null,null,null,null,null,null,null,null,null,null,null,null,null,null,null,null,null,null,null,null,183]
[184,null,1063,"Other Salaries (03)",0,8618,81671,0,null,90289,null,null,null,null,null,null,null,null,null,null,null,null,null,null,null,null,0]
[185,null,1064,"Contracted Services (04)",0,0,0,0,null,0,null,null,null,null,null,null,null,null,null,null,null,null,null,null,null,null,0]
[186,null,1069,"Sub-total",0,8618,81671,0,null,90289,null,null,null,null,null,null,null,null,null,null,null,null,null,null,null,null,0]
[null,null,null,"All Non-Clerical Paraprofessionals/Instructional Assistants (2330)",null,null,null,null,null,null,null,null,null,null,null,null,null,null,null,null,null,null,null,null,null,null,187]
[188,null,1083,"Other Salaries (03)",0,57794,28397,0,null,86191,null,null,null,null,null,null,null,null,null,null,null,null,null,null,null,null,0]
[189,null,1084,"Contracted Services (04)",0,0,0,0,null,0,null,null,null,null,null,null,null,null,null,null,null,null,null,null,null,null,0]
[190,null,1089,"Sub-total",0,57794,28397,0,null,86191,null,null,null,null,null,null,null,null,null,null,null,null,null,null,null,null,0]
[null,null,null,"Librarians and Media Center Directors (2340)",null,null,null,null,null,null,null,null,null,null,null,null,null,null,null,null,null,null,null,null,null,null,191]
[192,null,1101,"Professional Salaries (01)",null,null,null,null,89327,89327,null,null,null,null,null,null,null,null,null,null,null,null,null,null,null,null,0]
[193,null,1102,"Clerical Salaries (02)",null,null,null,null,0,0,null,null,null,null,null,null,null,null,null,null,null,null,null,null,null,null,0]
[194,null,1103,"Other Salaries (03)",null,null,null,null,0,0,null,null,null,null,null,null,null,null,null,null,null,null,null,null,null,null,0]
[195,null,1109,"Sub-total",null,null,null,null,89327,89327,null,null,null,null,null,null,null,null,null,null,null,null,null,null,null,null,0]
[null,null,null,"Professional Development Leadership (2351)",null,null,null,null,null,null,null,null,null,null,null,null,null,null,null,null,null,null,null,null,null,null,196]
[197,null,1121,"Professional Salaries (01)",null,null,null,null,0,0,null,null,null,null,null,null,null,null,null,null,null,null,null,null,null,null,0]
[198,null,1122,"Clerical Salaries (02)",null,null,null,null,0,0,null,null,null,null,null,null,null,null,null,null,null,null,null,null,null,null,0]
[199,null,1125,"Supplies and Materials (05)",null,null,null,null,0,0,null,null,null,null,null,null,null,null,null,null,null,null,null,null,null,null,0]
[200,null,1126,"Other Expenses (06)",null,null,null,null,0,0,null,null,null,null,null,null,null,null,null,null,null,null,null,null,null,null,0]
[201,null,1129,"Sub-total",null,null,null,null,0,0,null,null,null,null,null,null,null,null,null,null,null,null,null,null,null,null,0]
[null,null,null,"Teacher/Instructional Staff-Professional Days (2353)",null,null,null,null,null,null,null,null,null,null,null,null,null,null,null,null,null,null,null,null,null,null,202]
[203,null,1141,"Professional Salaries (01)",0,4377,41477,0,null,45854,null,null,null,null,null,null,null,null,null,null,null,null,null,null,null,null,0]
[204,null,1143,"Other Salaries (03)",0,0,0,0,null,0,null,null,null,null,null,null,null,null,null,null,null,null,null,null,null,null,0]
[205,null,1149,"Sub-total",0,4377,41477,0,null,45854,null,null,null,null,null,null,null,null,null,null,null,null,null,null,null,null,0]
[null,null,null,"Substitutes for Teachers/Instructional Staff at Prof. Development (2355)",null,null,null,null,null,null,null,null,null,null,null,null,null,null,null,null,null,null,null,null,null,null,206]
[207,null,1163,"Other Salaries (03)",0,1224,11596,0,null,12820,null,null,null,null,null,null,null,null,null,null,null,null,null,null,null,null,0]
[null,null,null,"Professional Development Stipends, Providers and Expenses (2357)",null,null,null,null,null,null,null,null,null,null,null,null,null,null,null,null,null,null,null,null,null,null,{"$f":"ROW() - A208","v":208}]
[209,null,1181,"Professional Salaries (01)",0,0,0,0,null,0,null,null,null,null,null,null,null,null,null,null,null,null,null,null,null,null,0]
[210,null,1184,"Contracted Services (04)",0,0,0,0,null,0,null,null,null,null,null,null,null,null,null,null,null,null,null,null,null,null,0]
[211,null,1185,"Supplies and Materials (05)",0,0,0,0,null,0,null,null,null,null,null,null,null,null,null,null,null,null,null,null,null,null,0]
[212,null,1186,"Other Expenses (06)",0,9344,88550,0,null,97894,null,null,null,null,null,null,null,null,null,null,null,null,null,null,null,null,0]
[213,null,1189,"Sub-total",0,9344,88550,0,null,97894,null,null,null,null,null,null,null,null,null,null,null,null,null,null,null,null,0]
[null,null,null,"Textbooks and Related Software/Media/Materials (2410)",null,null,null,null,null,null,null,null,null,null,null,null,null,null,null,null,null,null,null,null,null,null,214]
[215,null,1204,"Contracted Services (04)",0,0,0,0,null,0,null,null,null,null,null,null,null,null,null,null,null,null,null,null,null,null,0]
[216,null,1205,"Supplies and Materials (05)",0,0,13257,0,null,13257,null,null,null,null,null,null,null,null,null,null,null,null,null,null,null,null,0]
[217,null,1206,"Other Expenses (06)",0,0,0,0,null,0,null,null,null,null,null,null,null,null,null,null,null,null,null,null,null,null,0]
[218,null,1209,"Sub-total",0,0,13257,0,null,13257,null,null,null,null,null,null,null,null,null,null,null,null,null,null,null,null,0]
[null,null,null,"Other Instructional Materials (2415)",null,null,null,null,null,null,null,null,null,null,null,null,null,null,null,null,null,null,null,null,null,null,219]
[220,null,1224,"Contracted Services (04)",0,0,0,0,null,0,null,null,null,null,null,null,null,null,null,null,null,null,null,null,null,null,0]
[221,null,1225,"Supplies and Materials (05)",0,0,7004,0,null,7004,null,null,null,null,null,null,null,null,null,null,null,null,null,null,null,null,0]
[222,null,1226,"Other Expenses (06)",0,0,3150,0,null,3150,null,null,null,null,null,null,null,null,null,null,null,null,null,null,null,null,0]
[223,null,1229,"Sub-total",0,0,10154,0,null,10154,null,null,null,null,null,null,null,null,null,null,null,null,null,null,null,null,0]
[null,null,null,"Instructional Equipment (2420)",null,null,null,null,null,null,null,null,null,null,null,null,null,null,null,null,null,null,null,null,null,null,224]
[225,null,1244,"Contracted Services (04)",0,0,0,0,null,0,null,null,null,null,null,null,null,null,null,null,null,null,null,null,null,null,0]
[226,null,1245,"Supplies and Materials (05)",0,0,169837,0,null,169837,null,null,null,null,null,null,null,null,null,null,null,null,null,null,null,null,0]
[227,null,1246,"Other Expenses (06)",0,0,0,0,null,0,null,null,null,null,null,null,null,null,null,null,null,null,null,null,null,null,0]
[228,null,1249,"Sub-total",0,0,169837,0,null,169837,null,null,null,null,null,null,null,null,null,null,null,null,null,null,null,null,0]
[null,null,null,"General Supplies (2430)",null,null,null,null,null,null,null,null,null,null,null,null,null,null,null,null,null,null,null,null,null,null,229]
[230,null,1265,"Supplies and Materials (05)",0,0,473767,0,null,473767,null,null,null,null,null,null,null,null,null,null,null,null,null,null,null,null,0]
[null,null,null,"Other Instructional Services (2440)",null,null,null,null,null,null,null,null,null,null,null,null,null,null,null,null,null,null,null,null,null,null,231]
[232,null,1283,"Other Salaries (03)",0,0,0,0,null,0,null,null,null,null,null,null,null,null,null,null,null,null,null,null,null,null,0]
[233,null,1284,"Contracted Services (04)",0,0,0,0,null,0,null,null,null,null,null,null,null,null,null,null,null,null,null,null,null,null,0]
[234,null,1285,"Supplies and Materials (05)",0,0,0,0,null,0,null,null,null,null,null,null,null,null,null,null,null,null,null,null,null,null,0]
[235,null,1286,"Other Expenses (06)",0,0,0,0,null,0,null,null,null,null,null,null,null,null,null,null,null,null,null,null,null,null,0]
[236,null,1289,"Sub-total",0,0,0,0,null,0,null,null,null,null,null,null,null,null,null,null,null,null,null,null,null,null,0]
[null,null,null,"Classroom Instructional Technology (2451)",null,null,null,null,null,null,null,null,null,null,null,null,null,null,null,null,null,null,null,null,null,null,237]
[238,null,1304,"Contracted Services (04)",0,0,0,0,null,0,null,null,null,null,null,null,null,null,null,null,null,null,null,null,null,null,0]
[239,null,1305,"Supplies and Materials (05)",0,0,494343,0,null,494343,null,null,null,null,null,null,null,null,null,null,null,null,null,null,null,null,0]
[240,null,1306,"Other Expenses (06)",0,0,0,0,null,0,null,null,null,null,null,null,null,null,null,null,null,null,null,null,null,null,0]
[241,null,1309,"Sub-total",0,0,494343,0,null,494343,null,null,null,null,null,null,null,null,null,null,null,null,null,null,null,null,0]
[null,null,null,"Other Instructional Hardware  (2453)",null,null,null,null,null,null,null,null,null,null,null,null,null,null,null,null,null,null,null,null,null,null,242]
[243,null,1324,"Contracted Services (04)",null,null,null,null,0,0,null,null,null,null,null,null,null,null,null,null,null,null,null,null,null,null,0]
[244,null,1325,"Supplies and Materials (05)",null,null,null,null,0,0,null,null,null,null,null,null,null,null,null,null,null,null,null,null,null,null,0]
[245,null,1326,"Other Expenses (06)",null,null,null,null,0,0,null,null,null,null,null,null,null,null,null,null,null,null,null,null,null,null,0]
[246,null,1329,"Sub-total",null,null,null,null,0,0,null,null,null,null,null,null,null,null,null,null,null,null,null,null,null,null,0]
[null,null,null,"Instructional Software (2455)",null,null,null,null,null,null,null,null,null,null,null,null,null,null,null,null,null,null,null,null,null,null,247]
[248,null,1344,"Contracted Services (04)",null,null,null,null,70793,70793,null,null,null,null,null,null,null,null,null,null,null,null,null,null,null,null,0]
[249,null,1345,"Supplies and Materials (05)",null,null,null,null,0,0,null,null,null,null,null,null,null,null,null,null,null,null,null,null,null,null,0]
[250,null,1346,"Other Expenses (06)",null,null,null,null,0,0,null,null,null,null,null,null,null,null,null,null,null,null,null,null,null,null,0]
[251,null,1349,"Sub-total",null,null,null,null,70793,70793,null,null,null,null,null,null,null,null,null,null,null,null,null,null,null,null,0]
[null,null,null,"Guidance Including Guidance Counselors and Adjustment Counselors (2710)",null,null,null,null,null,null,null,null,null,null,null,null,null,null,null,null,null,null,null,null,null,null,252]
[253,null,1361,"Professional Salaries (01)",0,0,390240,0,null,390240,null,null,null,null,null,null,null,null,null,null,null,null,null,null,null,null,0]
[254,null,1362,"Clerical Salaries (02)",0,0,45198,0,null,45198,null,null,null,null,null,null,null,null,null,null,null,null,null,null,null,null,0]
[255,null,1363,"Other Salaries (03)",0,0,0,0,null,0,null,null,null,null,null,null,null,null,null,null,null,null,null,null,null,null,0]
[256,null,1364,"Contracted Services (04)",0,0,0,0,null,0,null,null,null,null,null,null,null,null,null,null,null,null,null,null,null,null,0]
[257,null,1365,"Supplies and Materials (05)",0,0,4570,0,null,4570,null,null,null,null,null,null,null,null,null,null,null,null,null,null,null,null,0]
[258,null,1366,"Other Expenses (06)",0,0,45,0,null,45,null,null,null,null,null,null,null,null,null,null,null,null,null,null,null,null,0]
[259,null,1369,"Sub-total",0,0,440053,0,null,440053,null,null,null,null,null,null,null,null,null,null,null,null,null,null,null,null,0]
[null,null,null,"Testing and Assessment (2720)",null,null,null,null,null,null,null,null,null,null,null,null,null,null,null,null,null,null,null,null,null,null,260]
[261,null,1381,"Professional Salaries (01)",0,0,0,0,null,0,null,null,null,null,null,null,null,null,null,null,null,null,null,null,null,null,0]
[262,null,1382,"Clerical Salaries (02)",0,0,0,0,null,0,null,null,null,null,null,null,null,null,null,null,null,null,null,null,null,null,0]
[263,null,1383,"Other Salaries (03)",0,0,0,0,null,0,null,null,null,null,null,null,null,null,null,null,null,null,null,null,null,null,0]
[264,null,1384,"Contracted Services (04)",0,0,0,0,null,0,null,null,null,null,null,null,null,null,null,null,null,null,null,null,null,null,0]
[265,null,1385,"Supplies and Materials (05)",0,0,0,0,null,0,null,null,null,null,null,null,null,null,null,null,null,null,null,null,null,null,0]
[266,null,1386,"Other Expenses (06)",0,0,0,0,null,0,null,null,null,null,null,null,null,null,null,null,null,null,null,null,null,null,0]
[267,null,1389,"Sub-total",0,0,0,0,null,0,null,null,null,null,null,null,null,null,null,null,null,null,null,null,null,null,0]
[null,null,null,"Psychological Services (2800)",null,null,null,null,null,null,null,null,null,null,null,null,null,null,null,null,null,null,null,null,null,null,268]
[269,null,1401,"Professional Salaries (01)",0,74942,0,0,null,74942,null,null,null,null,null,null,null,null,null,null,null,null,null,null,null,null,0]
[270,null,1402,"Clerical Salaries (02)",0,0,0,0,null,0,null,null,null,null,null,null,null,null,null,null,null,null,null,null,null,null,0]
[271,null,1403,"Other Salaries (03)",0,0,0,0,null,0,null,null,null,null,null,null,null,null,null,null,null,null,null,null,null,null,0]
[272,null,1404,"Contracted Services (04)",0,32833,0,0,null,32833,null,null,null,null,null,null,null,null,null,null,null,null,null,null,null,null,{"$f":"ROW() - A272","v":0}]
[273,null,1405,"Supplies and Materials (05)",0,11148,0,0,null,11148,null,null,null,null,null,null,null,null,null,null,null,null,null,null,null,null,0]
[274,null,1406,"Other Expenses (06)",0,975,0,0,null,975,null,null,null,null,null,null,null,null,null,null,null,null,null,null,null,null,0]
[275,null,1409,"Sub-total",0,119898,0,0,null,119898,null,null,null,null,null,null,null,null,null,null,null,null,null,null,null,null,0]
[null,null,null,"Attendance and Parent Liaison Services (3100)",null,null,null,null,null,null,null,null,null,null,null,null,null,null,null,null,null,null,null,null,null,null,276]
[277,null,1421,"Professional Salaries (01)",null,null,null,null,null,0,null,null,null,null,null,null,null,null,null,null,null,null,null,null,null,null,0]
[278,null,1422,"Clerical Salaries (02)",null,null,null,null,null,0,null,null,null,null,null,null,null,null,null,null,null,null,null,null,null,null,0]
[279,null,1423,"Other Salaries (03)",null,null,null,null,43722,43722,null,null,null,null,null,null,null,null,null,null,null,null,null,null,null,null,0]
[280,null,1424,"Contracted Services (04)",null,null,null,null,null,0,null,null,null,null,null,null,null,null,null,null,null,null,null,null,null,null,0]
[281,null,1425,"Supplies and Materials (05)",null,null,null,null,null,0,null,null,null,null,null,null,null,null,null,null,null,null,null,null,null,null,0]
[282,null,1426,"Other Expenses (06)",null,null,null,null,null,0,null,null,null,null,null,null,null,null,null,null,null,null,null,null,null,null,0]
[283,null,1429,"Sub-total",null,null,null,null,43722,43722,null,null,null,null,null,null,null,null,null,null,null,null,null,null,null,null,0]
[null,null,null,"Medical/Health Services (3200)",null,null,null,null,null,null,null,null,null,null,null,null,null,null,null,null,null,null,null,null,null,null,284]
[285,null,1441,"Professional Salaries (01)",null,null,null,null,146505,146505,null,null,null,null,null,null,null,null,null,null,null,null,null,null,null,null,0]
[286,null,1442,"Clerical Salaries (02)",null,null,null,null,null,0,null,null,null,null,null,null,null,null,null,null,null,null,null,null,null,null,0]
[287,null,1443,"Other Salaries (03)",null,null,null,null,null,0,null,null,null,null,null,null,null,null,null,null,null,null,null,null,null,null,0]
[288,null,1444,"Contracted Services (04)",null,null,null,null,15239,15239,null,null,null,null,null,null,null,null,null,null,null,null,null,null,null,null,0]
[289,null,1445,"Supplies and Materials (05)",null,null,null,null,8367,8367,null,null,null,null,null,null,null,null,null,null,null,null,null,null,null,null,0]
[290,null,1446,"Other Expenses (06)",null,null,null,null,1111,1111,null,null,null,null,null,null,null,null,null,null,null,null,null,null,null,null,0]
[291,null,1449,"Sub-total",null,null,null,null,171222,171222,null,null,null,null,null,null,null,null,null,null,null,null,null,null,null,null,0]
[null,null,null,"Transportation Services (3300)",null,null,null,null,null,null,null,null,null,null,null,null,null,null,null,null,null,null,null,null,null,null,292]
[293,null,1461,"Professional Salaries (01)",null,null,64298,null,null,64298,null,null,null,null,null,null,null,null,null,null,null,null,null,null,null,null,0]
[294,null,1462,"Clerical Salaries (02)",null,null,null,null,null,0,null,null,null,null,null,null,null,null,null,null,null,null,null,null,null,null,0]
[295,null,1463,"Other Salaries (03)",null,10215,604199,null,null,614414,null,null,null,null,null,null,null,null,null,null,null,null,null,null,null,null,0]
[296,null,1464,"Contracted Services (04)",null,4767,null,null,null,4767,null,null,null,null,null,null,null,null,null,null,null,null,null,null,null,null,0]
[297,null,1465,"Supplies and Materials (05)",null,null,229636,null,null,229636,null,null,null,null,null,null,null,null,null,null,null,null,null,null,null,null,0]
[298,null,1466,"Other Expenses (06)",null,null,197557,null,null,197557,null,null,null,null,null,null,null,null,null,null,null,null,null,null,null,null,0]
[299,null,1469,"Sub-total",0,14982,1095690,0,null,1110672,null,null,null,null,null,null,null,null,null,null,null,null,null,null,null,null,0]
[null,null,null,"Food Services (3400)",null,null,null,null,null,null,null,null,null,null,null,null,null,null,null,null,null,null,null,null,null,null,300]
[301,null,1481,"Professional Salaries (01)",null,null,null,null,null,0,null,null,null,null,null,null,null,null,null,null,null,null,null,null,null,null,0]
[302,null,1482,"Clerical Salaries (02)",null,null,null,null,null,0,null,null,null,null,null,null,null,null,null,null,null,null,null,null,null,null,0]
[303,null,1483,"Other Salaries (03)",null,null,null,null,null,0,null,null,null,null,null,null,null,null,null,null,null,null,null,null,null,null,0]
[304,null,1484,"Contracted Services (04)",null,null,null,null,null,0,null,null,null,null,null,null,null,null,null,null,null,null,null,null,null,null,0]
[305,null,1485,"Supplies and Materials (05)",null,null,null,null,null,0,null,null,null,null,null,null,null,null,null,null,null,null,null,null,null,null,0]
[306,null,1486,"Other Expenses (06)",null,null,null,null,null,0,null,null,null,null,null,null,null,null,null,null,null,null,null,null,null,null,0]
[307,null,1489,"Total",null,null,null,null,0,0,null,null,null,null,null,null,null,null,null,null,null,null,null,null,null,null,0]
[null,null,null,"Athletics (3510)",null,null,null,null,null,null,null,null,null,null,null,null,null,null,null,null,null,null,null,null,null,null,308]
[309,null,1501,"Professional Salaries (01)",null,null,null,null,244853,244853,null,null,null,null,null,null,null,null,null,null,null,null,null,null,null,null,0]
[310,null,1502,"Clerical Salaries (02)",null,null,null,null,null,0,null,null,null,null,null,null,null,null,null,null,null,null,null,null,null,null,0]
[311,null,1503,"Other Salaries (03)",null,null,null,null,null,0,null,null,null,null,null,null,null,null,null,null,null,null,null,null,null,null,0]
[312,null,1504,"Contracted Services (04)",null,null,null,null,48008,48008,null,null,null,null,null,null,null,null,null,null,null,null,null,null,null,null,0]
[313,null,1505,"Supplies and Materials (05)",null,null,null,null,114203,114203,null,null,null,null,null,null,null,null,null,null,null,null,null,null,null,null,0]
[314,null,1506,"Other Expenses (06)",null,null,null,null,16919,16919,null,null,null,null,null,null,null,null,null,null,null,null,null,null,null,null,0]
[315,null,1509,"Sub-total",null,null,null,null,423983,423983,null,null,null,null,null,null,null,null,null,null,null,null,null,null,null,null,0]
[null,null,null,"Other Student Activities (3520)",null,null,null,null,null,null,null,null,null,null,null,null,null,null,null,null,null,null,null,null,null,null,316]
[317,null,1521,"Professional Salaries (01)",null,null,null,null,38550,38550,null,null,null,null,null,null,null,null,null,null,null,null,null,null,null,null,0]
[318,null,1522,"Clerical Salaries (02)",null,null,null,null,null,0,null,null,null,null,null,null,null,null,null,null,null,null,null,null,null,null,0]
[319,null,1523,"Other Salaries (03)",null,null,null,null,null,0,null,null,null,null,null,null,null,null,null,null,null,null,null,null,null,null,0]
[320,null,1524,"Contracted Services (04)",null,null,null,null,null,0,null,null,null,null,null,null,null,null,null,null,null,null,null,null,null,null,0]
[321,null,1525,"Supplies and Materials (05)",null,null,null,null,null,0,null,null,null,null,null,null,null,null,null,null,null,null,null,null,null,null,0]
[322,null,1526,"Other Expenses (06)",null,null,null,null,46781,46781,null,null,null,null,null,null,null,null,null,null,null,null,null,null,null,null,0]
[323,null,1529,"Sub-total",null,null,null,null,85331,85331,null,null,null,null,null,null,null,null,null,null,null,null,null,null,null,null,0]
[null,null,null,"School Security (3600)",null,null,null,null,null,null,null,null,null,null,null,null,null,null,null,null,null,null,null,null,null,null,324]
[325,null,1541,"Professional Salaries (01)",null,null,null,null,40023,40023,null,null,null,null,null,null,null,null,null,null,null,null,null,null,null,null,0]
[326,null,1542,"Clerical Salaries (02)",null,null,null,null,null,0,null,null,null,null,null,null,null,null,null,null,null,null,null,null,null,null,0]
[327,null,1543,"Other Salaries (03)",null,null,null,null,74542,74542,null,null,null,null,null,null,null,null,null,null,null,null,null,null,null,null,0]
[328,null,1544,"Contracted Services (04)",null,null,null,null,199619,199619,null,null,null,null,null,null,null,null,null,null,null,null,null,null,null,null,0]
[329,null,1545,"Supplies and Materials (05)",null,null,null,null,20195,20195,null,null,null,null,null,null,null,null,null,null,null,null,null,null,null,null,0]
[330,null,1546,"Other Expenses (06)",null,null,null,null,null,0,null,null,null,null,null,null,null,null,null,null,null,null,null,null,null,null,0]
[331,null,1549,"Sub-total",null,null,null,null,334379,334379,null,null,null,null,null,null,null,null,null,null,null,null,null,null,null,null,0]
[null,null,null,"Custodial Services (4110)",null,null,null,null,null,null,null,null,null,null,null,null,null,null,null,null,null,null,null,null,null,null,332]
[333,null,1561,"Professional Salaries (01)",null,null,null,null,null,0,null,null,null,null,null,null,null,null,null,null,null,null,null,null,null,null,0]
[334,null,1562,"Clerical Salaries (02)",null,null,null,null,null,0,null,null,null,null,null,null,null,null,null,null,null,null,null,null,null,null,0]
[335,null,1563,"Other Salaries (03)",null,null,null,null,null,0,null,null,null,null,null,null,null,null,null,null,null,null,null,null,null,null,0]
[336,null,1564,"Contracted Services (04)",null,null,null,null,279080,279080,null,null,null,null,null,null,null,null,null,null,null,null,null,null,null,null,{"$f":"ROW() - A336","v":0}]
[337,null,1565,"Supplies and Materials (05)",null,null,null,null,null,0,null,null,null,null,null,null,null,null,null,null,null,null,null,null,null,null,0]
[338,null,1566,"Other Expenses (06)",null,null,null,null,null,0,null,null,null,null,null,null,null,null,null,null,null,null,null,null,null,null,0]
[339,null,1569,"Sub-total",null,null,null,null,279080,279080,null,null,null,null,null,null,null,null,null,null,null,null,null,null,null,null,0]
[null,null,null,"Heating of Buildings (4120)",null,null,null,null,null,null,null,null,null,null,null,null,null,null,null,null,null,null,null,null,null,null,340]
[341,null,1574,"Contracted Services (04)",null,null,null,null,101124,101124,null,null,null,null,null,null,null,null,null,null,null,null,null,null,null,null,0]
[342,null,1575,"Supplies and Materials (05)",null,null,null,null,null,0,null,null,null,null,null,null,null,null,null,null,null,null,null,null,null,null,0]
[343,null,1576,"Other Expenses (06)",null,null,null,null,null,0,null,null,null,null,null,null,null,null,null,null,null,null,null,null,null,null,0]
[344,null,1579,"Sub-total",null,null,null,null,101124,101124,null,null,null,null,null,null,null,null,null,null,null,null,null,null,null,null,0]
[null,null,null,"Utility Services (4130)",null,null,null,null,null,null,null,null,null,null,null,null,null,null,null,null,null,null,null,null,null,null,345]
[346,null,1584,"Contracted Services (04)",null,null,null,null,577870,577870,null,null,null,null,null,null,null,null,null,null,null,null,null,null,null,null,0]
[347,null,1585,"Supplies and Materials (05)",null,null,null,null,11932,11932,null,null,null,null,null,null,null,null,null,null,null,null,null,null,null,null,0]
[348,null,1586,"Other Expenses (06)",null,null,null,null,null,0,null,null,null,null,null,null,null,null,null,null,null,null,null,null,null,null,0]
[349,null,1589,"Sub-total",null,null,null,null,589802,589802,null,null,null,null,null,null,null,null,null,null,null,null,null,null,null,null,0]
[null,null,null,"Maintenance of Grounds (4210)",null,null,null,null,null,null,null,null,null,null,null,null,null,null,null,null,null,null,null,null,null,null,350]
[351,null,1591,"Professional Salaries (01)",null,null,null,null,null,0,null,null,null,null,null,null,null,null,null,null,null,null,null,null,null,null,0]
[352,null,1592,"Clerical Salaries (02)",null,null,null,null,null,0,null,null,null,null,null,null,null,null,null,null,null,null,null,null,null,null,0]
[353,null,1593,"Other Salaries (03)",null,null,null,null,24333,24333,null,null,null,null,null,null,null,null,null,null,null,null,null,null,null,null,0]
[354,null,1594,"Contracted Services (04)",null,null,null,null,1999,1999,null,null,null,null,null,null,null,null,null,null,null,null,null,null,null,null,0]
[355,null,1595,"Supplies and Materials (05)",null,null,null,null,19277,19277,null,null,null,null,null,null,null,null,null,null,null,null,null,null,null,null,0]
[356,null,1596,"Other Expenses (06)",null,null,null,null,null,0,null,null,null,null,null,null,null,null,null,null,null,null,null,null,null,null,0]
[357,null,1599,"Sub-total",null,null,null,null,45609,45609,null,null,null,null,null,null,null,null,null,null,null,null,null,null,null,null,0]
[null,null,null,"Maintenance of Buildings (4220)",null,null,null,null,null,null,null,null,null,null,null,null,null,null,null,null,null,null,null,null,null,null,358]
[359,null,1601,"Professional Salaries (01)",null,null,null,null,95519,95519,null,null,null,null,null,null,null,null,null,null,null,null,null,null,null,null,0]
[360,null,1602,"Clerical Salaries (02)",null,null,null,null,null,0,null,null,null,null,null,null,null,null,null,null,null,null,null,null,null,null,0]
[361,null,1603,"Other Salaries (03)",null,null,null,null,308465,308465,null,null,null,null,null,null,null,null,null,null,null,null,null,null,null,null,0]
[362,null,1604,"Contracted Services (04)",null,null,null,null,27877,27877,null,null,null,null,null,null,null,null,null,null,null,null,null,null,null,null,0]
[363,null,1605,"Supplies and Materials (05)",null,null,null,null,75775,75775,null,null,null,null,null,null,null,null,null,null,null,null,null,null,null,null,0]
[364,null,1606,"Other Expenses (06)",null,null,null,null,179319,179319,null,null,null,null,null,null,null,null,null,null,null,null,null,null,null,null,0]
[365,null,1609,"Sub-total",null,null,null,null,686955,686955,null,null,null,null,null,null,null,null,null,null,null,null,null,null,null,null,0]
[null,null,null,"Building Security System (4225)",null,null,null,null,null,null,null,null,null,null,null,null,null,null,null,null,null,null,null,null,null,null,366]
[367,null,1614,"Contracted Services (04)",null,null,null,null,null,0,null,null,null,null,null,null,null,null,null,null,null,null,null,null,null,null,0]
[368,null,1615,"Supplies and Materials (05)",null,null,null,null,null,0,null,null,null,null,null,null,null,null,null,null,null,null,null,null,null,null,0]
[369,null,1616,"Other Expenses (06)",null,null,null,null,null,0,null,null,null,null,null,null,null,null,null,null,null,null,null,null,null,null,0]
[370,null,1619,"Sub-total",null,null,null,null,0,0,null,null,null,null,null,null,null,null,null,null,null,null,null,null,null,null,0]
[null,null,null,"Maintenance of Equipment (4230)",null,null,null,null,null,null,null,null,null,null,null,null,null,null,null,null,null,null,null,null,null,null,371]
[372,null,1621,"Professional Salaries (01)",null,null,null,null,null,0,null,null,null,null,null,null,null,null,null,null,null,null,null,null,null,null,0]
[373,null,1622,"Clerical Salaries (02)",null,null,null,null,null,0,null,null,null,null,null,null,null,null,null,null,null,null,null,null,null,null,0]
[374,null,1623,"Other Salaries (03)",null,null,null,null,null,0,null,null,null,null,null,null,null,null,null,null,null,null,null,null,null,null,0]
[375,null,1624,"Contracted Services (04)",null,null,null,null,65294,65294,null,null,null,null,null,null,null,null,null,null,null,null,null,null,null,null,0]
[376,null,1625,"Supplies and Materials (05)",null,null,null,null,3114,3114,null,null,null,null,null,null,null,null,null,null,null,null,null,null,null,null,0]
[377,null,1626,"Other Expenses (06)",null,null,null,null,null,0,null,null,null,null,null,null,null,null,null,null,null,null,null,null,null,null,0]
[378,null,1629,"Sub-total",null,null,null,null,68408,68408,null,null,null,null,null,null,null,null,null,null,null,null,null,null,null,null,0]
[null,null,null,"Extraordinary Maintenance(4300) ",null,null,null,null,null,null,null,null,null,null,null,null,null,null,null,null,null,null,null,null,null,null,379]
[380,null,1634,"Contracted Services (04)",null,null,null,null,null,0,null,null,null,null,null,null,null,null,null,null,null,null,null,null,null,null,0]
[381,null,1635,"Supplies and Materials (05)",null,null,null,null,null,0,null,null,null,null,null,null,null,null,null,null,null,null,null,null,null,null,0]
[382,null,1636,"Other Expenses (06)",null,null,null,null,null,0,null,null,null,null,null,null,null,null,null,null,null,null,null,null,null,null,0]
[383,null,1639,"Sub-total",null,null,null,null,0,0,null,null,null,null,null,null,null,null,null,null,null,null,null,null,null,null,0]
[null,null,null,"Networking and Telecommunications (4400)",null,null,null,null,null,null,null,null,null,null,null,null,null,null,null,null,null,null,null,null,null,null,384]
[385,null,1641,"Professional Salaries (01)",null,null,null,null,null,0,null,null,null,null,null,null,null,null,null,null,null,null,null,null,null,null,0]
[386,null,1642,"Clerical Salaries (02)",null,null,null,null,null,0,null,null,null,null,null,null,null,null,null,null,null,null,null,null,null,null,0]
[387,null,1643,"Other Salaries (03)",null,null,null,null,null,0,null,null,null,null,null,null,null,null,null,null,null,null,null,null,null,null,0]
[388,null,1644,"Contracted Services (04)",null,null,null,null,null,0,null,null,null,null,null,null,null,null,null,null,null,null,null,null,null,null,0]
[389,null,1645,"Supplies and Materials (05)",null,null,null,null,null,0,null,null,null,null,null,null,null,null,null,null,null,null,null,null,null,null,0]
[390,null,1646,"Other Expenses (06)",null,null,null,null,null,0,null,null,null,null,null,null,null,null,null,null,null,null,null,null,null,null,0]
[391,null,1649,"Sub-total",null,null,null,null,0,0,null,null,null,null,null,null,null,null,null,null,null,null,null,null,null,null,0]
[null,null,null,"Technology Maintenance (4450)",null,null,null,null,null,null,null,null,null,null,null,null,null,null,null,null,null,null,null,null,null,null,392]
[393,null,1651,"Professional Salaries (01)",null,null,null,null,null,0,null,null,null,null,null,null,null,null,null,null,null,null,null,null,null,null,0]
[394,null,1652,"Clerical Salaries (02)",null,null,null,null,null,0,null,null,null,null,null,null,null,null,null,null,null,null,null,null,null,null,0]
[395,null,1653,"Other Salaries (03)",null,null,null,null,null,0,null,null,null,null,null,null,null,null,null,null,null,null,null,null,null,null,0]
[396,null,1654,"Contracted Services (04)",null,null,null,null,null,0,null,null,null,null,null,null,null,null,null,null,null,null,null,null,null,null,0]
[397,null,1655,"Supplies and Materials (05)",null,null,null,null,null,0,null,null,null,null,null,null,null,null,null,null,null,null,null,null,null,null,0]
[398,null,1656,"Other Expenses (06)",null,null,null,null,null,0,null,null,null,null,null,null,null,null,null,null,null,null,null,null,null,null,0]
[399,null,1659,"Sub-total",null,null,null,null,0,0,null,null,null,null,null,null,null,null,null,null,null,null,null,null,null,null,0]
[null,null,null,"Employer Retirement Contributions (5100)",null,null,null,null,null,null,null,null,null,null,null,null,null,null,null,null,null,null,null,null,null,null,{"$f":"ROW() - A400","v":400}]
[401,null,1661,"Employer Retirement Contributions (5100)",null,null,null,null,508902,508902,null,null,null,null,null,null,null,null,null,null,null,null,null,null,null,null,0]
[null,null,null,"Employee Separation Costs (5150)",null,null,null,null,null,null,null,null,null,null,null,null,null,null,null,null,null,null,null,null,null,null,402]
[403,null,1664,"Professional Salaries (01)",null,null,null,null,60599,60599,null,null,null,null,null,null,null,null,null,null,null,null,null,null,null,null,0]
[404,null,1665,"Clerical Salaries (02)",null,null,null,null,null,0,null,null,null,null,null,null,null,null,null,null,null,null,null,null,null,null,0]
[405,null,1666,"Other Salaries (03)",null,null,null,null,null,0,null,null,null,null,null,null,null,null,null,null,null,null,null,null,null,null,0]
[406,null,1667,"Contracted Services (04)",null,null,null,null,null,0,null,null,null,null,null,null,null,null,null,null,null,null,null,null,null,null,0]
[407,null,1669,"Sub-total",null,null,null,null,60599,60599,null,null,null,null,null,null,null,null,null,null,null,null,null,null,null,null,0]
[null,null,null,"Insurance (5200)",null,null,null,null,null,null,null,null,null,null,null,null,null,null,null,null,null,null,null,null,null,null,408]
[409,null,1672,"Insurance for Active Employees (5200)",null,null,null,null,2584390,2584390,null,null,null,null,null,null,null,null,null,null,null,null,null,null,null,null,0]
[410,null,1673,"Insurance for Retired School Employees (5250)",null,null,null,null,567490,567490,null,null,null,null,null,null,null,null,null,null,null,null,null,null,null,null,0]
[411,null,1674,"Other Non Employee Insurance (5260)",null,null,null,null,250144,250144,null,null,null,null,null,null,null,null,null,null,null,null,null,null,null,null,0]
[412,null,1679,"Sub-total",null,null,null,null,3402024,3402024,null,null,null,null,null,null,null,null,null,null,null,null,null,null,null,null,0]
[null,null,null,"Rental Lease, Interest & Other Fixed Charges (5300, 5400, 5500,5550)",null,null,null,null,null,null,null,null,null,null,null,null,null,null,null,null,null,null,null,null,null,null,413]
[414,null,1681,"Rental-Lease Equipment (5300)  ",null,null,null,null,43398,43398,null,null,null,null,null,null,null,null,null,null,null,null,null,null,null,null,0]
[415,null,1682,"Rental-Lease Buildings (5350)  ",null,null,null,null,null,0,null,null,null,null,null,null,null,null,null,null,null,null,null,null,null,null,0]
[416,null,1683,"Short-Term Interest RAN's (5400)",null,null,null,null,null,0,null,null,null,null,null,null,null,null,null,null,null,null,null,null,null,null,0]
[417,null,1684,"Short Term Interest-BAN's (5450)",null,null,null,null,null,0,null,null,null,null,null,null,null,null,null,null,null,null,null,null,null,null,0]
[418,null,1685,"Other Fixed Charges (5500)",null,null,null,null,null,0,null,null,null,null,null,null,null,null,null,null,null,null,null,null,null,null,0]
[419,null,1686,"School Crossing Guards (5550)",null,null,null,null,null,0,null,null,null,null,null,null,null,null,null,null,null,null,null,null,null,null,0]
[420,null,1689,"Sub-total",null,null,null,null,43398,43398,null,null,null,null,null,null,null,null,null,null,null,null,null,null,null,null,0]
[null,null,null,"Civic Activities and Community Services (6200)",null,null,null,null,null,null,null,null,null,null,null,null,null,null,null,null,null,null,null,null,null,null,421]
[422,null,1701,"Professional Salaries (01)",null,null,null,null,null,0,null,null,null,null,null,null,null,null,null,null,null,null,null,null,null,null,0]
[423,null,1702,"Clerical Salaries (02)",null,null,null,null,null,0,null,null,null,null,null,null,null,null,null,null,null,null,null,null,null,null,0]
[424,null,1703,"Other Salaries (03)",null,null,null,null,null,0,null,null,null,null,null,null,null,null,null,null,null,null,null,null,null,null,0]
[425,null,1704,"Contracted Services (04)",null,null,null,null,null,0,null,null,null,null,null,null,null,null,null,null,null,null,null,null,null,null,0]
[426,null,1705,"Supplies and Materials (05)",null,null,8130,null,null,8130,null,null,null,null,null,null,null,null,null,null,null,null,null,null,null,null,0]
[427,null,1706,"Other Expenses (06)",null,null,null,null,null,0,null,null,null,null,null,null,null,null,null,null,null,null,null,null,null,null,0]
[428,null,1709,"Sub-total",0,0,8130,0,0,8130,null,null,null,null,null,null,null,null,null,null,null,null,null,null,null,null,0]
[null,null,null,"Recreation (6300)",null,null,null,null,null,null,null,null,null,null,null,null,null,null,null,null,null,null,null,null,null,null,429]
[430,null,1711,"Professional Salaries (01)",null,null,null,null,null,0,null,null,null,null,null,null,null,null,null,null,null,null,null,null,null,null,0]
[431,null,1712,"Clerical Salaries (02)",null,null,null,null,null,0,null,null,null,null,null,null,null,null,null,null,null,null,null,null,null,null,0]
[432,null,1713,"Other Salaries (03)",null,null,null,null,null,0,null,null,null,null,null,null,null,null,null,null,null,null,null,null,null,null,0]
[433,null,1714,"Contracted Services (04)",null,null,null,null,null,0,null,null,null,null,null,null,null,null,null,null,null,null,null,null,null,null,0]
[434,null,1715,"Supplies and Materials (05)",null,null,null,null,null,0,null,null,null,null,null,null,null,null,null,null,null,null,null,null,null,null,0]
[435,null,1716,"Other Expenses (06)",null,null,null,null,null,0,null,null,null,null,null,null,null,null,null,null,null,null,null,null,null,null,0]
[436,null,1719,"Sub-total",null,null,null,null,0,0,null,null,null,null,null,null,null,null,null,null,null,null,null,null,null,null,0]
[null,null,null,"Health Non-Public Schools (6800)",null,null,null,null,null,null,null,null,null,null,null,null,null,null,null,null,null,null,null,null,null,null,437]
[438,null,1721,"Professional Salaries (01)",null,null,null,null,null,0,null,null,null,null,null,null,null,null,null,null,null,null,null,null,null,null,0]
[439,null,1722,"Clerical Salaries (02)",null,null,null,null,null,0,null,null,null,null,null,null,null,null,null,null,null,null,null,null,null,null,0]
[440,null,1723,"Other Salaries (03)",null,null,null,null,null,0,null,null,null,null,null,null,null,null,null,null,null,null,null,null,null,null,0]
[441,null,1724,"Contracted Services (04)",null,null,null,null,null,0,null,null,null,null,null,null,null,null,null,null,null,null,null,null,null,null,0]
[442,null,1725,"Supplies and Materials (05)",null,null,null,null,null,0,null,null,null,null,null,null,null,null,null,null,null,null,null,null,null,null,0]
[443,null,1726,"Other Expenses (06)",null,null,null,null,null,0,null,null,null,null,null,null,null,null,null,null,null,null,null,null,null,null,0]
[444,null,1729,"Sub-total",0,0,0,0,null,0,null,null,null,null,null,null,null,null,null,null,null,null,null,null,null,null,0]
[null,null,null,"Transportation Non-Public (6900)",null,null,null,null,null,null,null,null,null,null,null,null,null,null,null,null,null,null,null,null,null,null,445]
[446,null,1731,"Professional Salaries (01)",null,null,null,null,null,0,null,null,null,null,null,null,null,null,null,null,null,null,null,null,null,null,0]
[447,null,1732,"Clerical Salaries (02)",null,null,null,null,null,0,null,null,null,null,null,null,null,null,null,null,null,null,null,null,null,null,0]
[448,null,1733,"Other Salaries (03)",null,null,null,null,null,0,null,null,null,null,null,null,null,null,null,null,null,null,null,null,null,null,0]
[449,null,1734,"Contracted Services (04)",null,null,null,null,null,0,null,null,null,null,null,null,null,null,null,null,null,null,null,null,null,null,0]
[450,null,1735,"Supplies and Materials (05)",null,null,null,null,null,0,null,null,null,null,null,null,null,null,null,null,null,null,null,null,null,null,0]
[451,null,1736,"Other Expenses (06)",null,null,null,null,null,0,null,null,null,null,null,null,null,null,null,null,null,null,null,null,null,null,0]
[452,null,1739,"Sub-total",0,0,0,0,null,0,null,null,null,null,null,null,null,null,null,null,null,null,null,null,null,null,0]
[null,null,null,"Asset Acquisition & Improvement (7000) ",null,null,null,null,null,null,null,null,null,null,null,null,null,null,null,null,null,null,null,null,null,null,453]
[454,null,1741,"Purchase of Land & Buildings (7100, 7200)",null,null,null,null,129877,129877,null,null,null,null,null,null,null,null,null,null,null,null,null,null,null,null,0]
[455,null,1742,"Equipment (7300, 7400)",null,null,null,null,286468,286468,null,null,null,null,null,null,null,null,null,null,null,null,null,null,null,null,0]
[456,null,1743,"Capital Technology (7350)",null,null,null,null,null,0,null,null,null,null,null,null,null,null,null,null,null,null,null,null,null,null,0]
[457,null,1744,"Motor Vehicles (7500, 7600)",null,null,null,null,155980,155980,null,null,null,null,null,null,null,null,null,null,null,null,null,null,null,null,0]
[458,null,1749,"Sub-total",null,null,null,null,572325,572325,null,null,null,null,null,null,null,null,null,null,null,null,null,null,null,null,0]
[null,null,null,"Long Term Debt (8000)",null,null,null,null,null,null,null,null,null,null,null,null,null,null,null,null,null,null,null,null,null,null,459]
[460,null,1751,"Debt Retirement/Sch Construction (8100)",null,null,null,null,null,0,null,null,null,null,null,null,null,null,null,null,null,null,null,null,null,null,0]
[461,null,1752,"Debt Service/Sch Construction (8200)",null,null,null,null,null,0,null,null,null,null,null,null,null,null,null,null,null,null,null,null,null,null,0]
[462,null,1753,"Debt Service/Educ. & Other (8400, 8600)",null,null,null,null,null,0,null,null,null,null,null,null,null,null,null,null,null,null,null,null,null,null,0]
[463,null,1759,"Sub-total",null,null,null,null,0,0,null,null,null,null,null,null,null,null,null,null,null,null,null,null,null,null,0]
[null,null,null,"Payments to Other Districts (9000)",null,null,null,null,null,null,null,null,null,null,null,null,null,null,null,null,null,null,null,null,null,null,{"$f":"ROW() - A464","v":464}]
[465,null,1770,"Tuition to Mass. Schools (9100)",null,0,null,null,null,0,null,null,null,null,null,null,null,null,null,null,null,null,null,null,null,null,0]
[466,null,1780,"School Choice Tuition (9110)",0,4038,29300,null,null,33338,null,null,null,null,null,null,null,null,null,null,null,null,null,null,null,null,0]
[467,null,1790,"Tuition to Commonwealth Charter Schools (9120)",0,0,null,null,null,0,null,null,null,null,null,null,null,null,null,null,null,null,null,null,null,null,0]
[468,null,1795,"Tuition to Horace Mann Charter Schools (9120)",null,null,null,null,null,0,null,null,null,null,null,null,null,null,null,null,null,null,null,null,null,null,0]
[469,null,1800,"Tuition to Out-of-State Schools (9200)",null,null,null,null,null,0,null,null,null,null,null,null,null,null,null,null,null,null,null,null,null,null,0]
[470,null,1810,"Tuition to Non-Public Schools (9300)",null,null,null,null,null,0,null,null,null,null,null,null,null,null,null,null,null,null,null,null,null,null,0]
[471,null,1820,"Tuition to Collaboratives (9400)",null,31101,null,null,null,31101,null,null,null,null,null,null,null,null,null,null,null,null,null,null,null,null,0]
[472,null,1840,"Sub-total",0,35139,29300,0,null,64439,null,null,null,null,null,null,null,null,null,null,null,null,null,null,null,null,0]
[473,null,1850,"TOTAL EXPENDITURES BY SCHOOL COMMITTEE",0,1172716,10866782,0,9289949,21329447,null,null,null,null,null,null,null,null,null,null,null,null,null,null,null,null,0]
[null,null,null,null,null,null,null,null,null,null,null,null,null,null,null,null,null,null,null,null,null,null,null,null,null,null,474]
[null,null,null,null,null,null,null,null,null,null,null,null,null,null,null,null,null,null,null,null,null,null,null,null,null,null,475]
[null,null,"SCHEDULE 1",null,"1","2",3,4,5,6,null,null,null,null,null,null,null,null,null,null,null,null,null,null,null,null,476]
[null,null,"REVENUE AND EXPENDITURE SUMMARY",null,null,null,null,null,null,null,null,null,null,null,null,null,null,null,null,null,null,null,null,null,null,null,477]
[null,null,null,null,null,null,"CH 74 VOC-",null,null,null,null,null,null,null,null,null,null,null,null,null,null,null,null,null,null,null,478]
[null,null,"II. EXPENDITURES",null,"REGULAR","SPECIAL","ATIONAL/","OTHER","UNDISTRIB-",null,null,null,null,null,null,null,null,null,null,null,null,null,null,null,null,null,479]
[null,null,"B. BY CITY OR TOWN",null,"DAY","EDUCATION","TECHNICAL","PROGRAMS","UTED","TOTAL",null,null,null,null,null,null,null,null,null,null,null,null,null,null,null,null,480]
[481,null,1900,"School Committee (1110)",null,null,null,null,null,0,null,null,null,null,null,null,null,null,null,null,null,null,null,null,null,null,0]
[482,null,1910,"Business and Finance (1410)",null,null,null,null,null,0,null,null,null,null,null,null,null,null,null,null,null,null,null,null,null,null,0]
[483,null,1912,"Human Resources and Benefits (1420)",null,null,null,null,null,0,null,null,null,null,null,null,null,null,null,null,null,null,null,null,null,null,0]
[484,null,1914,"Legal Services for School Committee (1430)",null,null,null,null,null,0,null,null,null,null,null,null,null,null,null,null,null,null,null,null,null,null,0]
[485,null,1916,"Legal Settlements (1435)",null,null,null,null,null,0,null,null,null,null,null,null,null,null,null,null,null,null,null,null,null,null,0]
[486,null,1920,"District-wide Info Management and Technology (1450)",null,null,null,null,null,0,null,null,null,null,null,null,null,null,null,null,null,null,null,null,null,null,0]
[487,null,1930,"Librarians and Media Center Directors (2340)",null,null,null,null,0,0,null,null,null,null,null,null,null,null,null,null,null,null,null,null,null,null,0]
[488,null,1935,"Other Instructional Materials (2415)",null,null,null,null,0,0,null,null,null,null,null,null,null,null,null,null,null,null,null,null,null,null,0]
[489,null,1940,"Health Services (3200)",null,null,null,null,null,0,null,null,null,null,null,null,null,null,null,null,null,null,null,null,null,null,0]
[490,null,1950,"Pupil Transportation (3300)",null,null,null,null,null,0,null,null,null,null,null,null,null,null,null,null,null,null,null,null,null,null,0]
[491,null,1960,"School Security (3600)",null,null,null,null,null,0,null,null,null,null,null,null,null,null,null,null,null,null,null,null,null,null,0]
[492,null,1970,"School Custodial Services (4110)",null,null,null,null,null,0,null,null,null,null,null,null,null,null,null,null,null,null,null,null,null,null,0]
[493,null,1972,"Heating of School Buildings (4120)",null,null,null,null,null,0,null,null,null,null,null,null,null,null,null,null,null,null,null,null,null,null,0]
[494,null,1974,"School Utility Services (4130)",null,null,null,null,null,0,null,null,null,null,null,null,null,null,null,null,null,null,null,null,null,null,0]
[495,null,1975,"Maintenance of School Grounds (4210)",null,null,null,null,null,0,null,null,null,null,null,null,null,null,null,null,null,null,null,null,null,null,0]
[496,null,1976,"Maintenance of School Buildings (4220)",null,null,null,null,null,0,null,null,null,null,null,null,null,null,null,null,null,null,null,null,null,null,0]
[497,null,1978,"School Building Security System (4225)",null,null,null,null,null,0,null,null,null,null,null,null,null,null,null,null,null,null,null,null,null,null,0]
[498,null,1979,"Maintenance of School Equipment (4230)",null,null,null,null,null,0,null,null,null,null,null,null,null,null,null,null,null,null,null,null,null,null,0]
[499,null,1990,"Extraordinary Maintenance (4300)      ",null,null,null,null,null,0,null,null,null,null,null,null,null,null,null,null,null,null,null,null,null,null,0]
[500,null,1995,"Networking & Telecommunications (4400)",null,null,null,null,null,0,null,null,null,null,null,null,null,null,null,null,null,null,null,null,null,null,0]
[501,null,1996,"Technology Maintenance (4450)",null,null,null,null,null,0,null,null,null,null,null,null,null,null,null,null,null,null,null,null,null,null,0]
[502,null,2000,"Employer Retirement Contributions (5100)",null,null,null,null,null,0,null,null,null,null,null,null,null,null,null,null,null,null,null,null,null,null,0]
[null,null,null,"Employee Separation Costs (5150)",null,null,null,null,null,null,null,null,null,null,null,null,null,null,null,null,null,null,null,null,null,null,503]
[504,null,2003,"Professional Salaries (01)",null,null,null,null,null,0,null,null,null,null,null,null,null,null,null,null,null,null,null,null,null,null,0]
[505,null,2004,"Clerical Salaries (02)",null,null,null,null,null,0,null,null,null,null,null,null,null,null,null,null,null,null,null,null,null,null,0]
[506,null,2005,"Other Salaries (03)",null,null,null,null,null,0,null,null,null,null,null,null,null,null,null,null,null,null,null,null,null,null,0]
[507,null,2006,"Contracted Services (04)",null,null,null,null,null,0,null,null,null,null,null,null,null,null,null,null,null,null,null,null,null,null,0]
[508,null,2007,"Sub-total",null,null,null,null,0,0,null,null,null,null,null,null,null,null,null,null,null,null,null,null,null,null,0]
[509,null,2010,"Insurance For Active Employees (5200)",null,null,null,null,null,0,null,null,null,null,null,null,null,null,null,null,null,null,null,null,null,null,0]
[510,null,2020,"Insurance For Retired School Employees (5250)",null,null,null,null,null,0,null,null,null,null,null,null,null,null,null,null,null,null,null,null,null,null,0]
[511,null,2030,"Other Non-Employee Insurance (5260)",null,null,null,null,null,0,null,null,null,null,null,null,null,null,null,null,null,null,null,null,null,null,0]
[512,null,2040,"Rental-Lease  Equipment (5300)     ",null,null,null,null,null,0,null,null,null,null,null,null,null,null,null,null,null,null,null,null,null,null,0]
[513,null,2050,"Rental-Lease  Buildings (5350)      ",null,null,null,null,null,0,null,null,null,null,null,null,null,null,null,null,null,null,null,null,null,null,0]
[514,null,2060,"Short-Term Interest RAN's (5400)",null,null,null,null,null,0,null,null,null,null,null,null,null,null,null,null,null,null,null,null,null,null,0]
[515,null,2065,"Short Term Interest - BAN's (5450)",null,null,null,null,null,0,null,null,null,null,null,null,null,null,null,null,null,null,null,null,null,null,0]
[516,null,2070,"Other Fixed Charges (5500)",null,null,null,null,null,0,null,null,null,null,null,null,null,null,null,null,null,null,null,null,null,null,0]
[517,null,2075,"School Crossing Guards (5550)",null,null,null,null,null,0,null,null,null,null,null,null,null,null,null,null,null,null,null,null,null,null,0]
[518,null,2080,"Health Non-Public Schools (6800)",null,null,null,null,null,0,null,null,null,null,null,null,null,null,null,null,null,null,null,null,null,null,0]
[519,null,2090,"Transportation Non-Public Schools (6900)",null,null,null,null,null,0,null,null,null,null,null,null,null,null,null,null,null,null,null,null,null,null,0]
[520,null,2100,"Purchase of Land & Buildings (7100, 7200)",null,null,null,null,null,0,null,null,null,null,null,null,null,null,null,null,null,null,null,null,null,null,0]
[521,null,2110,"Equipment (7300, 7400)",null,null,null,null,null,0,null,null,null,null,null,null,null,null,null,null,null,null,null,null,null,null,0]
[522,null,2115,"Capital Technology (7350)",null,null,null,null,null,0,null,null,null,null,null,null,null,null,null,null,null,null,null,null,null,null,0]
[523,null,2120,"Motor Vehicles (7500, 7600)",null,null,null,null,null,0,null,null,null,null,null,null,null,null,null,null,null,null,null,null,null,null,0]
[524,null,2130,"Long-Term Debt Retire/Sch Construction (8100)",null,null,null,null,null,0,null,null,null,null,null,null,null,null,null,null,null,null,null,null,null,null,0]
[525,null,2140,"Long-Term Debt Service/Sch Construction (8200)",null,null,null,null,null,0,null,null,null,null,null,null,null,null,null,null,null,null,null,null,null,null,0]
[526,null,2200,"Long-Term Debt Service/Educ & Other (8400, 8600)",null,null,null,null,null,0,null,null,null,null,null,null,null,null,null,null,null,null,null,null,null,null,0]
[null,null,null,"Payments to Other Districts (9000)",null,null,null,null,null,null,null,null,null,null,null,null,null,null,null,null,null,null,null,null,null,null,527]
[528,null,2210,"Tuition to Mass. Schools (9100)",null,0,null,null,null,0,null,null,null,null,null,null,null,null,null,null,null,null,null,null,null,null,{"$f":"ROW() - A528","v":0}]
[529,null,2220,"School Choice Tuition (9110)",0,0,0,null,null,0,null,null,null,null,null,null,null,null,null,null,null,null,null,null,null,null,0]
[530,null,2230,"Tuition to Commonwealth Charter Schools (9120)",0,0,null,null,null,0,null,null,null,null,null,null,null,null,null,null,null,null,null,null,null,null,0]
[531,null,2235,"Tuition to Horace Mann Charter Schools (9120)",null,null,null,null,null,0,null,null,null,null,null,null,null,null,null,null,null,null,null,null,null,null,0]
[532,null,2240,"Tuition to Out-of-State Schools (9200)",null,null,null,null,null,0,null,null,null,null,null,null,null,null,null,null,null,null,null,null,null,null,0]
[533,null,2250,"Tuition to Non-Public Schools (9300)",null,null,null,null,null,0,null,null,null,null,null,null,null,null,null,null,null,null,null,null,null,null,0]
[534,null,2260,"Tuition to Collaboratives (9400)",null,null,null,null,null,0,null,null,null,null,null,null,null,null,null,null,null,null,null,null,null,null,0]
[535,null,2270,"Regional School Assessment (9500)",null,null,null,null,null,0,null,null,null,null,null,null,null,null,null,null,null,null,null,null,null,null,0]
[536,null,2280,"Sub-total",0,0,0,0,0,0,null,null,null,null,null,null,null,null,null,null,null,null,null,null,null,null,0]
[537,null,2290,"TOTAL EXPENDITURES BY CITY OR TOWN",0,0,0,0,0,0,null,null,null,null,null,null,null,null,null,null,null,null,null,null,null,null,0]
[null,null,null,null,null,null,null,null,null,null,null,null,null,null,null,null,null,null,null,null,null,null,null,null,null,null,538]
[null,null,null,null,null,null,null,null,null,null,null,null,null,null,null,null,null,null,null,null,null,null,null,null,null,null,539]
[null,null,"SCHEDULE 1",null,"1","2","3","4",5,6,7,8,9,10,11,12,null,null,null,null,null,null,null,null,null,null,540]
[null,null,"REVENUE AND EXPENDITURE SUMMARY",null,"                 Federal Grants",null,null,"            State Grants",null,null,"          Revolving and Special Funds",null,null,null,null,null,null,null,null,null,null,null,null,null,null,null,541]
[null,null,"C.2. EXPENDITURES FROM FEDERAL",null,"(intention-","ESE",null,"ESE",null,null,"Private ","Sch Choice",null,null,"  Other  ",null,null,null,null,null,null,null,null,null,null,null,542]
[null,null,"        GRANTS, STATE GRANTS AND",null,"ally left","Admin- ",null,"Admin- ",null,"Circuit","Grants &","& Other Day","Athletic","School","Local",null,null,null,null,null,null,null,null,null,null,null,543]
[null,null,"        SPECIAL FUNDS",null,"blank)","istered","Other","istered","Other","Breaker","Gifts","Tuition","Fund","Lunch","Receipts","Total",null,null,null,null,null,null,null,null,null,null,544]
[null,null,null,null,null,null,null,null,null,null,null,null,null,null,null,null,null,null,null,null,null,null,null,null,null,null,545]
[546,null,2801,"School Committee (1110)",null,null,null,null,null,null,null,null,null,null,null,0,null,null,null,null,null,null,null,null,null,null,0]
[547,null,2802,"Superintendent (1210)",null,null,null,null,null,null,null,null,null,null,null,0,null,null,null,null,null,null,null,null,null,null,0]
[548,null,2803,"Assistant Superintendents (1220)",null,null,null,null,null,null,null,null,null,null,null,0,null,null,null,null,null,null,null,null,null,null,0]
[549,null,2804,"Other District-Wide Administration (1230)",null,null,null,null,null,null,null,null,null,null,null,0,null,null,null,null,null,null,null,null,null,null,0]
[550,null,2805,"Business and Finance (1410)",null,null,null,null,null,null,null,null,null,null,null,0,null,null,null,null,null,null,null,null,null,null,0]
[551,null,2806,"Human Resources and Benefits (1420)",null,null,null,null,null,null,null,15773,null,null,null,15773,null,null,null,null,null,null,null,null,null,null,0]
[552,null,2807,"Legal Service For School Committee (1430)",null,null,null,null,null,null,null,null,null,null,null,0,null,null,null,null,null,null,null,null,null,null,0]
[553,null,2808,"Legal Settlements (1435)",null,null,null,null,null,null,null,null,null,null,null,0,null,null,null,null,null,null,null,null,null,null,0]
[554,null,2809,"District-wide Information Mgmt and Tech (1450)",null,null,null,null,null,null,null,51250,null,null,null,51250,null,null,null,null,null,null,null,null,null,null,0]
[null,null,null,"Instruction",null,null,null,null,null,null,null,null,null,null,null,null,null,null,null,null,null,null,null,null,null,null,555]
[556,null,2810,"Curriculum Directors  (Supervisory) (2110)",null,0,0,0,0,0,0,0,0,null,0,0,null,null,null,null,null,null,null,null,null,null,0]
[557,null,2811,"Department Heads  (Non-Supervisory) (2120)",null,0,0,0,0,0,0,0,0,null,0,0,null,null,null,null,null,null,null,null,null,null,0]
[558,null,2812,"School Leadership-Building (2210)",null,0,0,0,0,0,0,0,0,null,45829,45829,null,null,null,null,null,null,null,null,null,null,0]
[559,null,2813,"Curriculum Leaders/Department Heads-Building Level (2220)",null,0,0,0,0,0,0,0,0,null,0,0,null,null,null,null,null,null,null,null,null,null,0]
[560,null,2814,"Building Technology (2250)",null,0,0,0,0,0,0,0,0,null,0,0,null,null,null,null,null,null,null,null,null,null,0]
[561,null,2815,"Teachers, Classroom (2305)",null,283112,0,0,0,0,0,138097,0,null,110891,532100,null,null,null,null,null,null,null,null,null,null,0]
[562,null,2816,"Teachers, Specialists  (2310)",null,255082,0,7276,0,0,0,0,0,null,0,262358,null,null,null,null,null,null,null,null,null,null,0]
[563,null,2817,"Instructional Coordinators and Team Leaders (2315)",null,5550,0,0,0,0,0,0,0,null,0,5550,null,null,null,null,null,null,null,null,null,null,0]
[564,null,2818,"Medical/ Therapeutic Services (2320)",null,0,0,0,0,0,0,0,0,null,0,0,null,null,null,null,null,null,null,null,null,null,0]
[565,null,2819,"Substitute Teachers (2325)",null,0,0,0,0,0,0,0,0,null,0,0,null,null,null,null,null,null,null,null,null,null,0]
[566,null,2820,"Non-Clerical Paraprofs./Instructional Assistants (2330)",null,75536,0,0,0,0,0,0,0,null,0,75536,null,null,null,null,null,null,null,null,null,null,0]
[567,null,2821,"Librarians and Media Center Directors (2340)",null,0,0,0,0,0,0,0,0,null,0,0,null,null,null,null,null,null,null,null,null,null,0]
[568,null,2822,"Professional Development Leadership (2351)",null,0,0,0,0,0,0,0,0,null,0,0,null,null,null,null,null,null,null,null,null,null,0]
[569,null,2823,"Teacher/Instructional Staff-Professional Days (2353)",null,0,0,0,0,0,0,0,0,null,0,0,null,null,null,null,null,null,null,null,null,null,0]
[570,null,2824,"Substitutes for Instructional Staff at Prof. Development (2355)",null,0,0,0,0,0,0,0,0,null,0,0,null,null,null,null,null,null,null,null,null,null,0]
[571,null,2825,"Prof. Development Stipends, Providers and Expenses (2357)",null,91477,0,0,0,0,0,0,0,null,0,91477,null,null,null,null,null,null,null,null,null,null,0]
[572,null,2826,"Textbooks and Related Software/Media/Materials (2410)",null,2619,0,0,0,0,0,0,0,null,0,2619,null,null,null,null,null,null,null,null,null,null,0]
[573,null,2827,"Other Instructional Materials (2415)",null,9212,0,4624,0,0,0,0,0,null,0,13836,null,null,null,null,null,null,null,null,null,null,0]
[574,null,2828,"Instructional Equipment (2420)",null,16800,0,0,0,0,0,0,0,null,3059,19859,null,null,null,null,null,null,null,null,null,null,0]
[575,null,2829,"General Supplies (2430)",null,0,0,0,0,0,0,21224,0,null,248468,269692,null,null,null,null,null,null,null,null,null,null,0]
[576,null,2830,"Other Instructional Services (2440)",null,0,0,0,0,0,0,0,0,null,20458,20458,null,null,null,null,null,null,null,null,null,null,0]
[577,null,2831,"Classroom Instructional Technology (2451)",null,46639,0,0,0,0,0,0,0,null,1949,48588,null,null,null,null,null,null,null,null,null,null,0]
[578,null,2832,"Other Instructional Hardware  (2453)",null,0,0,0,0,0,0,0,0,null,0,0,null,null,null,null,null,null,null,null,null,null,0]
[579,null,2833,"Instructional Software (2455)",null,0,0,0,0,0,0,0,0,null,0,0,null,null,null,null,null,null,null,null,null,null,0]
[580,null,2834,"Guidance Counselors and Adjustment Counselors (2710)",null,0,0,0,0,0,0,0,0,null,0,0,null,null,null,null,null,null,null,null,null,null,0]
[581,null,2835,"Testing and Assessment (2720)",null,0,0,0,0,0,0,0,0,null,0,0,null,null,null,null,null,null,null,null,null,null,0]
[582,null,2836,"Psychological Services (2800)",null,2800,0,0,0,0,0,0,0,null,2757,5557,null,null,null,null,null,null,null,null,null,null,0]
[583,null,2900,"TOTAL INSTRUCTION (2000)",null,788827,0,11900,0,0,0,159321,0,null,433411,1393459,null,null,null,null,null,null,null,null,null,null,0]
[null,null,null,null,null,null,null,null,null,null,null,null,null,null,null,null,null,null,null,null,null,null,null,null,null,null,584]
[585,null,2910,"Attendance and Parent Liaison Services (3100)",null,1700,null,null,null,null,null,null,null,null,null,1700,null,null,null,null,null,null,null,null,null,null,0]
[586,null,2920,"Medical/Health Services (3200)",null,null,null,null,null,null,2995,null,null,null,null,2995,null,null,null,null,null,null,null,null,null,null,0]
[587,null,2930,"Transportation Services (3300)",null,null,null,null,null,null,null,109222,null,null,null,109222,null,null,null,null,null,null,null,null,null,null,0]
[588,null,2940,"Food Services (3400)",null,null,null,null,null,null,null,null,null,578179,null,578179,null,null,null,null,null,null,null,null,null,null,0]
[589,null,2950,"Athletics (3510)",null,null,null,null,null,null,null,null,6526,null,null,6526,null,null,null,null,null,null,null,null,null,null,0]
[590,null,2960,"Other Student Body Activities (3520)",null,5916,null,19209,null,null,748,93559,null,null,null,119432,null,null,null,null,null,null,null,null,null,null,0]
[591,null,2965,"School Security  (3600)",null,null,null,null,null,null,null,25153,null,null,5988,31141,null,null,null,null,null,null,null,null,null,null,0]
[592,null,2971,"Custodial Services (4110)",null,null,null,null,null,null,null,27200,null,null,null,27200,null,null,null,null,null,null,null,null,null,null,{"$f":"ROW() - A592","v":0}]
[593,null,2972,"Heating of Buildings (4120)",null,null,null,null,null,null,null,null,null,null,null,0,null,null,null,null,null,null,null,null,null,null,0]
[594,null,2973,"Utility Services (4130)",null,null,null,null,null,null,null,null,null,null,28689,28689,null,null,null,null,null,null,null,null,null,null,0]
[595,null,2974,"Maintenance of Grounds (4210)",null,null,null,null,null,null,null,null,null,null,null,0,null,null,null,null,null,null,null,null,null,null,0]
[596,null,2975,"Maintenance of Buildings (4220)",null,null,null,null,null,null,null,18521,null,null,null,18521,null,null,null,null,null,null,null,null,null,null,0]
[597,null,2976,"Building Security System (4225)",null,null,null,null,null,null,null,null,null,null,null,0,null,null,null,null,null,null,null,null,null,null,0]
[598,null,2977,"Maintenance of Equipment (4230)",null,null,null,null,null,null,null,null,null,null,null,0,null,null,null,null,null,null,null,null,null,null,0]
[599,null,2980,"Extraordinary Maintenance (4300)   ",null,null,null,null,null,null,null,null,null,null,null,0,null,null,null,null,null,null,null,null,null,null,0]
[600,null,2982,"Networking and Telecommunications (4400)",null,null,null,null,null,null,null,null,null,null,null,0,null,null,null,null,null,null,null,null,null,null,0]
[601,null,2984,"Technology Maintenance (4450)",null,null,null,null,null,null,null,null,null,null,null,0,null,null,null,null,null,null,null,null,null,null,0]
[602,null,2991,"Employer Retirement Contributions (5100)",null,44661,null,null,null,null,null,null,null,null,null,44661,null,null,null,null,null,null,null,null,null,null,0]
[603,"!",2992,"Employee Separation Costs (5150)",null,null,null,null,null,null,null,null,null,null,null,0,null,null,null,null,null,null,null,null,null,null,0]
[604,null,2993,"Insurance for Active Employees (5200)",null,108236,null,null,null,null,null,48322,null,18966,null,175524,null,null,null,null,null,null,null,null,null,null,0]
[605,null,2994,"Insurance for Retired School Employees (5250)",null,null,null,null,null,null,null,null,null,null,null,0,null,null,null,null,null,null,null,null,null,null,0]
[606,null,2995,"Other Non-Employee Insurance (5260)",null,null,null,null,null,null,null,null,null,null,null,0,null,null,null,null,null,null,null,null,null,null,0]
[607,null,3012,"Rental Lease of Equipment (5300)   ",null,null,null,null,null,null,null,null,null,null,null,0,null,null,null,null,null,null,null,null,null,null,0]
[608,null,3014,"Rental Lease  of Buildings (5350)",null,null,null,null,null,null,null,null,null,null,null,0,null,null,null,null,null,null,null,null,null,null,0]
[609,null,3022,"Short Term Interest RAN's (5400)",null,null,null,null,null,null,null,null,null,null,null,0,null,null,null,null,null,null,null,null,null,null,0]
[610,null,3024,"Short Term Interest BAN'S (5450)",null,null,null,null,null,null,null,null,null,null,null,0,null,null,null,null,null,null,null,null,null,null,0]
[611,null,3026,"Other Fixed Charges (5500)",null,null,null,null,null,null,null,null,null,null,null,0,null,null,null,null,null,null,null,null,null,null,0]
[612,null,3028,"School Crossing Guards (5550)",null,null,null,null,null,null,null,null,null,null,null,0,null,null,null,null,null,null,null,null,null,null,0]
[613,null,3030,"Indirect Cost Transfers",null,null,null,null,null,null,null,null,null,null,null,0,null,null,null,null,null,null,null,null,null,null,0]
[614,null,3042,"Civic Activities And Community Services (6200)",null,null,null,null,null,null,null,null,null,null,null,0,null,null,null,null,null,null,null,null,null,null,0]
[615,null,3044,"Recreation Services (6300)",null,null,null,null,null,null,null,null,null,null,null,0,null,null,null,null,null,null,null,null,null,null,0]
[616,null,3046,"Health Services to Non-Public Schools (6800)",null,null,null,null,null,null,null,null,null,null,null,0,null,null,null,null,null,null,null,null,null,null,0]
[617,null,3048,"Transportation To Non-Public Schools (6900)",null,null,null,null,null,null,null,null,null,null,null,0,null,null,null,null,null,null,null,null,null,null,0]
[618,null,3052,"Purchase of Land & Buildings (7100, 7200)",null,null,null,null,null,null,null,null,null,null,null,0,null,null,null,null,null,null,null,null,null,null,0]
[619,null,3054,"Equipment (7300, 7400)",null,null,null,null,75030,null,null,null,null,null,null,75030,null,null,null,null,null,null,null,null,null,null,0]
[620,null,3056,"Capital Technology (7350)",null,null,null,null,null,null,null,null,null,null,null,0,null,null,null,null,null,null,null,null,null,null,0]
[621,null,3058,"Motor Vehicles (7500, 7600)",null,null,null,null,null,null,null,null,null,null,null,0,null,null,null,null,null,null,null,null,null,null,0]
[622,null,3062,"Debt Retirement/Sch Construction (8100)",null,null,null,null,null,null,null,null,null,null,null,0,null,null,null,null,null,null,null,null,null,null,0]
[623,null,3064,"Debt Service/Sch Construction (8200)",null,null,null,null,null,null,null,null,null,null,null,0,null,null,null,null,null,null,null,null,null,null,0]
[624,null,3066,"Debt Service/Educ. & Other (8400, 8600)",null,null,null,null,null,null,null,null,null,null,null,0,null,null,null,null,null,null,null,null,null,null,0]
[625,null,3072,"Tuition to Mass. Schools (9100)",null,null,null,null,null,null,null,null,null,null,null,0,null,null,null,null,null,null,null,null,null,null,0]
[626,null,3075,"Tuition to Horace Mann Charter Schools (9120)",null,null,null,null,null,null,null,null,null,null,null,0,null,null,null,null,null,null,null,null,null,null,0]
[627,null,3076,"Tuition to Out-of-State Schools (9200)",null,null,null,null,null,null,null,null,null,null,null,0,null,null,null,null,null,null,null,null,null,null,0]
[628,null,3077,"Tuition to Non-Public Schools (9300)",null,null,null,null,null,null,null,null,null,null,null,0,null,null,null,null,null,null,null,null,null,null,0]
[629,null,3078,"Tuition to Collaboratives (9400)",null,null,null,null,null,null,null,null,null,null,null,0,null,null,null,null,null,null,null,null,null,null,0]
[630,null,3080,"TOTAL GRANT & SPECIAL FUND EXPENDITURES",null,949340,0,31109,75030,0,3743,548321,6526,597145,468088,2679302,null,null,null,null,null,null,null,null,null,null,0]
[null,null,null,null,null,null,null,null,null,null,null,null,null,null,null,null,null,null,null,null,null,null,null,null,null,null,631]
[null,null,null,null,null,null,null,null,null,null,null,null,null,null,null,null,null,null,null,null,null,null,null,null,null,null,632]
[null,null,null,null,null,null,null,null,null,null,null,null,null,null,null,null,null,null,null,null,null,null,null,null,null,null,633]
[null,null,"SCHEDULE 2",null,1,2,3,4,5,6,null,"Please mark ",null,null,null,null,null,null,null,null,null,null,null,null,null,null,634]
[null,null,"FY15 ASSESSMENTS RECEIVED FROM MEMBER",null,"MEMBER ","MINIMUM","ADDITIONAL","TRANSP &","CAPITAL &",null,null,"with an \"X\"",null,null,null,null,null,null,null,null,null,null,null,null,null,null,635]
[null,null,"TOWNS OR CITIES OF REGIONAL SCHOOL DISTRICTS",null,"CITY/TOWN","LOCAL CON-","LOCAL CON-","OTHER EX-","DEBT EX-",null,null,"assessment",null,null,null,null,null,null,null,null,null,null,null,null,null,null,636]
[null,null,null,null,"CODE","TRIBUTION","TRIBUTION","PENDITURES","PENDITURES","TOTAL",null,"method used",null,null,null,null,null,null,null,null,null,null,null,null,null,null,637]
[null,null,null,"MEMBER CITY/TOWN NAME",null,null,null,null,null,null,null,"for FY15",null,null,null,null,null,null,null,null,null,null,null,null,null,null,638]
[639,null,"3100","AMESBURY                     ","007",720862,140962,36934,41041,939799,null,null,null,null,null,null,null,null,null,null,null,null,null,null,null,null,0]
[640,null,"3110","GEORGETOWN                   ","105",401654,74373,19487,23870,519384,null,null,null,null,null,null,null,null,null,null,null,null,null,null,null,null,0]
[641,null,"3120","GROVELAND                    ","116",714582,139017,36424,17749,907772,null,"(Check only one)",null,null,null,null,null,null,null,null,null,null,null,null,null,null,0]
[642,null,"3130","HAVERHILL                    ","128",5423680,1447676,379309,148763,7399428,null,null,null,null,null,null,null,null,null,null,null,null,null,null,null,null,0]
[643,null,"3140","IPSWICH                      ","144",329244,47564,12462,33033,422303,"statutory  ","X",null,null,null,null,null,null,null,null,null,null,null,null,null,null,0]
[644,null,"3150","MERRIMAC                     ","180",492415,102911,26964,18134,640424,null,null,null,null,null,null,null,null,null,null,null,null,null,null,null,null,0]
[645,null,"3160","NEWBURY                      ","203",259702,36105,9460,15092,320359,"agreement  ",null,null,null,null,null,null,null,null,null,null,null,null,null,null,null,0]
[646,null,"3170","NEWBURYPORT                  ","204",248342,36105,9460,42966,336873,null,null,null,null,null,null,null,null,null,null,null,null,null,null,null,null,0]
[647,null,"3180","ROWLEY                       ","254",146332,22917,6005,15246,190500,null,null,null,null,null,null,null,null,null,null,null,null,null,null,null,null,0]
[648,null,"3190","SALISBURY                    ","259",626553,89507,23452,15554,755066,null,null,null,null,null,null,null,null,null,null,null,null,null,null,null,null,0]
[649,null,"3200","WEST NEWBURY                 ","329",160320,24863,6514,13552,205249,null,null,null,null,null,null,null,null,null,null,null,null,null,null,null,null,0]
[650,null,"3210",null,null,null,null,null,null,0,null,null,null,null,null,null,null,null,null,null,null,null,null,null,null,null,0]
[651,null,"3220",null,null,null,null,null,null,0,null,null,null,null,null,null,null,null,null,null,null,null,null,null,null,null,0]
[652,null,"3230",null,null,null,null,null,null,0,null,null,null,null,null,null,null,null,null,null,null,null,null,null,null,null,0]
[653,null,"3240",null,null,null,null,null,null,0,null,null,null,null,null,null,null,null,null,null,null,null,null,null,null,null,0]
[654,null,"3250",null,null,null,null,null,null,0,null,null,null,null,null,null,null,null,null,null,null,null,null,null,null,null,0]
[655,null,"3260",null,null,null,null,null,null,0,null,null,null,null,null,null,null,null,null,null,null,null,null,null,null,null,0]
[656,null,"3270",null,null,null,null,null,null,0,null,null,null,null,null,null,null,null,null,null,null,null,null,null,null,null,{"$f":"ROW() - A656","v":0}]
[657,null,"3280",null,null,null,null,null,null,0,null,null,null,null,null,null,null,null,null,null,null,null,null,null,null,null,0]
[658,null,"3290",null,null,null,null,null,null,0,null,null,null,null,null,null,null,null,null,null,null,null,null,null,null,null,0]
[659,null,"3300",null,null,null,null,null,null,0,null,null,null,null,null,null,null,null,null,null,null,null,null,null,null,null,0]
[660,null,"3310",null,null,null,null,null,null,0,null,null,null,null,null,null,null,null,null,null,null,null,null,null,null,null,0]
[661,null,"3320",null,null,null,null,null,null,0,null,null,null,null,null,null,null,null,null,null,null,null,null,null,null,null,0]
[662,null,"3330",null,null,null,null,null,null,0,null,null,null,null,null,null,null,null,null,null,null,null,null,null,null,null,0]
[663,null,"3340",null,null,null,null,null,null,0,null,null,null,null,null,null,null,null,null,null,null,null,null,null,null,null,0]
[664,null,"3350",null,null,null,null,null,null,0,"Difference",null,null,null,null,null,null,null,null,null,null,null,null,null,null,null,0]
[665,null,"3360",null,null,null,null,null,null,0,"from Sched 1",null,null,null,null,null,null,null,null,null,null,null,null,null,null,null,0]
[666,null,"3370","TOTAL ASSESSMENTS RECEIVED FROM MEMBERS",null,9523686,2162000,566471,385000,12637157,0,null,null,null,null,null,null,null,null,null,null,null,null,null,null,null,0]
[null,null,null,null,null,null,null,null,null,null,null,null,null,null,null,null,null,null,null,null,null,null,null,null,null,null,667]
[null,null,null,null,null,null,null,null,null,null,null,null,null,null,null,null,null,null,null,null,null,null,null,null,null,null,668]
[null,null,null,"SCHEDULE 3","1","2",3,4,5,6,7,null,null,null,null,null,null,null,null,null,null,null,null,null,null,null,669]
[null,null,null,"INSTRUCTIONAL EXPENDITURES",null,null,null,null,null,null,null,null,null,null,null,null,null,null,null,null,null,null,null,null,null,null,670]
[null,null,null,null,null,null,"CH 74 VOC-",null,null,null,"CITY/TOWN",null,null,null,null,null,null,null,null,null,null,null,null,null,null,null,671]
[null,null,null,null,"REGULAR","SPECIAL","ATIONAL/","OTHER","UNDISTRIB-",null,"APPRO-",null,null,null,null,null,null,null,null,null,null,null,null,null,null,null,672]
[null,null,null,"I.  GENERAL FUND","DAY","EDUCATION","TECHNICAL","PROGRAMS","UTED","TOTAL","PRIATION",null,null,null,null,null,null,null,null,null,null,null,null,null,null,null,673]
[null,null,null,"Curriculum Directors  (Supervisory) (2110)",null,null,null,null,null,null,null,null,null,null,null,null,null,null,null,null,null,null,null,null,null,null,674]
[675,null,3401,"Professional Salaries (01)",0,133533,251556,0,null,385089,null,null,null,null,null,null,null,null,null,null,null,null,null,null,null,null,0]
[676,null,3402,"Clerical Salaries (02)",0,0,94419,0,null,94419,null,null,null,null,null,null,null,null,null,null,null,null,null,null,null,null,0]
[677,null,3403,"Other Salaries (03)",0,0,0,0,null,0,null,null,null,null,null,null,null,null,null,null,null,null,null,null,null,null,0]
[678,null,3404,"Contracted Services (04)",0,0,0,0,null,0,null,null,null,null,null,null,null,null,null,null,null,null,null,null,null,null,0]
[679,null,3405,"Supplies and Materials (05)",0,0,0,0,null,0,null,null,null,null,null,null,null,null,null,null,null,null,null,null,null,null,0]
[680,null,3406,"Other Expenses (06)",0,0,0,0,null,0,null,null,null,null,null,null,null,null,null,null,null,null,null,null,null,null,0]
[681,null,3409,"Sub-total",0,133533,345975,0,null,479508,null,null,null,null,null,null,null,null,null,null,null,null,null,null,null,null,0]
[null,null,null,"Department Heads  (Non-Supervisory) (2120)",null,null,null,null,null,null,null,null,null,null,null,null,null,null,null,null,null,null,null,null,null,null,682]
[683,null,3411,"Professional Salaries (01)",0,0,70663,0,null,70663,null,null,null,null,null,null,null,null,null,null,null,null,null,null,null,null,0]
[684,null,3412,"Clerical Salaries (02)",0,0,0,0,null,0,null,null,null,null,null,null,null,null,null,null,null,null,null,null,null,null,0]
[685,null,3413,"Other Salaries (03)",0,0,0,0,null,0,null,null,null,null,null,null,null,null,null,null,null,null,null,null,null,null,0]
[686,null,3414,"Contracted Services (04)",0,0,0,0,null,0,null,null,null,null,null,null,null,null,null,null,null,null,null,null,null,null,0]
[687,null,3415,"Supplies and Materials (05)",0,0,0,0,null,0,null,null,null,null,null,null,null,null,null,null,null,null,null,null,null,null,0]
[688,null,3416,"Other Expenses (06)",0,0,0,0,null,0,null,null,null,null,null,null,null,null,null,null,null,null,null,null,null,null,0]
[689,null,3419,"Sub-total",0,0,70663,0,null,70663,null,null,null,null,null,null,null,null,null,null,null,null,null,null,null,null,0]
[null,null,null,"School Leadership-Building (2210)",null,null,null,null,null,null,null,null,null,null,null,null,null,null,null,null,null,null,null,null,null,null,690]
[691,null,3421,"Professional Salaries (01)",null,null,null,null,558798,558798,null,null,null,null,null,null,null,null,null,null,null,null,null,null,null,null,0]
[692,null,3422,"Clerical Salaries (02)",null,null,null,null,92801,92801,null,null,null,null,null,null,null,null,null,null,null,null,null,null,null,null,0]
[693,null,3423,"Other Salaries (03)",null,null,null,null,0,0,null,null,null,null,null,null,null,null,null,null,null,null,null,null,null,null,0]
[694,null,3424,"Contracted Services (04)",null,null,null,null,5500,5500,null,null,null,null,null,null,null,null,null,null,null,null,null,null,null,null,0]
[695,null,3425,"Supplies and Materials (05)",null,null,null,null,14186,14186,null,null,null,null,null,null,null,null,null,null,null,null,null,null,null,null,0]
[696,null,3426,"Other Expenses (06)",null,null,null,null,1460,1460,null,null,null,null,null,null,null,null,null,null,null,null,null,null,null,null,0]
[697,null,3429,"Sub-total",null,null,null,null,672745,672745,null,null,null,null,null,null,null,null,null,null,null,null,null,null,null,null,0]
[null,null,null,"School Curriculum Leaders/Department Heads-Building Level (2220)",null,null,null,null,null,null,null,null,null,null,null,null,null,null,null,null,null,null,null,null,null,null,698]
[699,null,3431,"Professional Salaries (01)",0,0,0,0,null,0,null,null,null,null,null,null,null,null,null,null,null,null,null,null,null,null,0]
[700,null,3432,"Clerical Salaries (02)",0,0,0,0,null,0,null,null,null,null,null,null,null,null,null,null,null,null,null,null,null,null,0]
[701,null,3433,"Other Salaries (03)",0,0,0,0,null,0,null,null,null,null,null,null,null,null,null,null,null,null,null,null,null,null,0]
[702,null,3434,"Contracted Services (04)",0,0,0,0,null,0,null,null,null,null,null,null,null,null,null,null,null,null,null,null,null,null,0]
[703,null,3435,"Supplies and Materials (05)",0,0,0,0,null,0,null,null,null,null,null,null,null,null,null,null,null,null,null,null,null,null,0]
[704,null,3436,"Other Expenses (06)",0,0,0,0,null,0,null,null,null,null,null,null,null,null,null,null,null,null,null,null,null,null,0]
[705,null,3439,"Sub-total",0,0,0,0,null,0,null,null,null,null,null,null,null,null,null,null,null,null,null,null,null,null,0]
[null,null,null,"Building Technology (2250)",null,null,null,null,null,null,null,null,null,null,null,null,null,null,null,null,null,null,null,null,null,null,706]
[707,null,3441,"Professional Salaries (01)",null,null,null,null,0,0,null,null,null,null,null,null,null,null,null,null,null,null,null,null,null,null,0]
[708,null,3442,"Clerical Salaries (02)",null,null,null,null,0,0,null,null,null,null,null,null,null,null,null,null,null,null,null,null,null,null,0]
[709,null,3443,"Other Salaries (03)",null,null,null,null,0,0,null,null,null,null,null,null,null,null,null,null,null,null,null,null,null,null,0]
[710,null,3444,"Contracted Services (04)",null,null,null,null,0,0,null,null,null,null,null,null,null,null,null,null,null,null,null,null,null,null,0]
[711,null,3445,"Supplies and Materials (05)",null,null,null,null,0,0,null,null,null,null,null,null,null,null,null,null,null,null,null,null,null,null,0]
[712,null,3446,"Other Expenses (06)",null,null,null,null,0,0,null,null,null,null,null,null,null,null,null,null,null,null,null,null,null,null,0]
[713,null,3449,"Sub-total",null,null,null,null,0,0,null,null,null,null,null,null,null,null,null,null,null,null,null,null,null,null,0]
[null,null,null,"Teachers, Classroom (2305)",null,null,null,null,null,null,null,null,null,null,null,null,null,null,null,null,null,null,null,null,null,null,714]
[715,null,3450,"Professional Salaries (01)",0,787807,7463922,0,null,8251729,null,null,null,null,null,null,null,null,null,null,null,null,null,null,null,null,0]
[null,null,null,"Teachers, Specialists  (2310)",null,null,null,null,null,null,null,null,null,null,null,null,null,null,null,null,null,null,null,null,null,null,716]
[717,null,3451,"Professional Salaries (01)",0,0,0,0,null,0,null,null,null,null,null,null,null,null,null,null,null,null,null,null,null,null,0]
[null,null,null,"Instructional Coordinators and Team Leaders (Non-Supervisory) (2315)",null,null,null,null,null,null,null,null,null,null,null,null,null,null,null,null,null,null,null,null,null,null,718]
[719,null,3461,"Professional Salaries (01)",0,0,0,0,null,0,null,null,null,null,null,null,null,null,null,null,null,null,null,null,null,null,0]
[720,null,3462,"Clerical Salaries (02)",0,0,0,0,null,0,null,null,null,null,null,null,null,null,null,null,null,null,null,null,null,null,{"$f":"ROW() - A720","v":0}]
[721,null,3463,"Other Salaries (03)",0,0,0,0,null,0,null,null,null,null,null,null,null,null,null,null,null,null,null,null,null,null,0]
[722,null,3464,"Sub-total",0,0,0,0,null,0,null,null,null,null,null,null,null,null,null,null,null,null,null,null,null,null,0]
[null,null,null,"Medical/ Therapeutic Services (2320)",null,null,null,null,null,null,null,null,null,null,null,null,null,null,null,null,null,null,null,null,null,null,723]
[724,null,3465,"Professional Salaries (01)",0,0,0,0,null,0,null,null,null,null,null,null,null,null,null,null,null,null,null,null,null,null,0]
[725,null,3466,"Clerical Salaries (02)",0,0,0,0,null,0,null,null,null,null,null,null,null,null,null,null,null,null,null,null,null,null,0]
[726,null,3467,"Other Salaries (03)",0,0,0,0,null,0,null,null,null,null,null,null,null,null,null,null,null,null,null,null,null,null,0]
[727,null,3468,"Contracted Services (04)",0,0,0,0,null,0,null,null,null,null,null,null,null,null,null,null,null,null,null,null,null,null,0]
[728,null,3469,"Sub-total",0,0,0,0,null,0,null,null,null,null,null,null,null,null,null,null,null,null,null,null,null,null,0]
[null,null,null,"Substitute Teachers (2325)",null,null,null,null,null,null,null,null,null,null,null,null,null,null,null,null,null,null,null,null,null,null,729]
[730,null,3470,"Other Salaries (03)",0,8618,81671,0,null,90289,null,null,null,null,null,null,null,null,null,null,null,null,null,null,null,null,0]
[731,null,3471,"Contracted Services (04)",0,0,0,0,null,0,null,null,null,null,null,null,null,null,null,null,null,null,null,null,null,null,0]
[732,null,3472,"Sub-total",0,8618,81671,0,null,90289,null,null,null,null,null,null,null,null,null,null,null,null,null,null,null,null,0]
[null,null,null,"All Non-Clerical Paraprofessionals/Instructional Assistants (2330)",null,null,null,null,null,null,null,null,null,null,null,null,null,null,null,null,null,null,null,null,null,null,733]
[734,null,3473,"Other Salaries (03)",0,57794,28397,0,null,86191,null,null,null,null,null,null,null,null,null,null,null,null,null,null,null,null,0]
[735,null,3474,"Contracted Services (04)",0,0,0,0,null,0,null,null,null,null,null,null,null,null,null,null,null,null,null,null,null,null,0]
[736,null,3475,"Sub-total",0,57794,28397,0,null,86191,null,null,null,null,null,null,null,null,null,null,null,null,null,null,null,null,0]
[null,null,null,"Librarians and Media Center Directors (2340)",null,null,null,null,null,null,null,null,null,null,null,null,null,null,null,null,null,null,null,null,null,null,737]
[738,null,3476,"Professional Salaries (01)",null,null,null,null,89327,89327,0,null,null,null,null,null,null,null,null,null,null,null,null,null,null,null,0]
[739,null,3477,"Clerical Salaries (02)",null,null,null,null,0,0,0,null,null,null,null,null,null,null,null,null,null,null,null,null,null,null,0]
[740,null,3478,"Other Salaries (03)",null,null,null,null,0,0,0,null,null,null,null,null,null,null,null,null,null,null,null,null,null,null,0]
[741,null,3479,"Sub-total",null,null,null,null,89327,89327,0,null,null,null,null,null,null,null,null,null,null,null,null,null,null,null,0]
[null,null,null,"Professional Development Leadership (2351)",null,null,null,null,null,null,null,null,null,null,null,null,null,null,null,null,null,null,null,null,null,null,742]
[743,null,3481,"Professional Salaries (01)",null,null,null,null,0,0,null,null,null,null,null,null,null,null,null,null,null,null,null,null,null,null,0]
[744,null,3482,"Clerical Salaries (02)",null,null,null,null,0,0,null,null,null,null,null,null,null,null,null,null,null,null,null,null,null,null,0]
[745,null,3485,"Supplies and Materials (05)",null,null,null,null,0,0,null,null,null,null,null,null,null,null,null,null,null,null,null,null,null,null,0]
[746,null,3486,"Other Expenses (06)",null,null,null,null,0,0,null,null,null,null,null,null,null,null,null,null,null,null,null,null,null,null,0]
[747,null,3489,"Sub-total",null,null,null,null,0,0,null,null,null,null,null,null,null,null,null,null,null,null,null,null,null,null,0]
[null,null,null,"Teacher/Instructional Staff-Professional Days (2353)",null,null,null,null,null,null,null,null,null,null,null,null,null,null,null,null,null,null,null,null,null,null,748]
[749,null,3491,"Professional Salaries (01)",0,4377,41477,0,null,45854,null,null,null,null,null,null,null,null,null,null,null,null,null,null,null,null,0]
[750,null,3492,"Other Salaries (03)",0,0,0,0,null,0,null,null,null,null,null,null,null,null,null,null,null,null,null,null,null,null,0]
[751,null,3493,"Sub-total",0,4377,41477,0,null,45854,null,null,null,null,null,null,null,null,null,null,null,null,null,null,null,null,0]
[null,null,null,"Substitutes for Teachers/Instructional Staff at Prof. Development (2355)",null,null,null,null,null,null,null,null,null,null,null,null,null,null,null,null,null,null,null,null,null,null,752]
[753,null,3494,"Other Salaries (03)",0,1224,11596,0,null,12820,null,null,null,null,null,null,null,null,null,null,null,null,null,null,null,null,0]
[null,null,null,"Professional Development Stipends, Providers and Expenses (2357)",null,null,null,null,null,null,null,null,null,null,null,null,null,null,null,null,null,null,null,null,null,null,754]
[755,null,3495,"Professional Salaries (01)",0,0,0,0,null,0,null,null,null,null,null,null,null,null,null,null,null,null,null,null,null,null,0]
[756,null,3496,"Contracted Services (04)",0,0,0,0,null,0,null,null,null,null,null,null,null,null,null,null,null,null,null,null,null,null,0]
[757,null,3497,"Supplies and Materials (05)",0,0,0,0,null,0,null,null,null,null,null,null,null,null,null,null,null,null,null,null,null,null,0]
[758,null,3498,"Other Expenses (06)",0,9344,88550,0,null,97894,null,null,null,null,null,null,null,null,null,null,null,null,null,null,null,null,0]
[759,null,3499,"Sub-total",0,9344,88550,0,null,97894,null,null,null,null,null,null,null,null,null,null,null,null,null,null,null,null,0]
[null,null,null,"Textbooks and Related Software/Media/Materials (2410)",null,null,null,null,null,null,null,null,null,null,null,null,null,null,null,null,null,null,null,null,null,null,760]
[761,null,3504,"Contracted Services (04)",0,0,0,0,null,0,null,null,null,null,null,null,null,null,null,null,null,null,null,null,null,null,0]
[762,null,3505,"Supplies and Materials (05)",0,0,13257,0,null,13257,null,null,null,null,null,null,null,null,null,null,null,null,null,null,null,null,0]
[763,null,3506,"Other Expenses (06)",0,0,0,0,null,0,null,null,null,null,null,null,null,null,null,null,null,null,null,null,null,null,0]
[764,null,3509,"Sub-total",0,0,13257,0,null,13257,null,null,null,null,null,null,null,null,null,null,null,null,null,null,null,null,0]
[null,null,null,"Other Instructional Materials (2415)",null,null,null,null,null,null,null,null,null,null,null,null,null,null,null,null,null,null,null,null,null,null,765]
[766,null,3514,"Contracted Services (04)",0,0,0,0,null,0,0,null,null,null,null,null,null,null,null,null,null,null,null,null,null,null,0]
[767,null,3515,"Supplies and Materials (05)",0,0,7004,0,null,7004,0,null,null,null,null,null,null,null,null,null,null,null,null,null,null,null,0]
[768,null,3516,"Other Expenses (06)",0,0,3150,0,null,3150,0,null,null,null,null,null,null,null,null,null,null,null,null,null,null,null,0]
[769,null,3519,"Sub-total",0,0,10154,0,null,10154,0,null,null,null,null,null,null,null,null,null,null,null,null,null,null,null,0]
[null,null,null,"Instructional Equipment (2420)",null,null,null,null,null,null,null,null,null,null,null,null,null,null,null,null,null,null,null,null,null,null,770]
[771,null,3524,"Contracted Services (04)",0,0,0,0,null,0,null,null,null,null,null,null,null,null,null,null,null,null,null,null,null,null,0]
[772,null,3525,"Supplies and Materials (05)",0,0,169837,0,null,169837,null,null,null,null,null,null,null,null,null,null,null,null,null,null,null,null,0]
[773,null,3526,"Other Expenses (06)",0,0,0,0,null,0,null,null,null,null,null,null,null,null,null,null,null,null,null,null,null,null,0]
[774,null,3529,"Sub-total",0,0,169837,0,null,169837,null,null,null,null,null,null,null,null,null,null,null,null,null,null,null,null,0]
[null,null,null,"General Supplies (2430)",null,null,null,null,null,null,null,null,null,null,null,null,null,null,null,null,null,null,null,null,null,null,775]
[776,null,3535,"Supplies and Materials (05)",0,0,473767,0,null,473767,null,null,null,null,null,null,null,null,null,null,null,null,null,null,null,null,0]
[null,null,null,"Other Instructional Services (2440)",null,null,null,null,null,null,null,null,null,null,null,null,null,null,null,null,null,null,null,null,null,null,777]
[778,null,3540,"Other Salaries (03)",0,0,0,0,null,0,null,null,null,null,null,null,null,null,null,null,null,null,null,null,null,null,0]
[779,null,3541,"Contracted Services (04)",0,0,0,0,null,0,null,null,null,null,null,null,null,null,null,null,null,null,null,null,null,null,0]
[780,null,3542,"Supplies and Materials (05)",0,0,0,0,null,0,null,null,null,null,null,null,null,null,null,null,null,null,null,null,null,null,0]
[781,null,3543,"Other Expenses (06)",0,0,0,0,null,0,null,null,null,null,null,null,null,null,null,null,null,null,null,null,null,null,0]
[782,null,3544,"Sub-total",0,0,0,0,null,0,null,null,null,null,null,null,null,null,null,null,null,null,null,null,null,null,0]
[null,null,null,"Classroom Instructional Technology (2451)",null,null,null,null,null,null,null,null,null,null,null,null,null,null,null,null,null,null,null,null,null,null,783]
[784,null,3545,"Contracted Services (04)",0,0,0,0,null,0,null,null,null,null,null,null,null,null,null,null,null,null,null,null,null,null,{"$f":"ROW() - A784","v":0}]
[785,null,3546,"Supplies and Materials (05)",0,0,494343,0,null,494343,null,null,null,null,null,null,null,null,null,null,null,null,null,null,null,null,0]
[786,null,3547,"Other Expenses (06)",0,0,0,0,null,0,null,null,null,null,null,null,null,null,null,null,null,null,null,null,null,null,0]
[787,null,3548,"Sub-total",0,0,494343,0,null,494343,null,null,null,null,null,null,null,null,null,null,null,null,null,null,null,null,0]
[null,null,null,"Other Instructional Hardware  (2453)",null,null,null,null,null,null,null,null,null,null,null,null,null,null,null,null,null,null,null,null,null,null,788]
[789,null,3549,"Contracted Services (04)",null,null,null,null,0,0,null,null,null,null,null,null,null,null,null,null,null,null,null,null,null,null,0]
[790,null,3550,"Supplies and Materials (05)",null,null,null,null,0,0,null,null,null,null,null,null,null,null,null,null,null,null,null,null,null,null,0]
[791,null,3551,"Other Expenses (06)",null,null,null,null,0,0,null,null,null,null,null,null,null,null,null,null,null,null,null,null,null,null,0]
[792,null,3552,"Sub-total",null,null,null,null,0,0,null,null,null,null,null,null,null,null,null,null,null,null,null,null,null,null,0]
[null,null,null,"Instructional Software (2455)",null,null,null,null,null,null,null,null,null,null,null,null,null,null,null,null,null,null,null,null,null,null,793]
[794,null,3553,"Contracted Services (04)",null,null,null,null,70793,70793,null,null,null,null,null,null,null,null,null,null,null,null,null,null,null,null,0]
[795,null,3554,"Supplies and Materials (05)",null,null,null,null,0,0,null,null,null,null,null,null,null,null,null,null,null,null,null,null,null,null,0]
[796,null,3555,"Other Expenses (06)",null,null,null,null,0,0,null,null,null,null,null,null,null,null,null,null,null,null,null,null,null,null,0]
[797,null,3556,"Sub-total",null,null,null,null,70793,70793,null,null,null,null,null,null,null,null,null,null,null,null,null,null,null,null,0]
[null,null,null,"Guidance including Guidance Counselors and Adjustment Counselors (2710)",null,null,null,null,null,null,null,null,null,null,null,null,null,null,null,null,null,null,null,null,null,null,798]
[799,null,3561,"Professional Salaries (01)",0,0,390240,0,null,390240,null,null,null,null,null,null,null,null,null,null,null,null,null,null,null,null,0]
[800,null,3562,"Clerical Salaries (02)",0,0,45198,0,null,45198,null,null,null,null,null,null,null,null,null,null,null,null,null,null,null,null,0]
[801,null,3563,"Other Salaries (03)",0,0,0,0,null,0,null,null,null,null,null,null,null,null,null,null,null,null,null,null,null,null,0]
[802,null,3564,"Contracted Services (04)",0,0,0,0,null,0,null,null,null,null,null,null,null,null,null,null,null,null,null,null,null,null,0]
[803,null,3565,"Supplies and Materials (05)",0,0,4570,0,null,4570,null,null,null,null,null,null,null,null,null,null,null,null,null,null,null,null,0]
[804,null,3566,"Other Expenses (06)",0,0,45,0,null,45,null,null,null,null,null,null,null,null,null,null,null,null,null,null,null,null,0]
[805,null,3569,"Sub-total",0,0,440053,0,null,440053,null,null,null,null,null,null,null,null,null,null,null,null,null,null,null,null,0]
[null,null,null,"Testing and Assessment (2720)",null,null,null,null,null,null,null,null,null,null,null,null,null,null,null,null,null,null,null,null,null,null,806]
[807,null,3571,"Professional Salaries (01)",0,0,0,0,null,0,null,null,null,null,null,null,null,null,null,null,null,null,null,null,null,null,0]
[808,null,3572,"Clerical Salaries (02)",0,0,0,0,null,0,null,null,null,null,null,null,null,null,null,null,null,null,null,null,null,null,0]
[809,null,3573,"Other Salaries (03)",0,0,0,0,null,0,null,null,null,null,null,null,null,null,null,null,null,null,null,null,null,null,0]
[810,null,3574,"Contracted Services (04)",0,0,0,0,null,0,null,null,null,null,null,null,null,null,null,null,null,null,null,null,null,null,0]
[811,null,3575,"Supplies and Materials (05)",0,0,0,0,null,0,null,null,null,null,null,null,null,null,null,null,null,null,null,null,null,null,0]
[812,null,3576,"Other Expenses (06)",0,0,0,0,null,0,null,null,null,null,null,null,null,null,null,null,null,null,null,null,null,null,0]
[813,null,3579,"Sub-total",0,0,0,0,null,0,null,null,null,null,null,null,null,null,null,null,null,null,null,null,null,null,0]
[null,null,null,"Psychological Services (2800)",null,null,null,null,null,null,null,null,null,null,null,null,null,null,null,null,null,null,null,null,null,null,814]
[815,null,3581,"Professional Salaries (01)",0,74942,0,0,null,74942,null,null,null,null,null,null,null,null,null,null,null,null,null,null,null,null,0]
[816,null,3582,"Clerical Salaries (02)",0,0,0,0,null,0,null,null,null,null,null,null,null,null,null,null,null,null,null,null,null,null,0]
[817,null,3583,"Other Salaries (03)",0,0,0,0,null,0,null,null,null,null,null,null,null,null,null,null,null,null,null,null,null,null,0]
[818,null,3584,"Contracted Services (04)",0,32833,0,0,null,32833,null,null,null,null,null,null,null,null,null,null,null,null,null,null,null,null,0]
[819,null,3585,"Supplies and Materials (05)",0,11148,0,0,null,11148,null,null,null,null,null,null,null,null,null,null,null,null,null,null,null,null,0]
[820,null,3586,"Other Expenses (06)",0,975,0,0,null,975,null,null,null,null,null,null,null,null,null,null,null,null,null,null,null,null,0]
[821,null,3589,"Sub-total",0,119898,0,0,null,119898,null,null,null,null,null,null,null,null,null,null,null,null,null,null,null,null,0]
[822,null,3599,"TOTAL INSTRUCTIONAL SERVICES",0,1122595,9733662,0,832865,11689122,0,null,null,null,null,null,null,null,null,null,null,null,null,null,null,null,0]
[null,null,null,null,null,null,null,null,null,null,null,null,null,null,null,null,null,null,null,null,null,null,null,null,null,null,823]
[null,null,null,null,null,null,null,null,null,null,null,null,null,null,null,null,null,null,null,null,null,null,null,null,null,null,824]
[null,null,null,"SCHEDULE 3",null,null,null,null,null,null,null,null,null,null,null,null,null,null,null,null,null,null,null,null,null,null,825]
[null,null,null,"INSTRUCTIONAL EXPENDITURES",8,9,10,11,12,13,14,15,16,17,18,null,null,null,null,null,null,null,null,null,null,null,826]
[null,null,null,null,"                 Federal Grants",null,null,"            State Grants",null,null,"     Revolving and Special Funds",null,null,null,null,null,null,null,null,null,null,null,null,null,null,null,827]
[null,null,null,null,"(intention-","Other ESE-",null,"ESE",null,null,"Private ","Sch Choice",null,"Other  ",null,null,null,null,null,null,null,null,null,null,null,null,828]
[null,null,null,null,"ally left","Administered",null,"Admin- ",null,"Circuit","Grants &","& Other Day","Athletic","Local",null,null,null,null,null,null,null,null,null,null,null,null,829]
[null,null,null,"II GRANTS AND OTHER FUNDING SOURCES","blank)","Grants","Other","istered","Other","Breaker","Gifts","Tuition","Fund","Receipts","Total",null,null,null,null,null,null,null,null,null,null,null,830]
[null,null,null,"Curriculum Directors  (Supervisory) (2110)",null,null,null,null,null,null,null,null,null,null,null,null,null,null,null,null,null,null,null,null,null,null,831]
[832,null,3601,"Professional Salaries (01)",null,0,0,0,0,0,0,0,0,0,385089,null,null,null,null,null,null,null,null,null,null,null,0]
[833,null,3602,"Clerical Salaries (02)",null,0,0,0,0,0,0,0,0,0,94419,null,null,null,null,null,null,null,null,null,null,null,0]
[834,null,3603,"Other Salaries (03)",null,0,0,0,0,0,0,0,0,0,0,null,null,null,null,null,null,null,null,null,null,null,0]
[835,null,3604,"Contracted Services (04)",null,0,0,0,0,0,0,0,0,0,0,null,null,null,null,null,null,null,null,null,null,null,0]
[836,null,3605,"Supplies and Materials (05)",null,0,0,0,0,0,0,0,0,0,0,null,null,null,null,null,null,null,null,null,null,null,0]
[837,null,3606,"Other Expenses (06)",null,0,0,0,0,0,0,0,0,0,0,null,null,null,null,null,null,null,null,null,null,null,0]
[838,null,3609,"Sub-total",null,0,0,0,0,0,0,0,0,0,479508,null,null,null,null,null,null,null,null,null,null,null,0]
[null,null,null,"Department Heads  (Non-Supervisory) (2120)",null,null,null,null,null,null,null,null,null,null,null,null,null,null,null,null,null,null,null,null,null,null,839]
[840,null,3611,"Professional Salaries (01)",null,0,0,0,0,0,0,0,0,0,70663,null,null,null,null,null,null,null,null,null,null,null,0]
[841,null,3612,"Clerical Salaries (02)",null,0,0,0,0,0,0,0,0,0,0,null,null,null,null,null,null,null,null,null,null,null,0]
[842,null,3613,"Other Salaries (03)",null,0,0,0,0,0,0,0,0,0,0,null,null,null,null,null,null,null,null,null,null,null,0]
[843,null,3614,"Contracted Services (04)",null,0,0,0,0,0,0,0,0,0,0,null,null,null,null,null,null,null,null,null,null,null,0]
[844,null,3615,"Supplies and Materials (05)",null,0,0,0,0,0,0,0,0,0,0,null,null,null,null,null,null,null,null,null,null,null,0]
[845,null,3616,"Other Expenses (06)",null,0,0,0,0,0,0,0,0,0,0,null,null,null,null,null,null,null,null,null,null,null,0]
[846,null,3619,"Sub-total",null,0,0,0,0,0,0,0,0,0,70663,null,null,null,null,null,null,null,null,null,null,null,0]
[null,null,null,"School Leadership-Building (2210)",null,null,null,null,null,null,null,null,null,null,null,null,null,null,null,null,null,null,null,null,null,null,847]
[848,null,3621,"Professional Salaries (01)",null,0,0,0,0,0,0,0,0,33933,592731,null,null,null,null,null,null,null,null,null,null,null,{"$f":"ROW() - A848","v":0}]
[849,null,3622,"Clerical Salaries (02)",null,0,0,0,0,0,0,0,0,2672,95473,null,null,null,null,null,null,null,null,null,null,null,0]
[850,null,3623,"Other Salaries (03)",null,0,0,0,0,0,0,0,0,9224,9224,null,null,null,null,null,null,null,null,null,null,null,0]
[851,null,3624,"Contracted Services (04)",null,0,0,0,0,0,0,0,0,0,5500,null,null,null,null,null,null,null,null,null,null,null,0]
[852,null,3625,"Supplies and Materials (05)",null,0,0,0,0,0,0,0,0,0,14186,null,null,null,null,null,null,null,null,null,null,null,0]
[853,null,3626,"Other Expenses (06)",null,0,0,0,0,0,0,0,0,0,1460,null,null,null,null,null,null,null,null,null,null,null,0]
[854,null,3629,"Sub-total",null,0,0,0,0,0,0,0,0,45829,718574,null,null,null,null,null,null,null,null,null,null,null,0]
[null,null,null,"School Curriculum Leaders/Department Heads-Building Level (2220)",null,null,null,null,null,null,null,null,null,null,null,null,null,null,null,null,null,null,null,null,null,null,855]
[856,null,3631,"Professional Salaries (01)",null,0,0,0,0,0,0,0,0,0,0,null,null,null,null,null,null,null,null,null,null,null,0]
[857,null,3632,"Clerical Salaries (02)",null,0,0,0,0,0,0,0,0,0,0,null,null,null,null,null,null,null,null,null,null,null,0]
[858,null,3633,"Other Salaries (03)",null,0,0,0,0,0,0,0,0,0,0,null,null,null,null,null,null,null,null,null,null,null,0]
[859,null,3634,"Contracted Services (04)",null,0,0,0,0,0,0,0,0,0,0,null,null,null,null,null,null,null,null,null,null,null,0]
[860,null,3635,"Supplies and Materials (05)",null,0,0,0,0,0,0,0,0,0,0,null,null,null,null,null,null,null,null,null,null,null,0]
[861,null,3636,"Other Expenses (06)",null,0,0,0,0,0,0,0,0,0,0,null,null,null,null,null,null,null,null,null,null,null,0]
[862,null,3639,"Sub-total",null,0,0,0,0,0,0,0,0,0,0,null,null,null,null,null,null,null,null,null,null,null,0]
[null,null,null,"Building Technology (2250)",null,null,null,null,null,null,null,null,null,null,null,null,null,null,null,null,null,null,null,null,null,null,863]
[864,null,3641,"Professional Salaries (01)",null,0,0,0,0,0,0,0,0,0,0,null,null,null,null,null,null,null,null,null,null,null,0]
[865,null,3642,"Clerical Salaries (02)",null,0,0,0,0,0,0,0,0,0,0,null,null,null,null,null,null,null,null,null,null,null,0]
[866,null,3643,"Other Salaries (03)",null,0,0,0,0,0,0,0,0,0,0,null,null,null,null,null,null,null,null,null,null,null,0]
[867,null,3644,"Contracted Services (04)",null,0,0,0,0,0,0,0,0,0,0,null,null,null,null,null,null,null,null,null,null,null,0]
[868,null,3645,"Supplies and Materials (05)",null,0,0,0,0,0,0,0,0,0,0,null,null,null,null,null,null,null,null,null,null,null,0]
[869,null,3646,"Other Expenses (06)",null,0,0,0,0,0,0,0,0,0,0,null,null,null,null,null,null,null,null,null,null,null,0]
[870,null,3649,"Sub-total",null,0,0,0,0,0,0,0,0,0,0,null,null,null,null,null,null,null,null,null,null,null,0]
[null,null,null,"Teachers, Classroom (2305)",null,null,null,null,null,null,null,null,null,null,null,null,null,null,null,null,null,null,null,null,null,null,871]
[872,null,3650,"Professional Salaries (01)",null,283112,0,0,0,0,0,138097,0,110891,8783829,null,null,null,null,null,null,null,null,null,null,null,0]
[null,null,null,"Teachers, Specialists  (2310)",null,null,null,null,null,null,null,null,null,null,null,null,null,null,null,null,null,null,null,null,null,null,873]
[874,null,3651,"Professional Salaries (01)",null,255082,0,7276,0,0,0,0,0,0,262358,null,null,null,null,null,null,null,null,null,null,null,0]
[null,null,null,"Instructional Coordinators and Team Leaders (Non-Supervisory) (2315)",null,null,null,null,null,null,null,null,null,null,null,null,null,null,null,null,null,null,null,null,null,null,875]
[876,null,3661,"Professional Salaries (01)",null,5550,0,0,0,0,0,0,0,0,5550,null,null,null,null,null,null,null,null,null,null,null,0]
[877,null,3662,"Clerical Salaries (02)",null,0,0,0,0,0,0,0,0,0,0,null,null,null,null,null,null,null,null,null,null,null,0]
[878,null,3663,"Other Salaries (03)",null,0,0,0,0,0,0,0,0,0,0,null,null,null,null,null,null,null,null,null,null,null,0]
[879,null,3664,"Sub-total",null,5550,0,0,0,0,0,0,0,0,5550,null,null,null,null,null,null,null,null,null,null,null,0]
[null,null,null,"Medical/ Therapeutic Services (2320)",null,null,null,null,null,null,null,null,null,null,null,null,null,null,null,null,null,null,null,null,null,null,880]
[881,null,3665,"Professional Salaries (01)",null,0,0,0,0,0,0,0,0,0,0,null,null,null,null,null,null,null,null,null,null,null,0]
[882,null,3666,"Clerical Salaries (02)",null,0,0,0,0,0,0,0,0,0,0,null,null,null,null,null,null,null,null,null,null,null,0]
[883,null,3667,"Other Salaries (03)",null,0,0,0,0,0,0,0,0,0,0,null,null,null,null,null,null,null,null,null,null,null,0]
[884,null,3668,"Contracted Services (04)",null,0,0,0,0,0,0,0,0,0,0,null,null,null,null,null,null,null,null,null,null,null,0]
[885,null,3669,"Sub-total",null,0,0,0,0,0,0,0,0,0,0,null,null,null,null,null,null,null,null,null,null,null,0]
[null,null,null,"Substitute Teachers (2325)",null,null,null,null,null,null,null,null,null,null,null,null,null,null,null,null,null,null,null,null,null,null,886]
[887,null,3670,"Other Salaries (03)",null,0,0,0,0,0,0,0,0,0,90289,null,null,null,null,null,null,null,null,null,null,null,0]
[888,null,3671,"Contracted Services (04)",null,0,0,0,0,0,0,0,0,0,0,null,null,null,null,null,null,null,null,null,null,null,0]
[889,null,3672,"Sub-total",null,0,0,0,0,0,0,0,0,0,90289,null,null,null,null,null,null,null,null,null,null,null,0]
[null,null,null,"All Non-Clerical Paraprofessionals/Instructional Assistants (2330)",null,null,null,null,null,null,null,null,null,null,null,null,null,null,null,null,null,null,null,null,null,null,890]
[891,null,3673,"Other Salaries (03)",null,75536,0,0,0,0,0,0,0,0,161727,null,null,null,null,null,null,null,null,null,null,null,0]
[892,null,3674,"Contracted Services (04)",null,0,0,0,0,0,0,0,0,0,0,null,null,null,null,null,null,null,null,null,null,null,0]
[893,null,3675,"Sub-total",null,75536,0,0,0,0,0,0,0,0,161727,null,null,null,null,null,null,null,null,null,null,null,0]
[null,null,null,"Librarians and Media Center Directors (2340)",null,null,null,null,null,null,null,null,null,null,null,null,null,null,null,null,null,null,null,null,null,null,894]
[895,null,3676,"Professional Salaries (01)",null,0,0,0,0,0,0,0,0,0,89327,null,null,null,null,null,null,null,null,null,null,null,0]
[896,null,3677,"Clerical Salaries (02)",null,0,0,0,0,0,0,0,0,0,0,null,null,null,null,null,null,null,null,null,null,null,0]
[897,null,3678,"Other Salaries (03)",null,0,0,0,0,0,0,0,0,0,0,null,null,null,null,null,null,null,null,null,null,null,0]
[898,null,3679,"Sub-total",null,0,0,0,0,0,0,0,0,0,89327,null,null,null,null,null,null,null,null,null,null,null,0]
[null,null,null,"Professional Development Leadership (2351)",null,null,null,null,null,null,null,null,null,null,null,null,null,null,null,null,null,null,null,null,null,null,899]
[900,null,3681,"Professional Salaries (01)",null,0,0,0,0,0,0,0,0,0,0,null,null,null,null,null,null,null,null,null,null,null,0]
[901,null,3682,"Clerical Salaries (02)",null,0,0,0,0,0,0,0,0,0,0,null,null,null,null,null,null,null,null,null,null,null,0]
[902,null,3685,"Supplies and Materials (05)",null,0,0,0,0,0,0,0,0,0,0,null,null,null,null,null,null,null,null,null,null,null,0]
[903,null,3686,"Other Expenses (06)",null,0,0,0,0,0,0,0,0,0,0,null,null,null,null,null,null,null,null,null,null,null,0]
[904,null,3689,"Sub-total",null,0,0,0,0,0,0,0,0,0,0,null,null,null,null,null,null,null,null,null,null,null,0]
[null,null,null,"Teacher/Instructional Staff-Professional Days (2353)",null,null,null,null,null,null,null,null,null,null,null,null,null,null,null,null,null,null,null,null,null,null,905]
[906,null,3691,"Professional Salaries (01)",null,0,0,0,0,0,0,0,0,0,45854,null,null,null,null,null,null,null,null,null,null,null,0]
[907,null,3692,"Other Salaries (03)",null,0,0,0,0,0,0,0,0,0,0,null,null,null,null,null,null,null,null,null,null,null,0]
[908,null,3693,"Sub-total",null,0,0,0,0,0,0,0,0,0,45854,null,null,null,null,null,null,null,null,null,null,null,0]
[null,null,null,"Substitutes for Teachers/Instructional Staff at Prof. Development (2355)",null,null,null,null,null,null,null,null,null,null,null,null,null,null,null,null,null,null,null,null,null,null,909]
[910,null,3694,"Other Salaries (03)",null,0,0,0,0,0,0,0,0,0,12820,null,null,null,null,null,null,null,null,null,null,null,0]
[null,null,null,"Professional Development Stipends, Providers and Expenses (2357)",null,null,null,null,null,null,null,null,null,null,null,null,null,null,null,null,null,null,null,null,null,null,911]
[912,null,3695,"Professional Salaries (01)",null,49920,0,0,0,0,0,0,0,0,49920,null,null,null,null,null,null,null,null,null,null,null,{"$f":"ROW() - A912","v":0}]
[913,null,3696,"Contracted Services (04)",null,32043,0,0,0,0,0,0,0,0,32043,null,null,null,null,null,null,null,null,null,null,null,0]
[914,null,3697,"Supplies and Materials (05)",null,0,0,0,0,0,0,0,0,0,0,null,null,null,null,null,null,null,null,null,null,null,0]
[915,null,3698,"Other Expenses (06)",null,9514,0,0,0,0,0,0,0,0,107408,null,null,null,null,null,null,null,null,null,null,null,0]
[916,null,3699,"Sub-total",null,91477,0,0,0,0,0,0,0,0,189371,null,null,null,null,null,null,null,null,null,null,null,0]
[null,null,null,"Textbooks and Related Software/Media/Materials (2410)",null,null,null,null,null,null,null,null,null,null,null,null,null,null,null,null,null,null,null,null,null,null,917]
[918,null,3704,"Contracted Services (04)",null,0,0,0,0,0,0,0,0,0,0,null,null,null,null,null,null,null,null,null,null,null,0]
[919,null,3705,"Supplies and Materials (05)",null,2619,0,0,0,0,0,0,0,0,15876,null,null,null,null,null,null,null,null,null,null,null,0]
[920,null,3706,"Other Expenses (06)",null,0,0,0,0,0,0,0,0,0,0,null,null,null,null,null,null,null,null,null,null,null,0]
[921,null,3709,"Sub-total",null,2619,0,0,0,0,0,0,0,0,15876,null,null,null,null,null,null,null,null,null,null,null,0]
[null,null,null,"Other Instructional Materials (2415)",null,null,null,null,null,null,null,null,null,null,null,null,null,null,null,null,null,null,null,null,null,null,922]
[923,null,3714,"Contracted Services (04)",null,0,0,0,0,0,0,0,0,0,0,null,null,null,null,null,null,null,null,null,null,null,0]
[924,null,3715,"Supplies and Materials (05)",null,9212,0,4624,0,0,0,0,0,0,20840,null,null,null,null,null,null,null,null,null,null,null,0]
[925,null,3716,"Other Expenses (06)",null,0,0,0,0,0,0,0,0,0,3150,null,null,null,null,null,null,null,null,null,null,null,0]
[926,null,3719,"Sub-total",null,9212,0,4624,0,0,0,0,0,0,23990,null,null,null,null,null,null,null,null,null,null,null,0]
[null,null,null,"Instructional Equipment (2420)",null,null,null,null,null,null,null,null,null,null,null,null,null,null,null,null,null,null,null,null,null,null,927]
[928,null,3724,"Contracted Services (04)",null,0,0,0,0,0,0,0,0,0,0,null,null,null,null,null,null,null,null,null,null,null,0]
[929,null,3725,"Supplies and Materials (05)",null,0,0,0,0,0,0,0,0,0,169837,null,null,null,null,null,null,null,null,null,null,null,0]
[930,null,3726,"Other Expenses (06)",null,16800,0,0,0,0,0,0,0,3059,19859,null,null,null,null,null,null,null,null,null,null,null,0]
[931,null,3729,"Sub-total",null,16800,0,0,0,0,0,0,0,3059,189696,null,null,null,null,null,null,null,null,null,null,null,0]
[null,null,null,"General Supplies (2430)",null,null,null,null,null,null,null,null,null,null,null,null,null,null,null,null,null,null,null,null,null,null,932]
[933,null,3735,"Supplies and Materials (05)",null,0,0,0,0,0,0,21224,0,248468,743459,null,null,null,null,null,null,null,null,null,null,null,0]
[null,null,null,"Other Instructional Services (2440)",null,null,null,null,null,null,null,null,null,null,null,null,null,null,null,null,null,null,null,null,null,null,934]
[935,null,3740,"Other Salaries (03)",null,0,0,0,0,0,0,0,0,0,0,null,null,null,null,null,null,null,null,null,null,null,0]
[936,null,3741,"Contracted Services (04)",null,0,0,0,0,0,0,0,0,0,0,null,null,null,null,null,null,null,null,null,null,null,0]
[937,null,3742,"Supplies and Materials (05)",null,0,0,0,0,0,0,0,0,0,0,null,null,null,null,null,null,null,null,null,null,null,0]
[938,null,3743,"Other Expenses (06)",null,0,0,0,0,0,0,0,0,20458,20458,null,null,null,null,null,null,null,null,null,null,null,0]
[939,null,3744,"Sub-total",null,0,0,0,0,0,0,0,0,20458,20458,null,null,null,null,null,null,null,null,null,null,null,0]
[null,null,null,"Classroom Instructional Technology (2451)",null,null,null,null,null,null,null,null,null,null,null,null,null,null,null,null,null,null,null,null,null,null,940]
[941,null,3745,"Contracted Services (04)",null,0,0,0,0,0,0,0,0,1949,1949,null,null,null,null,null,null,null,null,null,null,null,0]
[942,null,3746,"Supplies and Materials (05)",null,46639,0,0,0,0,0,0,0,0,540982,null,null,null,null,null,null,null,null,null,null,null,0]
[943,null,3747,"Other Expenses (06)",null,0,0,0,0,0,0,0,0,0,0,null,null,null,null,null,null,null,null,null,null,null,0]
[944,null,3748,"Sub-total",null,46639,0,0,0,0,0,0,0,1949,542931,null,null,null,null,null,null,null,null,null,null,null,0]
[null,null,null,"Other Instructional Hardware  (2453)",null,null,null,null,null,null,null,null,null,null,null,null,null,null,null,null,null,null,null,null,null,null,945]
[946,null,3749,"Contracted Services (04)",null,0,0,0,0,0,0,0,0,0,0,null,null,null,null,null,null,null,null,null,null,null,0]
[947,null,3750,"Supplies and Materials (05)",null,0,0,0,0,0,0,0,0,0,0,null,null,null,null,null,null,null,null,null,null,null,0]
[948,null,3751,"Other Expenses (06)",null,0,0,0,0,0,0,0,0,0,0,null,null,null,null,null,null,null,null,null,null,null,0]
[949,null,3752,"Sub-total",null,0,0,0,0,0,0,0,0,0,0,null,null,null,null,null,null,null,null,null,null,null,0]
[null,null,null,"Instructional Software (2455)",null,null,null,null,null,null,null,null,null,null,null,null,null,null,null,null,null,null,null,null,null,null,950]
[951,null,3753,"Contracted Services (04)",null,0,0,0,0,0,0,0,0,0,70793,null,null,null,null,null,null,null,null,null,null,null,0]
[952,null,3754,"Supplies and Materials (05)",null,0,0,0,0,0,0,0,0,0,0,null,null,null,null,null,null,null,null,null,null,null,0]
[953,null,3755,"Other Expenses (06)",null,0,0,0,0,0,0,0,0,0,0,null,null,null,null,null,null,null,null,null,null,null,0]
[954,null,3756,"Sub-total",null,0,0,0,0,0,0,0,0,0,70793,null,null,null,null,null,null,null,null,null,null,null,0]
[null,null,null,"Guidance including Guidance Counselors and Adjustment Counselors (2710)",null,null,null,null,null,null,null,null,null,null,null,null,null,null,null,null,null,null,null,null,null,null,955]
[956,null,3761,"Professional Salaries (01)",null,0,0,0,0,0,0,0,0,0,390240,null,null,null,null,null,null,null,null,null,null,null,0]
[957,null,3762,"Clerical Salaries (02)",null,0,0,0,0,0,0,0,0,0,45198,null,null,null,null,null,null,null,null,null,null,null,0]
[958,null,3763,"Other Salaries (03)",null,0,0,0,0,0,0,0,0,0,0,null,null,null,null,null,null,null,null,null,null,null,0]
[959,null,3764,"Contracted Services (04)",null,0,0,0,0,0,0,0,0,0,0,null,null,null,null,null,null,null,null,null,null,null,0]
[960,null,3765,"Supplies and Materials (05)",null,0,0,0,0,0,0,0,0,0,4570,null,null,null,null,null,null,null,null,null,null,null,0]
[961,null,3766,"Other Expenses (06)",null,0,0,0,0,0,0,0,0,0,45,null,null,null,null,null,null,null,null,null,null,null,0]
[962,null,3769,"Sub-total",null,0,0,0,0,0,0,0,0,0,440053,null,null,null,null,null,null,null,null,null,null,null,0]
[null,null,null,"Testing and Assessment (2720)",null,null,null,null,null,null,null,null,null,null,null,null,null,null,null,null,null,null,null,null,null,null,963]
[964,null,3771,"Professional Salaries (01)",null,0,0,0,0,0,0,0,0,0,0,null,null,null,null,null,null,null,null,null,null,null,0]
[965,null,3772,"Clerical Salaries (02)",null,0,0,0,0,0,0,0,0,0,0,null,null,null,null,null,null,null,null,null,null,null,0]
[966,null,3773,"Other Salaries (03)",null,0,0,0,0,0,0,0,0,0,0,null,null,null,null,null,null,null,null,null,null,null,0]
[967,null,3774,"Contracted Services (04)",null,0,0,0,0,0,0,0,0,0,0,null,null,null,null,null,null,null,null,null,null,null,0]
[968,null,3775,"Supplies and Materials (05)",null,0,0,0,0,0,0,0,0,0,0,null,null,null,null,null,null,null,null,null,null,null,0]
[969,null,3776,"Other Expenses (06)",null,0,0,0,0,0,0,0,0,0,0,null,null,null,null,null,null,null,null,null,null,null,0]
[970,null,3779,"Sub-total",null,0,0,0,0,0,0,0,0,0,0,null,null,null,null,null,null,null,null,null,null,null,0]
[null,null,null,"Psychological Services (2800)",null,null,null,null,null,null,null,null,null,null,null,null,null,null,null,null,null,null,null,null,null,null,971]
[972,null,3781,"Professional Salaries (01)",null,2800,0,0,0,0,0,0,0,0,77742,null,null,null,null,null,null,null,null,null,null,null,0]
[973,null,3782,"Clerical Salaries (02)",null,0,0,0,0,0,0,0,0,0,0,null,null,null,null,null,null,null,null,null,null,null,0]
[974,null,3783,"Other Salaries (03)",null,0,0,0,0,0,0,0,0,0,0,null,null,null,null,null,null,null,null,null,null,null,0]
[975,null,3784,"Contracted Services (04)",null,0,0,0,0,0,0,0,0,2757,35590,null,null,null,null,null,null,null,null,null,null,null,0]
[976,null,3785,"Supplies and Materials (05)",null,0,0,0,0,0,0,0,0,0,11148,null,null,null,null,null,null,null,null,null,null,null,{"$f":"ROW() - A976","v":0}]
[977,null,3786,"Other Expenses (06)",null,0,0,0,0,0,0,0,0,0,975,null,null,null,null,null,null,null,null,null,null,null,0]
[978,null,3789,"Sub-total",null,2800,0,0,0,0,0,0,0,2757,125455,null,null,null,null,null,null,null,null,null,null,null,0]
[979,null,3799,"TOTAL INSTRUCTIONAL SERVICES",null,788827,0,11900,0,0,0,159321,0,433411,13082581,null,null,null,null,null,null,null,null,null,null,null,0]
[null,null,null,null,null,null,null,null,null,null,null,null,null,null,null,null,null,null,null,null,null,null,null,null,null,null,980]
[null,null,null,null,null,null,null,null,null,null,null,null,null,null,null,null,null,null,null,null,null,null,null,null,null,null,981]
[null,null,null,"SCHEDULE 4",1,"2","3",4,5,6,7,8,9,null,null,null,null,null,null,null,null,null,null,null,null,null,982]
[null,null,null,"SPECIAL EDUCATION EXPENDITURES ","3-5 Yr. Olds","Age 6-21","Age 6-21","Age 6-21","Age 6-21",null,"Age 6-21",null,null,null,null,null,null,null,null,null,null,null,null,null,null,null,983]
[null,null,null,"BY PLACEMENT","all","Public School","Public","Private","Private","Age 6-21","Public",null,null,null,null,null,null,null,null,null,null,null,null,null,null,null,984]
[null,null,null,null,"placements","Programs","Separate","Separate","Residential","Homebound/","Residential","Screening ",null,null,null,null,null,null,null,null,null,null,null,null,null,null,985]
[null,null,null,"EXPENDITURES BY SCHOOL COMMITTEE,","(doe032--","(doe034-10,","Day School","Day School","School","Hospital","Institution","and Team",null,null,null,null,null,null,null,null,null,null,null,null,null,null,986]
[null,null,null,"CITY OR TOWN, AND CIRCUIT BREAKER","30 - 48)","20, & 40)","(doe034-41)","(doe034-50)","(doe034-60)","(doe034-70)","(doe034-90)","Evaluation","TOTAL",null,null,null,null,null,null,null,null,null,null,null,null,null,987]
[null,null,null,"Instructional Services(2000)",null,null,null,null,null,null,null,null,null,null,null,null,null,null,null,null,null,null,null,null,null,null,988]
[989,null,"3810","Supervisory (2100)",null,133533,null,null,null,null,null,null,133533,null,null,null,null,null,null,null,null,null,null,null,null,null,0]
[990,null,3815,"School Building Leadership (2200)",null,null,null,null,null,null,null,null,0,null,null,null,null,null,null,null,null,null,null,null,null,null,0]
[991,null,"3820","Teaching (2300)",null,869164,null,null,null,null,null,null,869164,null,null,null,null,null,null,null,null,null,null,null,null,null,0]
[992,null,"3830","Textbooks & Instructional Equipment (2400)",null,null,null,null,null,null,null,null,0,null,null,null,null,null,null,null,null,null,null,null,null,null,0]
[993,null,"3840","Guidance (2700)",null,null,null,null,null,null,null,null,0,null,null,null,null,null,null,null,null,null,null,null,null,null,0]
[994,null,"3850","Psychological (2800)",null,119898,null,null,null,null,null,null,119898,null,null,null,null,null,null,null,null,null,null,null,null,null,0]
[995,null,"3860","TOTAL INSTRUCTIONAL SERVICES",0,1122595,0,0,0,0,0,0,1122595,null,null,null,null,null,null,null,null,null,null,null,null,null,0]
[996,null,"3870","Non-Public Health Services (6800)",null,null,null,null,null,null,null,null,0,null,null,null,null,null,null,null,null,null,null,null,null,null,0]
[null,null,null,"Payments to Other Districts (9000)",null,null,null,null,null,null,null,null,null,null,null,null,null,null,null,null,null,null,null,null,null,null,997]
[998,null,"3880","Tuition to Mass. Schools (9100)",null,null,null,null,null,null,0,null,0,null,null,null,null,null,null,null,null,null,null,null,null,null,0]
[999,null,3885,"School Choice Tuition (9110) ",0,4038,0,0,0,0,0,null,4038,null,null,null,null,null,null,null,null,null,null,null,null,null,0]
[1000,null,3887,"Tuition to Commonwealth Charter Schools (9120) ",null,0,null,null,null,null,null,null,0,null,null,null,null,null,null,null,null,null,null,null,null,null,0]
[1001,null,3888,"Tuition to Horace Mann Charter Schools (9120)",null,null,null,null,null,null,null,null,0,null,null,null,null,null,null,null,null,null,null,null,null,null,0]
[1002,null,"3890","Tuition to Out-of-State Schools (9200)",null,null,null,null,null,null,null,null,0,null,null,null,null,null,null,null,null,null,null,null,null,null,0]
[1003,null,"3900","Tuition to Private Schools (9300)",null,null,null,null,null,null,null,null,0,null,null,null,null,null,null,null,null,null,null,null,null,null,0]
[1004,null,"3910","Tuition to Collaboratives (9400)",null,31101,null,null,null,null,null,null,31101,null,null,null,null,null,null,null,null,null,null,null,null,null,0]
[1005,null,"3920","TOTAL TUITION",0,35139,0,0,0,0,0,0,35139,null,null,null,null,null,null,null,null,null,null,null,null,null,0]
[1006,null,"3930","EXP FROM GRANTS, REVOLVING FUNDS (NOT CB)",null,374628,null,null,null,null,null,null,374628," ",null,null,null,null,null,null,null,null,null,null,null,null,0]
[1007,null,"3950","TOTAL EXPENDITURES ",0,1532362,0,0,0,0,0,0,1532362,null,null,null,null,null,null,null,null,null,null,null,null,null,0]
[null,null,null,null,null,null,null,null,null,null,null,null,null,null,null,null,null,null,null,null,null,null,null,null,null,null,1008]
[null,null,null,"SCHEDULE 7","EXPENDITURES (Report Whole Dollars)",null,null,null,null,"RIDERS",null,null,null,null,null,null,null,null,null,null,null,null,null,null,null,null,1009]
[null,null,null,null,"1","2","3","4","5","6","7","8","9",null,null,null,null,null,null,null,null,null,null,null,null,null,1010]
[null,null,null,null,null,null,null,null,null,null,null,null,null,null,null,null,null,null,null,null,null,null,null,null,null,null,1011]
[null,null,null,"PUPIL TRANSPORTATION REIMBURSEMENT","          REIMBURSABLE",null,"NON-REIM-  BURSABLE",null,null,"           REIMBURSABLE",null,"NON-REIM-  BURSABLE",null,null,null,null,null,null,null,null,null,null,null,null,null,null,1012]
[null,null,null,"FUNCTIONS 3300, 6900","      EXPENDITURES FOR PUPILS",null,"EXPENDITURES",null,null,"         REGULAR DAY RIDERS",null,"REGULAR DAY",null,null,null,null,null,null,null,null,null,null,null,null,null,null,1013]
[null,null,null,null,"   TRANSPORTED AT LEAST 1 1/2",null,"FOR PUPILS ","DEPRE-",null,"   TRANSPORTED AT LEAST 1 1/2",null,"RIDERS TRANS-","TOTAL",null,null,null,null,null,null,null,null,null,null,null,null,null,1014]
[null,null,null,null,"    MILES TO AND FROM SCHOOL",null,"TRANSPORTED","CIATION","TOTAL","    MILES TO AND FROM SCHOOL",null,"PORTED LESS",null,null,null,null,null,null,null,null,null,null,null,null,null,null,1015]
[null,null,null,null,"SCHOOL TRANS","BY PUBLIC","LESS THAN 1 1/2","(See  "," (Sum of","SCHOOL TRANS","BY PUBLIC","THAN 1 1/2 MILES"," (Sum of",null,null,null,null,null,null,null,null,null,null,null,null,null,1016]
[null,null,null,null,"VEHICLE","UTILITIES","MILES FROM SCH"," instructions)","  1 thru 4)","VEHICLE","UTILITIES","FROM SCHOOL","  6 thru 8)",null,null,null,null,null,null,null,null,null,null,null,null,null,1017]
[null,null,null,"REGULAR EDUCATION",null,null,null,null,null,null,null,null,null,null,null,null,null,null,null,null,null,null,null,null,null,null,1018]
[1019,null,"4000","Within the District",null,null,null,null,0,null,null,null,0,null,null,null,null,null,null,null,null,null,null,null,null,null,0]
[1020,null,"4010","Outside the District",null,null,null,null,0,null,null,null,0,null,null,null,null,null,null,null,null,null,null,null,null,null,0]
[1021,null,"4020","To and from Regular Pre-School",null,null,null,null,0,null,null,null,0,null,null,null,null,null,null,null,null,null,null,null,null,null,0]
[1022,null,"4040","TOTAL REGULAR EDUCATION",0,0,0,0,0,0,0,0,0,null,null,null,null,null,null,null,null,null,null,null,null,null,0]
[null,null,null,null,null,null,null,null,null,null,null,null,null,null,null,null,null,null,null,null,null,null,null,null,null,null,1023]
[null,null,null,null,null,null,null,null,null,null,null,null,null,null,null,null,null,null,null,null,null,null,null,null,null,null,1024]
[null,null,null,"SPECIAL EDUCATION","EXPENDITURES FOR SPECIAL EDUCATION PUPILS TRANSPORTED WITHIN THE DISTRICT","EXPENDITURES FOR SPECIAL EDUCATION PUPILS TRANSPORTED OUTSIDE THE DISTRICT",null,"DEPRECIATION (See instructions)","TOTAL EXPENDITURES (Sum of columns 1 thru 4)","SPECIAL EDUCATION RIDERS TRANSPORTED WITHIN THE DISTRICT","SPECIAL EDUCATION RIDERS TRANSPORTED OUTSIDE THE DISTRICT",null,"TOTAL SPECIAL EDUCATION RIDERS (Sum of cols 6 and 7)",null,null,null,null,null,null,null,null,null,null,null,null,null,1025]
[1026,null,"4070","3-5 yr olds, all placements (doe032)",null,null,null,null,0,null,null,null,0,null,null,null,null,null,null,null,null,null,null,null,null,null,0]
[1027,null,"4080","age 6-21, public school programs (doe034-10, 20, & 40)",null,14892,null,null,14892,null,4,null,4,null,null,null,null,null,null,null,null,null,null,null,null,null,0]
[1028,null,"4110","age 6-21, public separate day school (doe034-41)",null,null,null,null,0,null,null,null,0,null,null,null,null,null,null,null,null,null,null,null,null,null,0]
[1029,null,4120,"age 6-21, ages, private separate day school (doe034-50)",null,null,null,null,0,null,null,null,0,null,null,null,null,null,null,null,null,null,null,null,null,null,0]
[1030,null,4130,"age 6-21, private residential school (doe034-60)",null,null,null,null,0,null,null,null,0,null,null,null,null,null,null,null,null,null,null,null,null,null,0]
[1031,null,4140,"age 6-21, homebound/hospital (doe034-70)",null,null,null,null,0,null,null,null,0,null,null,null,null,null,null,null,null,null,null,null,null,null,0]
[1032,null,4150,"age 6-21, public residential institutions (doe034-90)",null,null,null,null,0,null,null,null,0,null,null,null,null,null,null,null,null,null,null,null,null,null,0]
[1033,null,4160,"  TOTAL SPECIAL EDUCATION",0,14892,null,0,14892,0,4,null,4,null,null,null,null,null,null,null,null,null,null,null,null,null,0]
[null,null,null,null,null,null,null,null,null,null,null,null,null,null,null,null,null,null,null,null,null,null,null,null,null,null,1034]
[null,null,null,null,"             REIMBURSABLE",null,"NON-REIM-  BURSABLE",null,null,"          REIMBURSABLE",null,"NON-REIM-    BURSABLE",null,null,null,null,null,null,null,null,null,null,null,null,null,null,1035]
[null,null,null,null," EXPENDITURES FOR VOCATIONAL",null,"EXPENDITURES",null,null,"         VOCATIONAL RIDERS",null," VOCATIONAL",null,null,null,null,null,null,null,null,null,null,null,null,null,null,1036]
[null,null,null,null," PUPILS TRANSPORTED AT LEAST",null,"FOR VOCATIONAL ","DEPRE-",null,"    TRANSPORTED AT LEAST 1 1/2",null,"RIDERS TRANS-","TOTAL",null,null,null,null,null,null,null,null,null,null,null,null,null,1037]
[null,null,null,null,"   1 1/2 MILES TO & FROM SCHOOL",null,"PUPILS TRANS-","CIATION","TOTAL","     MILES TO AND FROM SCHOOL",null,"PORTED LESS",null,null,null,null,null,null,null,null,null,null,null,null,null,null,1038]
[null,null,null,null,"SCHOOL TRANS","BY PUBLIC","PORTED < 1.5 ","(See  "," (Sum of","SCHOOL TRANS","BY PUBLIC","THAN 1 1/2 MILES"," (Sum of",null,null,null,null,null,null,null,null,null,null,null,null,null,1039]
[null,null,null,"CH 74 VOCATIONAL/TECHNICAL PROGRAMS","VEHICLE","UTILITIES","MILES FROM SCH"," instructions)","  1 thru 4)","VEHICLE","UTILITIES","FROM SCHOOL","  6 thru 8)",null,null,null,null,null,null,null,null,null,null,null,null,null,{"$f":"ROW() - A1040","v":1040}]
[1041,null,"4190","Within the District",1095690,null,null,175388,1271078,892,null,null,892,null,null,null,null,null,null,null,null,null,null,null,null,null,0]
[1042,null,"4200","Outside the District",null,null,null,null,0,null,null,null,0,null,null,null,null,null,null,null,null,null,null,null,null,null,0]
[null,null,null,null,null,null,null,null,null,null,null,null,null,null,null,null,null,null,null,null,null,null,null,null,null,null,1043]
[null,null,null,null,"          REIMBURSABLE",null,"NON-REIM-  BURSABLE",null,null,"            REIMBURSABLE",null,"NON-REIM-    BURSABLE",null,null,null,null,null,null,null,null,null,null,null,null,null,null,1044]
[null,null,null,null,"   EXPENDITURES FOR NON-PUBLIC",null,"EXPENDITURES",null,null,"          NON-PUBLIC RIDERS",null," NON-PUBLIC",null,null,null,null,null,null,null,null,null,null,null,null,null,null,1045]
[null,null,null,null," PUPILS TRANSPORTED AT LEAST",null,"FOR NON-PUBLIC","DEPRE-",null,"   TRANSPORTED AT LEAST 1 1/2",null,"RIDERS TRANS-","TOTAL",null,null,null,null,null,null,null,null,null,null,null,null,null,1046]
[null,null,null,null,"  1 1/2 MILES TO & FROM SCHOOL",null,"PUPILS TRANS-","CIATION","TOTAL","     MILES TO AND FROM SCHOOL",null,"PORTED LESS",null,null,null,null,null,null,null,null,null,null,null,null,null,null,1047]
[null,null,null,null,"SCHOOL TRANS","BY PUBLIC","PORTED < 1 1/2","(See  "," (Sum of","SCHOOL TRANS","BY PUBLIC","THAN 1 1/2 MILES"," (Sum of",null,null,null,null,null,null,null,null,null,null,null,null,null,1048]
[null,null,null,"NON-PUBLIC TRANSPORTATION","VEHICLE","UTILITIES","MILES FRM SCH"," instructions)","  1 thru 4)","VEHICLE","UTILITIES","FROM SCHOOL","  6 thru 8)",null,null,null,null,null,null,null,null,null,null,null,null,null,1049]
[1050,null,"4220","Within the District",null,null,null,null,0,null,null,null,0,null,null,null,null,null,null,null,null,null,null,null,null,null,0]
[1051,null,"4230","Outside the District",null,null,null,null,0,null,null,null,0,null,null,null,null,null,null,null,null,null,null,null,null,null,0]
[null,null,null,null,null,null,null,null,null,null,null,null,null,null,null,null,null,null,null,null,null,null,null,null,null,null,1052]
[null,null,null,null,null,null,null,null,null,null,null,null,null,null,null,null,null,null,null,null,null,null,null,null,null,null,1053]
[null,null,null,"SCHEDULE 7 (CONTINUED)",null,null,null,null,null,null,null,null,null,null,null,null,null,null,null,null,null,null,null,null,null,null,1054]
[null,null,null,"PUPIL TRANSPORTATION REIMBURSEMENT","           EXPENDITURES FOR ",null,"EXPENDITURES",null,null,"        RIDERS TRANSPORTED",null,null,null,null,null,null,null,null,null,null,null,null,null,null,null,null,1055]
[null,null,null,"FUNCTIONS 3300, 6900","PUPILS TRANSPORTED AT LEAST",null,"   FOR PUPILS ","DEPRE-",null,"         AT LEAST 1 1/2 MILES",null,"RIDERS TRANS-","TOTAL",null,null,null,null,null,null,null,null,null,null,null,null,null,1056]
[null,null,null,null,"1 1/2 MILES TO & FROM SCHOOL",null,"TRANSPORTED","CIATION","TOTAL","       TO AND FROM SCHOOL",null,"PORTED LESS",null,null,null,null,null,null,null,null,null,null,null,null,null,null,1057]
[null,null,null,null,"SCHOOL TRANS","BY PUBLIC","LESS THAN 1 1/2","(See  "," (Sum of","SCHOOL TRANS","BY PUBLIC","THAN 1 1/2 MILES"," (Sum of",null,null,null,null,null,null,null,null,null,null,null,null,null,1058]
[null,null,null,"OTHER PROGRAMS","VEHICLE","UTILITIES","MILES FRM SCH"," instructions)","  1 thru 4)","VEHICLE","UTILITIES","FROM SCHOOL","  6 thru 8)",null,null,null,null,null,null,null,null,null,null,null,null,null,1059]
[1060,null,"4250","Racial Imbalance (NOT METCO)",null,null,null,null,0,null,null,null,0,null,null,null,null,null,null,null,null,null,null,null,null,null,0]
[1061,null,"4260","To and From Day Care Centers",null,null,null,null,0,null,null,null,0,null,null,null,null,null,null,null,null,null,null,null,null,null,0]
[1062,null,"4270","Other School Programs",null,null,null,null,0,null,null,null,0,null,null,null,null,null,null,null,null,null,null,null,null,null,0]
[1063,null,"4280","School Choice / Commonwealth Charter Schools",null,null,null,null,0,null,null,null,0,null,null,null,null,null,null,null,null,null,null,null,null,null,0]
[1064,null,"4283","Homeless Transportation To Outside the District",null,null,null,null,0,null,null,null,0,null,null,null,null,null,null,null,null,null,null,null,null,null,0]
[1065,null,"4285","Homeless Transportation From Outside the District",null,null,null,null,0,null,null,null,0,null,null,null,null,null,null,null,null,null,null,null,null,null,0]
[null,null,null,null,null,null,null,null,null,null,null,null,null,null,null,null,null,null,null,null,null,null,null,null,null,null,1066]
[1067,null,"4290","TOTALS FOR ALL PROGRAMS",1095690,14892,0,175388,1285970,892,4,0,896," ",null,null,null,null,null,null,null,null,null,null,null,null,0]
[null,null,"PUBLIC TRANSPORTATION AND PAYMENTS FROM REVOLVING/SPECIAL",null,null,null,"EXPENDTURES",null,null,null,null,"RIDERS",null,null,null,null,null,null,null,null,null,null,null,null,null,null,1068]
[1069,null,"4310","PUBLIC TRANSPORTATION ASSESSMENT",null,null,null,null,0,null,null,null,null,null,null,null,null,null,null,null,null,null,null,null,null,null,0]
[1070,null,4320,"PAYMENTS FROM REVOLVING AND SPECIAL FUNDS",null,null,109222,null,109222,null,null,143,143,null,null,null,null,null,null,null,null,null,null,null,null,null,0]
[null,null,null,null,null,null,null,null,null,null,null,null,null,null,null,null,null,null,null,null,null,null,null,null,null,null,1071]
[null,null,null,null,null,null,null,null,null,null,null,null,null,null,null,null,null,null,null,null,null,null,null,null,null,null,1072]
[null,null,null,null,null,null,null,null,null,null,null,null,null,null,null,null,null,null,null,null,null,null,null,null,null,null,1073]
[null,null,null,null,null,null,null,null,null,null,null,null,null,null,null,null,null,null,null,null,null,null,null,null,null,null,1074]
[null,null,null,"SCHEDULE 19","1","2",3,4,5,6,null,null,null,null,null,null,null,null,null,null,null,null,null,null,null,null,1075]
[null,null,null,null,null,null,null,null,null,null,null,null,null,null,null,null,null,null,null,null,null,null,null,null,null,null,1076]
[null,null,null,"ANNUAL SCHOOL BUDGET",null,null,"CH 74 VOC-",null,null,null,null,null,null,null,null,null,null,null,null,null,null,null,null,null,null,null,1077]
[null,null,null,"2015 - 2016","REGULAR","SPECIAL","ATIONAL/","OTHER","UNDISTRIB-",null,null,null,null,null,null,null,null,null,null,null,null,null,null,null,null,null,1078]
[null,null,null,null,"DAY","EDUCATION","TECHNICAL","PROGRAMS","UTED","TOTAL",null,null,null,null,null,null,null,null,null,null,null,null,null,null,null,null,1079]
[null,null,null,"A.1   APPROPRIATION BY SCHOOL COMMITTEE",null,null,null,null,null,null,null,null,null,null,null,null,null,null,null,null,null,null,null,null,null,null,1080]
[1081,null,"7010","Administration(1000)",null,null,null,null,1023180,1023180,null,null,null,null,null,null,null,null,null,null,null,null,null,null,null,null,0]
[1082,null,"7030","Instruction (2000)",null,1153100,11076109,null,null,12229209,null,null,null,null,null,null,null,null,null,null,null,null,null,null,null,null,0]
[1083,null,"7040","Student Services (3100,3200)",null,null,null,null,220958,220958,null,null,null,null,null,null,null,null,null,null,null,null,null,null,null,null,0]
[1084,null,"7050","Pupil Transportation (3300)",null,null,16416,1200558,null,1216974,null,null,null,null,null,null,null,null,null,null,null,null,null,null,null,null,0]
[1085,null,"7060","Food Service (3400)",null,null,null,null,null,0,null,null,null,null,null,null,null,null,null,null,null,null,null,null,null,null,0]
[1086,null,"7070","Student Body Activities (3510,3520)",null,null,null,null,441493,441493,null,null,null,null,null,null,null,null,null,null,null,null,null,null,null,null,0]
[1087,null,7075,"School Security (3600)",null,null,null,null,341396,341396,null,null,null,null,null,null,null,null,null,null,null,null,null,null,null,null,0]
[1088,null,"7080","Operations and Maintenance (4000)",null,null,null,null,1797460,1797460,null,null,null,null,null,null,null,null,null,null,null,null,null,null,null,null,0]
[1089,null,"7090","Extraordinary Maintenance (4300)    ",null,null,null,null,null,0,null,null,null,null,null,null,null,null,null,null,null,null,null,null,null,null,0]
[1090,null,"7100","Employer Retirement Contributions (5100)",null,null,null,null,524383,524383,null,null,null,null,null,null,null,null,null,null,null,null,null,null,null,null,0]
[1091,null," 7105","Employee Separation Costs (5150)",null,null,null,null,null,0,null,null,null,null,null,null,null,null,null,null,null,null,null,null,null,null,0]
[1092,null," 7110","Insurance for Active Employees (5200)",null,null,null,null,2549081,2549081,null,null,null,null,null,null,null,null,null,null,null,null,null,null,null,null,0]
[1093,null,"7120","Insurance Retired School Employees (5250)",null,null,null,null,875058,875058,null,null,null,null,null,null,null,null,null,null,null,null,null,null,null,null,0]
[1094,null,"7130","Other Non Employee Insurance (5260)",null,null,null,null,250200,250200,null,null,null,null,null,null,null,null,null,null,null,null,null,null,null,null,0]
[1095,null,"7140","Rent (5300)",null,null,null,null,null,0,null,null,null,null,null,null,null,null,null,null,null,null,null,null,null,null,0]
[1096,null,"7150","Debt Service-Short Term Interest RAN's (5400)",null,null,null,null,45795,45795,null,null,null,null,null,null,null,null,null,null,null,null,null,null,null,null,0]
[1097,null,"7155","Debt Service-Short Term Interest-BANS (5450)",null,null,null,null,null,0,null,null,null,null,null,null,null,null,null,null,null,null,null,null,null,null,0]
[1098,null,"7160","Other Fixed Charges (5500)",null,null,null,null,null,0,null,null,null,null,null,null,null,null,null,null,null,null,null,null,null,null,0]
[1099,null,"7165","School Crossing Guards (5550)",null,null,null,null,null,0,null,null,null,null,null,null,null,null,null,null,null,null,null,null,null,null,0]
[1100,null,"7170","Other Community Services (6000)",null,null,12000,null,null,12000,null,null,null,null,null,null,null,null,null,null,null,null,null,null,null,null,0]
[1101,null,"7180","Non-Public Transportation (6900)",null,null,null,null,null,0,null,null,null,null,null,null,null,null,null,null,null,null,null,null,null,null,0]
[1102,null,"7190","Fixed Assets (7000)",null,null,null,null,497210,497210,null,null,null,null,null,null,null,null,null,null,null,null,null,null,null,null,0]
[1103,null,"7200","Long-Term Debt Retirement/Sch Construction (8100)",null,null,null,null,null,0]
[1104,null,"7210","Long-Term Debt Service/Sch Construction (8200)",null,null,null,null,null,0,null,null,null,null,null,null,null,null,null,null,null,null,null,null,null,null,0]
[1105,null,"7270","Long-Term Debt Service/Educ &Other (8400,8600)",null,null,null,null,null,0,null,null,null,null,null,null,null,null,null,null,null,null,null,null,null,null,{"$f":"ROW() - A1105","v":0}]
[1106,null,"7280","Tuition to Mass. Schools (9100)",null,0,6750,null," ",6750,null,null,null,null,null,null,null,null,null,null,null,null,null,null,null,null,0]
[1107,null,7285,"School Choice Tuition (9110)",0,4038,33962,null,null,38000,null,null,null,null,null,null,null,null,null,null,null,null,null,null,null,null,0]
[1108,null,7290,"Tuition to Commonwealth Charter Schools (9120)",0,0,0,null,null,0,null,null,null,null,null,null,null,null,null,null,null,null,null,null,null,null,0]
[1109,null,7295,"Tuition to Horace Mann Charter Schools (9120)",null,null,null,null,null,0,null,null,null,null,null,null,null,null,null,null,null,null,null,null,null,null,0]
[1110,null,7300,"Tuition to Out-of-State Schools (9200)",null,null,null,null,null,0,null,null,null,null,null,null,null,null,null,null,null,null,null,null,null,null,0]
[1111,null,7305,"Tuition to Non-Public Schools (9300)",null,null,null,null," ",0,null,null,null,null,null,null,null,null,null,null,null,null,null,null,null,null,0]
[1112,null,7310,"Tuition to Collaboratives (9400)",null,22000,null,null," ",22000,null,null,null,null,null,null,null,null,null,null,null,null,null,null,null,null,0]
[1113,null,"7320","TOTAL APPROPRIATION BY SCHOOL COMMITTEE",0,1179138,11145237,1200558,8566214,22091147,null,null,null,null,null,null,null,null,null,null,null,null,null,null,null,null,0]
[null,null,null,null,null,null,null,null,null,null,null,null,null,null,null,null,null,null,null,null,null,null,null,null,null,null,1114]
[null,null,null,null,null,null,null,null,null,null,null,null,null,null,null,null,null,null,null,null,null,null,null,null,null,null,1115]
[null,null,null,null,null,null,null,null,null,null,null,null,null,null,null,null,null,null,null,null,null,null,null,null,null,null,1116]
[null,null,null,null,null,null,null,null,null,null,null,null,null,null,null,null,null,null,null,null,null,null,null,null,null,null,1117]
[null,null,null,null,null,null,null,null,null,null,null,null,null,null,null,null,null,null,null,null,null,null,null,null,null,null,1118]
[null,null,null,"SCHEDULE 19","1","2",3,4,5,6,null,null,null,null,null,null,null,null,null,null,null,null,null,null,null,null,1119]
[null,null,null,null,null,null,null,null,null,null,null,null,null,null,null,null,null,null,null,null,null,null,null,null,null,null,1120]
[null,null,null,"ANNUAL SCHOOL BUDGET",null,null,"CH 74 VOC-",null,null,null,null,null,null,null,null,null,null,null,null,null,null,null,null,null,null,null,1121]
[null,null,null,"2015 - 2016","REGULAR","SPECIAL","ATIONAL/","OTHER","UNDISTRIB-",null,null,"Did your district use the per pupil administrative cost average",null,null,null,null,null,null,null,null,null,null,null,null,null,null,1122]
[null,null,null,null,"DAY","EDUCATION","TECHNICAL","PROGRAMS","UTED","TOTAL",null,"in determining the amount on line 7400 General Admin-",null,null,null,null,null,null,null,null,null,null,null,null,null,null,1123]
[null,null,null,"A.2    ESTIMATED EXPENDITURES BY CITY/TOWN",null,null,null,null,null,null,null,"istrative Servces?  Please insert an \"X\" in either Yes or No.",null,null,null,null,null,null,null,null,null,null,null,null,null,null,1124]
[1125,null,"7400","General Administrative Services (1000)",null,null,null,null,null,0,null,null,null,null,null,null,null,null,null,null,null,null,null,null,null,null,0]
[1126,null,"7420","Educational Media (2340, 2415)",null,null,null,null,null,0,null,null,"  YES",null,"NO",null,null,null,null,null,null,null,null,null,null,null,0]
[1127,null,"7430","Pupil Support Services (3100,3200)",null,null,null,null,null,0,null,null,null,null,null,null,null,null,null,null,null,null,null,null,null,null,0]
[1128,null,"7440","Pupil Transportation (3300)",null,null,null,null,null,0,null,null,null,null,null,null,null,null,null,null,null,null,null,null,null,null,0]
[1129,null,7445,"School Security (3600)",null,null,null,null,null,0,null,null,null,null,null,null,null,null,null,null,null,null,null,null,null,null,0]
[1130,null,"7450","Operations and Maintenance (4000)",null,null,null,null,null,0,null,null,null,null,null,null,null,null,null,null,null,null,null,null,null,null,0]
[1131,null,"7460","Extraordinary Maintenance (4300) ",null,null,null,null,null,0,null,null,null,null,null,null,null,null,null,null,null,null,null,null,null,null,0]
[1132,null,"7470","Employer Retirement Contributions (5100)",null,null,null,null,null,0,null,null,null,null,null,null,null,null,null,null,null,null,null,null,null,null,0]
[1133,null," 7475","Employee Separation Costs (5150)",null,null,null,null,null,0,null,null,null,null,null,null,null,null,null,null,null,null,null,null,null,null,0]
[1134,null,"7480","Insurance for Active Employees (5200)",null,null,null,null,null,0,null,null,null,null,null,null,null,null,null,null,null,null,null,null,null,null,0]
[1135,null,"7490","Insurance Retired School Employees (5250)",null,null,null,null,null,0,null,null,null,null,null,null,null,null,null,null,null,null,null,null,null,null,0]
[1136,null,"7500","Other Non-Employee Insurance (5260)",null,null,null,null,null,0,null,null,null,null,null,null,null,null,null,null,null,null,null,null,null,null,0]
[1137,null,"7510","Rent (5300)  ",null,null,null,null,null,0,null,null,null,null,null,null,null,null,null,null,null,null,null,null,null,null,0]
[1138,null,7515,"Debt Service-Short Term Interest RAN's (5400)",null,null,null,null,null,0,null,null,null,null,null,null,null,null,null,null,null,null,null,null,null,null,0]
[1139,null,7520,"Debt Service-Short Term Interest-BANS (5450)",null,null,null,null,null,0,null,null,null,null,null,null,null,null,null,null,null,null,null,null,null,null,0]
[1140,null,"7530","Other Fixed Charges (5500)",null,null,null,null,null,0,null,null,null,null,null,null,null,null,null,null,null,null,null,null,null,null,0]
[1141,null,"7535","School Crossing Guards (5550)",null,null,null,null,null,0,null,null,null,null,null,null,null,null,null,null,null,null,null,null,null,null,0]
[1142,null,"7540","Other Community Services (6000)",null,null,null,null,null,0,null,null,null,null,null,null,null,null,null,null,null,null,null,null,null,null,0]
[1143,null,"7550","Non-Public Transportation (6900)",null,null,null,null,null,0,null,null,null,null,null,null,null,null,null,null,null,null,null,null,null,null,0]
[1144,null,"7560","Fixed Assets (7000)",null,null,null,null,null,0,null,null,null,null,null,null,null,null,null,null,null,null,null,null,null,null,0]
[1145,null,"7570","Long-Term Debt Retirement/Sch Construction (8100)",null,null,null,null,null,0,null,null,null,null,null,null,null,null,null,null,null,null,null,null,null,null,0]
[1146,null,"7580","Long-Term Debt Service/Sch Construction (8200)",null,null,null,null,null,0,null,null,null,null,null,null,null,null,null,null,null,null,null,null,null,null,0]
[1147,null,"7640","Long-Term Debt Service/Educ &Other (8400,8600)",null,null,null,null,null,0,null,null,null,null,null,null,null,null,null,null,null,null,null,null,null,null,0]
[1148,null,7645,"Tuition to Mass. Schools (9100)",null,0,null,null,null,0,null,null,null,null,null,null,null,null,null,null,null,null,null,null,null,null,0]
[1149,null,7650,"School Choice Tuition (9110)",0,0,0,null,null,0,null,null,null,null,null,null,null,null,null,null,null,null,null,null,null,null,0]
[1150,null,7655,"Tuition to Commonwealth Charter Schools (9120)",0,0,0,null,null,0,null,null,null,null,null,null,null,null,null,null,null,null,null,null,null,null,0]
[1151,null,7660,"Tuition to Horace Mann Charter Schools (9120)",null,null,null,null,null,0,null,null,null,null,null,null,null,null,null,null,null,null,null,null,null,null,0]
[1152,null,7665,"Tuition to Out-of-State Schools (9200)",null,null,null,null,null,0,null,null,null,null,null,null,null,null,null,null,null,null,null,null,null,null,0]
[1153,null,7670,"Tuition to Non-Public Schools (9300)",null,null,null,null,null,0,null,null,null,null,null,null,null,null,null,null,null,null,null,null,null,null,0]
[1154,null,7675,"Tuition to Collaboratives (9400)",null,null,null,null,null,0,null,null,null,null,null,null,null,null,null,null,null,null,null,null,null,null,0]
[1155,null,"7680","Regional School Assessments (9500)",null,null,null,null,null,0,null,null,null,null,null,null,null,null,null,null,null,null,null,null,null,null,0]
[1156,null,"7690","TOTAL EXPENDITURES BY CITY/TOWN",0,0,0,0,0,0,null,null,null,null,null,null,null,null,null,null,null,null,null,null,null,null,0]
[1157,null,"7750","TOTAL ESTIMATED EXPENDITURES",0,1179138,11145237,1200558,8566214,22091147,null,null,null,null,null,null,null,null,null,null,null,null,null,null,null,null,0]
[null,null,null,null,null,null,null,null,null,null,null,null,null,null,null,null,null,null,null,null,null,null,null,null,null,null,1158]
[null,null,null,"SCHEDULE 19","1","2",3,4,5,6,null,null,null,null,null,null,null,null,null,null,null,null,null,null,null,null,1159]
[null,null,null,"ANNUAL SCHOOL BUDGET",null,null,"CH 74 VOC-",null,null,null,null,null,null,null,null,null,null,null,null,null,null,null,null,null,null,null,1160]
[null,null,null,"2015 - 2016","REGULAR","SPECIAL","ATIONAL/","OTHER","UNDISTRIB-",null,null,null,null,null,null,null,null,null,null,null,null,null,null,null,null,null,1161]
[null,null,null,"B.  ESTIMATED REVENUES-GENERAL FUND","DAY","EDUCATION","TECHNICAL","PROGRAMS","UTED","TOTAL",null,null,null,null,null,null,null,null,null,null,null,null,null,null,null,null,1162]
[null,null,null,"      REVENUES FROM LOCAL SOURCES FY15",null,null,null,null,null,null,null,null,null,null,null,null,null,null,null,null,null,null,null,null,null,null,1163]
[1164,null,"7800","Assessments Received by Regional Schools",null,null,null,null,13200216,13200216,null,null,null,null,null,null,null,null,null,null,null,null,null,null,null,null,0]
[1165,null,"7810","Excess & Deficiency Fund Approp",null,null,null,null,null,0,null,null,null,null,null,null,null,null,null,null,null,null,null,null,null,null,0]
[1166,null,"7820","Tuition From Individuals",null,null,null,null,null,0,null,null,null,null,null,null,null,null,null,null,null,null,null,null,null,null,0]
[1167,null,"7830","Tuition From Other Districts in Comm.",null,null,null,null,null,0,null,null,null,null,null,null,null,null,null,null,null,null,null,null,null,null,0]
[1168,null,"7840","Tuition From Districts in Other States",null,null,null,null,null,0,null,null,null,null,null,null,null,null,null,null,null,null,null,null,null,null,0]
[1169,null,"7850","Transportation Fees",null,null,null,null,null,0,null,null,null,null,null,null,null,null,null,null,null,null,null,null,null,null,{"$f":"ROW() - A1169","v":0}]
[1170,null,"7860","Earnings on Investments",null,null,null,null,null,0,null,null,null,null,null,null,null,null,null,null,null,null,null,null,null,null,0]
[1171,null,"7870","Rental of School Facilities",null,null,null,null,null,0,null,null,null,null,null,null,null,null,null,null,null,null,null,null,null,null,0]
[1172,null,"7880","Other General Fund Revenue",null,null,608487,null,null,608487,null,null,null,null,null,null,null,null,null,null,null,null,null,null,null,null,0]
[1173,null,"7890","Medical Care and Assistance",null,null,null,null,null,0,null,null,null,null,null,null,null,null,null,null,null,null,null,null,null,null,0]
[1174,null,"7900","Non Revenue Receipts",null,null,null,null,null,0,null,null,null,null,null,null,null,null,null,null,null,null,null,null,null,null,0]
[1175,null,"7910","TOTAL REVENUE FROM LOCAL SOURCES",0,0,608487,0,13200216,13808703,null,null,null,null,null,null,null,null,null,null,null,null,null,null,null,null,0]
[null,null,null,null,null,null,null,null,null,null,null,null,null,null,null,null,null,null,null,null,null,null,null,null,null,null,1176]
[null,null,null,null,null,null,null,null,null,null,null,null,null,null,null,null,null,null,null,null,null,null,null,null,null,null,1177]
[null,null,null,null,1,2,3,4,5,6,7,8,null,"Please mark ",null,null,null,null,null,null,null,null,null,null,null,null,1178]
[null,null,null,null,null,null,null,null,null,null,"ASSESSMENT","BUDGETED",null,"with an \"X\"",null,null,null,null,null,null,null,null,null,null,null,null,1179]
[null,null,null,"C. 2015 - 2016 REGIONAL SCHOOL DISTRICTS","MEMBER ","MINIMUM","ADDITIONAL","TRANSP &","CAPITAL &",null,"APPROVED","EXCESS",null,"assessment",null,null,null,null,null,null,null,null,null,null,null,null,1180]
[null,null,null,"     APPROVED BUDGETS","CITY/TOWN","LOCAL CON-","LOCAL CON-","OTHER EXP-","DEBT EXP-",null,"BY MEMBER","AND",null,"method used",null,null,null,null,null,null,null,null,null,null,null,null,1181]
[null,null,null,null,"CODE","TRIBUTION","TRIBUTION","ENDITURES","ENDITURES","TOTAL","TOWNS","DEFICIENCY",null,"for FY16",null,null,null,null,null,null,null,null,null,null,null,null,1182]
[null,null,null,"MEMBER CITY/TOWN CODE AND NAME",null,null,null,null,null,null,null,null,null,null,null,null,null,null,null,null,null,null,null,null,null,null,1183]
[1184,null,"8000","AMESBURY                     ","007",634993,118183,33313,43203,829692,null,null,null,null,null,null,null,null,null,null,null,null,null,null,null,null,0]
[1185,null,"8010","GEORGETOWN                   ","105",495695,81250,22903,25622,625470,null,null,null,"(Check only one)",null,null,null,null,null,null,null,null,null,null,null,null,0]
[1186,null,"8020","GROVELAND                    ","116",742467,134802,37998,18239,933506,null,null,null,null,null,null,null,null,null,null,null,null,null,null,null,null,0]
[1187,null,"8030","HAVERHILL                    ","128",5505056,1423744,401321,152910,7483031,null,null,"statutory  ","X",null,null,null,null,null,null,null,null,null,null,null,null,0]
[1188,null,"8040","IPSWICH                      ","144",442343,60938,17177,35125,555583,null,null,null,null,null,null,null,null,null,null,null,null,null,null,null,null,0]
[1189,null,"8050","MERRIMAC                     ","180",635260,121878,34354,17270,808762,null,null,"agreement  ",null,null,null,null,null,null,null,null,null,null,null,null,null,0]
[1190,null,"8060","NEWBURY                      ","203",317664,42473,11972,16430,388539,null,null,null,null,null,null,null,null,null,null,null,null,null,null,null,null,0]
[1191,null,"8070","NEWBURYPORT                  ","204",237333,33239,9369,50440,330381,null,null,null,null,null,null,null,null,null,null,null,null,null,null,null,null,0]
[1192,null,"8080","ROWLEY                       ","254",190352,27699,7808,15972,241831,null,null,null,null,null,null,null,null,null,null,null,null,null,null,null,null,0]
[1193,null,"8090","SALISBURY                    ","259",616248,84943,23944,16539,741674,null,null,null,null,null,null,null,null,null,null,null,null,null,null,null,null,0]
[1194,null,"8100","WEST NEWBURY                 ","329",210623,29546,8328,13250,261747,null,null,null,null,null,null,null,null,null,null,null,null,null,null,null,null,0]
[1195,null,"8110",null,null,null,null,null,null,0,null,null,null,null,null,null,null,null,null,null,null,null,null,null,null,null,0]
[1196,null,"8120",null,null,null,null,null,null,0,null,null,null,null,null,null,null,null,null,null,null,null,null,null,null,null,0]
[1197,null,"8130",null,null,null,null,null,null,0,null,null,null,null,null,null,null,null,null,null,null,null,null,null,null,null,0]
[1198,null,"8140",null,null,null,null,null,null,0,null,null,null,null,null,null,null,null,null,null,null,null,null,null,null,null,0]
[1199,null,"8150",null,null,null,null,null,null,0,null,null,null,null,null,null,null,null,null,null,null,null,null,null,null,null,0]
[1200,null,"8160",null,null,null,null,null,null,0,null,null,null,null,null,null,null,null,null,null,null,null,null,null,null,null,0]
[1201,null,"8170",null,null,null,null,null,null,0,null,null,null,null,null,null,null,null,null,null,null,null,null,null,null,null,0]
[1202,null,"8180",null,null,null,null,null,null,0,null,null,null,null,null,null,null,null,null,null,null,null,null,null,null,null,0]
[1203,null,"8190",null,null,null,null,null,null,0,null,null,null,null,null,null,null,null,null,null,null,null,null,null,null,null,0]
[1204,null,"8200",null,null,null,null,null,null,0,null,null,null,null,null,null,null,null,null,null,null,null,null,null,null,null,0]
[1205,null,"8210",null,null,null,null,null,null,0,null,null,null,null,null,null,null,null,null,null,null,null,null,null,null,null,0]
[1206,null,"8220",null,null,null,null,null,null,0,null,null,null,null,null,null,null,null,null,null,null,null,null,null,null,null,0]
[1207,null,"8230",null,null,null,null,null,null,0,null,null,null,null,null,null,null,null,null,null,null,null,null,null,null,null,0]
[1208,null,"8240",null,null,null,null,null,null,0,null,null,null,null,null,null,null,null,null,null,null,null,null,null,null,null,0]
[1209,null,"8250",null,null,null,null,null,null,0,null,null,null,null,null,null,null,null,null,null,null,null,null,null,null,null,0]
[1210,null,"8260",null,null,null,null,null,null,0,null,null,null,null,null,null,null,null,null,null,null,null,null,null,null,null,0]
[1211,null,"8270","TOTAL ASSESSMENTS RECEIVED FROM MEMBERS","",10028034,2158695,608487,405000,13200216,0,0,null,null,null,null,null,null,null,null,null,null,null,null,null,null,0]
[null,null,null,null,null,null,null,null,null,null,null,null,null,null,null,null,null,null,null,null,null,null,null,null,null,null,1212]
[null,null,null,null,null,null,null,null,null,null,null,null,null,null,null,null,null,null,null,null,null,null,null,null,null,null,1213]
[null,null,null,"EXPENDITURE SUMMARY FY15","1","2","3","4",5,6,7,8,9,10,11,null,null,null,null,null,null,null,null,null,null,null,1214]
[null,null,null,"ALL FUND TYPES",null,null,null,null,null,null,null,null,null,null,null,null,null,null,null,null,null,null,null,null,null,null,1215]
[null,null,null,null,"SCH COMM","CITY/TOWN",null,null,null,"PRIVATE","SCH CHOICE",null,null,"OTHER",null,null,null,null,null,null,null,null,null,null,null,null,1216]
[null,null,null,null,"APPROP-","APPROP-","FEDERAL","STATE","CIRCUIT","GRANTS","& OTHER","ATHLETIC","SCHOOL","LOCAL",null,null,null,null,null,null,null,null,null,null,null,null,1217]
[null,null,null,null,"RIATIONS","RIATIONS","GRANTS","GRANTS","BREAKER","& GIFTS","TUITION","FUND","LUNCH","RECEIPTS","TOTAL",null,null,null,null,null,null,null,null,null,null,null,1218]
[null,null,null,null,null,null,null,null,null,null,null,null,null,null,null,null,null,null,null,null,null,null,null,null,null,null,1219]
[1220,null,8300,"School Committee (1110)",70603,0,0,0,0,0,0,0,0,0,70603,null,null,null,null,null,null,null,null,null,null,null,0]
[1221,null,8305,"Superintendent (1210)",343187,null,0,0,0,0,0,0,0,0,343187,null,null,null,null,null,null,null,null,null,null,null,0]
[1222,null,8310,"Assistant Superintendents (1220)",0,null,0,0,0,0,0,0,0,0,0,null,null,null,null,null,null,null,null,null,null,null,0]
[1223,null,8315,"Other District-Wide Administration (1230)",0,null,0,0,0,0,0,0,0,0,0,null,null,null,null,null,null,null,null,null,null,null,0]
[1224,null,8320,"Business and Finance (1410)",344764,0,0,0,0,0,0,0,0,0,344764,null,null,null,null,null,null,null,null,null,null,null,0]
[1225,null,8325,"Human Resources and Benefits (1420)",59409,0,0,0,0,0,15773,0,0,0,75182,null,null,null,null,null,null,null,null,null,null,null,0]
[1226,null,8330,"Legal Service For School Committee (1430)",43171,0,0,0,0,0,0,0,0,0,43171,null,null,null,null,null,null,null,null,null,null,null,0]
[1227,null,8335,"Legal Settlements (1435)",0,0,0,0,0,0,0,0,0,0,0,null,null,null,null,null,null,null,null,null,null,null,0]
[1228,null,8340,"District-wide Information Mgmt and Tech (1450)",179087,0,0,0,0,0,51250,0,0,0,230337,null,null,null,null,null,null,null,null,null,null,null,0]
[1229,null,8345,"Curriculum Directors  (Supervisory) (2110)",479508,null,0,0,0,0,0,0,null,0,479508,null,null,null,null,null,null,null,null,null,null,null,0]
[1230,null,8350,"Department Heads  (Non-Supervisory) (2120)",70663,null,0,0,0,0,0,0,null,0,70663,null,null,null,null,null,null,null,null,null,null,null,0]
[1231,null,8355,"School Leadership-Building (2210)",672745,null,0,0,0,0,0,0,null,45829,718574,null,null,null,null,null,null,null,null,null,null,null,0]
[1232,null,8360,"Curriculum Leaders/Department Heads-Building Level (2220)",0,null,0,0,0,0,0,0,null,0,0,null,null,null,null,null,null,null,null,null,null,null,0]
[1233,null,8365,"Building Technology (2250)",0,null,0,0,0,0,0,0,null,0,0,null,null,null,null,null,null,null,null,null,null,null,{"$f":"ROW() - A1233","v":0}]
[1234,null,8370,"Teachers, Classroom (2305)",8251729,null,283112,0,0,0,138097,0,null,110891,8783829,null,null,null,null,null,null,null,null,null,null,null,0]
[1235,null,8375,"Teachers, Specialists  (2310)",0,null,255082,7276,0,0,0,0,null,0,262358,null,null,null,null,null,null,null,null,null,null,null,0]
[1236,null,8380,"Instructional Coordinators and Team Leaders (2315)",0,null,5550,0,0,0,0,0,null,0,5550,null,null,null,null,null,null,null,null,null,null,null,0]
[1237,null,8385,"Medical/ Therapeutic Services (2320)",0,null,0,0,0,0,0,0,null,0,0,null,null,null,null,null,null,null,null,null,null,null,0]
[1238,null,8390,"Substitute Teachers (2325)",90289,null,0,0,0,0,0,0,null,0,90289,null,null,null,null,null,null,null,null,null,null,null,0]
[1239,null,8395,"Non-Clerical Paraprofs./Instructional Assistants (2330)",86191,null,75536,0,0,0,0,0,null,0,161727,null,null,null,null,null,null,null,null,null,null,null,0]
[1240,null,8400,"Librarians and Media Center Directors (2340)",89327,0,0,0,0,0,0,0,null,0,89327,null,null,null,null,null,null,null,null,null,null,null,0]
[1241,null,8405,"Professional Development Leadership (2351)",0,null,0,0,0,0,0,0,null,0,0,null,null,null,null,null,null,null,null,null,null,null,0]
[1242,null,8410,"Teacher/Instructional Staff-Professional Days (2353)",45854,null,0,0,0,0,0,0,null,0,45854,null,null,null,null,null,null,null,null,null,null,null,0]
[1243,null,8415,"Substitutes for Instructional Staff at Prof. Development (2355)",12820,null,0,0,0,0,0,0,null,0,12820,null,null,null,null,null,null,null,null,null,null,null,0]
[1244,null,8420,"Prof. Development Stipends, Providers and Expenses (2357)",97894,null,91477,0,0,0,0,0,null,0,189371,null,null,null,null,null,null,null,null,null,null,null,0]
[1245,null,8425,"Textbooks and Related Software/Media/Materials (2410)",13257,null,2619,0,0,0,0,0,null,0,15876,null,null,null,null,null,null,null,null,null,null,null,0]
[1246,null,8430,"Other Instructional Materials (2415)",10154,0,9212,4624,0,0,0,0,null,0,23990,null,null,null,null,null,null,null,null,null,null,null,0]
[1247,null,8435,"Instructional Equipment (2420)",169837,null,16800,0,0,0,0,0,null,3059,189696,null,null,null,null,null,null,null,null,null,null,null,0]
[1248,null,8440,"General Supplies (2430)",473767,null,0,0,0,0,21224,0,null,248468,743459,null,null,null,null,null,null,null,null,null,null,null,0]
[1249,null,8445,"Other Instructional Services (2440)",0,null,0,0,0,0,0,0,null,20458,20458,null,null,null,null,null,null,null,null,null,null,null,0]
[1250,null,8450,"Classroom Instructional Technology (2451)",494343,null,46639,0,0,0,0,0,null,1949,542931,null,null,null,null,null,null,null,null,null,null,null,0]
[1251,null,8455,"Other Instructional Hardware  (2453)",0,null,0,0,0,0,0,0,null,0,0,null,null,null,null,null,null,null,null,null,null,null,0]
[1252,null,8460,"Instructional Software (2455)",70793,null,0,0,0,0,0,0,null,0,70793,null,null,null,null,null,null,null,null,null,null,null,0]
[1253,null,8465,"Guidance Counselors and Adjustment Counselors (2710)",440053,null,0,0,0,0,0,0,null,0,440053,null,null,null,null,null,null,null,null,null,null,null,0]
[1254,null,8470,"Testing and Assessment (2720)",0,null,0,0,0,0,0,0,null,0,0,null,null,null,null,null,null,null,null,null,null,null,0]
[1255,null,8475,"Psychological Services (2800)",119898,null,2800,0,0,0,0,0,null,2757,125455,null,null,null,null,null,null,null,null,null,null,null,0]
[1256,null,8480,"TOTAL INSTRUCTION (2000)",11689122,0,788827,11900,0,0,159321,0,null,433411,13082581,null,null,null,null,null,null,null,null,null,null,null,0]
[1257,null,8485,"Attendance and Parent Liaison Services (3100)",43722,null,1700,0,0,0,0,0,0,0,45422,null,null,null,null,null,null,null,null,null,null,null,0]
[1258,null,8490,"Medical/Health Services (3200)",171222,0,0,0,0,2995,0,0,0,0,174217,null,null,null,null,null,null,null,null,null,null,null,0]
[1259,null,8495,"Transportation Services (3300)",1110672,0,0,0,0,0,109222,0,0,0,1219894,null,null,null,null,null,null,null,null,null,null,null,0]
[1260,null,8500,"Food Services (3400)",0,null,0,0,0,0,0,0,578179,0,578179,null,null,null,null,null,null,null,null,null,null,null,0]
[1261,null,8505,"Athletics (3510)",423983,null,0,0,0,0,0,6526,0,0,430509,null,null,null,null,null,null,null,null,null,null,null,0]
[1262,null,8510,"Other Student Body Activities (3520)",85331,null,5916,19209,0,748,93559,0,0,0,204763,null,null,null,null,null,null,null,null,null,null,null,0]
[1263,null,8515,"School Security  (3600)",334379,0,0,0,0,0,25153,0,0,5988,365520,null,null,null,null,null,null,null,null,null,null,null,0]
[1264,null,8520,"Custodial Services (4110)",279080,0,0,0,0,0,27200,0,0,0,306280,null,null,null,null,null,null,null,null,null,null,null,0]
[1265,null,8525,"Heating of Buildings (4120)",101124,0,0,0,0,0,0,0,0,0,101124,null,null,null,null,null,null,null,null,null,null,null,0]
[1266,null,8530,"Utility Services (4130)",589802,0,0,0,0,0,0,0,0,28689,618491,null,null,null,null,null,null,null,null,null,null,null,0]
[1267,null,8535,"Maintenance of Grounds (4210)",45609,0,0,0,0,0,0,0,0,0,45609,null,null,null,null,null,null,null,null,null,null,null,0]
[1268,null,8540,"Maintenance of Buildings (4220)",686955,0,0,0,0,0,18521,0,0,0,705476,null,null,null,null,null,null,null,null,null,null,null,0]
[1269,null,8545,"Building Security System (4225)",0,0,0,0,0,0,0,0,0,0,0,null,null,null,null,null,null,null,null,null,null,null,0]
[1270,null,8550,"Maintenance of Equipment (4230)",68408,0,0,0,0,0,0,0,0,0,68408,null,null,null,null,null,null,null,null,null,null,null,0]
[1271,null,8555,"Extraordinary Maintenance (4300)   ",0,0,0,0,0,0,0,0,0,0,0,null,null,null,null,null,null,null,null,null,null,null,0]
[1272,null,8560,"Networking and Telecommunications (4400)",0,0,0,0,0,0,0,0,0,0,0,null,null,null,null,null,null,null,null,null,null,null,0]
[1273,null,8565,"Technology Maintenance (4450)",0,0,0,0,0,0,0,0,0,0,0,null,null,null,null,null,null,null,null,null,null,null,0]
[1274,null,8570,"Employer Retirement Contributions (5100)",508902,0,44661,0,0,0,0,0,0,0,553563,null,null,null,null,null,null,null,null,null,null,null,0]
[1275,"!",8572,"Employee Separation Costs (5150)",60599,0,0,0,0,0,0,0,0,0,60599,null,null,null,null,null,null,null,null,null,null,null,0]
[1276,null,8575,"Insurance for Active Employees (5200)",2584390,0,108236,0,0,0,48322,0,18966,0,2759914,null,null,null,null,null,null,null,null,null,null,null,0]
[1277,null,8580,"Insurance for Retired School Employees (5250)",567490,0,0,0,0,0,0,0,0,0,567490,null,null,null,null,null,null,null,null,null,null,null,0]
[1278,null,8585,"Other Non-Employee Insurance (5260)",250144,0,0,0,0,0,0,0,0,0,250144,null,null,null,null,null,null,null,null,null,null,null,0]
[1279,null,8590,"Rental Lease of Equipment (5300)   ",43398,0,0,0,0,0,0,0,0,0,43398,null,null,null,null,null,null,null,null,null,null,null,0]
[1280,null,8595,"Rental Lease  of Buildings (5350)",0,0,0,0,0,0,0,0,0,0,0,null,null,null,null,null,null,null,null,null,null,null,0]
[1281,null,8600,"Short Term Interest RAN's (5400)",0,0,0,0,0,0,0,0,0,0,0,null,null,null,null,null,null,null,null,null,null,null,0]
[1282,null,8605,"Short Term Interest BAN'S (5450)",0,0,0,0,0,0,0,0,0,0,0,null,null,null,null,null,null,null,null,null,null,null,0]
[1283,null,8610,"Other Fixed Charges (5500)",0,0,0,0,0,0,0,0,0,0,0,null,null,null,null,null,null,null,null,null,null,null,0]
[1284,null,8612,"School Crossing Guards (5550)",0,0,0,0,0,0,0,0,0,0,0,null,null,null,null,null,null,null,null,null,null,null,0]
[1285,null,8615,"Indirect Cost Transfers",null,null,0,0,null,0,0,0,0,0,0,null,null,null,null,null,null,null,null,null,null,null,0]
[1286,null,8620,"Civic Activities and Community Services (6200)",8130,null,0,0,null,0,0,0,0,0,8130,null,null,null,null,null,null,null,null,null,null,null,0]
[1287,null,8625,"Recreation Services (6300)",0,null,0,0,null,0,0,0,0,0,0,null,null,null,null,null,null,null,null,null,null,null,0]
[1288,null,8630,"Health Services to Non-Public Schools (6800)",0,0,0,0,null,0,0,0,0,0,0,null,null,null,null,null,null,null,null,null,null,null,0]
[1289,null,8635,"Transportation To Non-Public Schools (6900)",0,0,0,0,null,0,0,0,0,0,0,null,null,null,null,null,null,null,null,null,null,null,0]
[1290,null,8640,"Purchase of Land & Buildings (7100, 7200)",129877,0,0,0,null,0,0,0,0,0,129877,null,null,null,null,null,null,null,null,null,null,null,0]
[1291,null,8645,"Equipment (7300, 7400)",286468,0,0,75030,null,0,0,0,0,0,361498]
[1292,null,8650,"Capital Technology (7350)",0,0,0,0,null,0,0,0,0,0,0]
[1293,null,8655,"Motor Vehicles (7500, 7600)",155980,0,0,0,null,0,0,0,0,0,155980]
[1294,null,8660,"Debt Retirement/Sch Construction (8100)",0,0,0,0,null,0,null,0,0,0,0]
[1295,null,8665,"Debt Service/Sch Construction (8200)",0,0,0,0,null,0,null,0,0,0,0]
[1296,null,8670,"Debt Service/Educ. & Other (8400, 8600)",0,0,0,null,0,0,null,0,0,0,0]
[1297,null,8675,"Tuition to Mass. Schools (9100)",0,0,0,0,0,0,0,0,0,0,0]
[1298,null,8680,"School Choice Tuition (9110)",33338,0,null,null,null,null,null,null,null,null,33338]
[1299,null,8685,"Tuition to Commonwealth Charter Schools (9120)",0,0,null,null,null,null,null,null,null,null,0]
[1300,null,8690,"Tuition to Horace Mann Charter Schools (9120)",0,0,0,0,0,0,0,0,0,0,0]
[1301,null,8695,"Tuition to Out-of-State Schools (9200)",0,0,0,0,0,0,0,0,0,0,0]
[1302,null,8700,"Tuition to Non-Public Schools (9300)",0,0,0,0,0,0,0,0,0,0,0]
[1303,null,8705,"Tuition to Collaboratives (9400)",31101,0,0,0,0,0,0,0,0,0,31101]
[1304,null,8710,"Regional School Assessment (9500)",null,0,null,null,null,null,null,null,null,null,0]
[1305,null,8715,"TOTAL EXPENDITURES, ALL FUNDS",21329447,0,949340,106139,0,3743,548321,6526,597145,468088,24008749]

{"sheet":"rate summary","index":6,"n_rows":21,"n_cols":5,"rows_kept":21,"cut":false,"hidden":false,"merged":[[3,1,3,4],[4,1,4,4],[0,0,0,5],[1,0,1,5]]}
["Massachusetts Department of Elementary and Secondary Education"]
["Office of School Finance"]
[]
[{"$f":"A7+1","v":736},"School Choice Rate Summary FY16"]
[{"$f":"IF(A6=1,\"\",VALUE(VLOOKUP(A6,lea_info,2)))","v":735}]
[395]
[735,{"$f":"IF($A$7=\"\",\"\",VLOOKUP($A$7,code436,2))","v":"NORTH MIDDLESEX              "}]
[]
[null,{"$f":"IF(A7=\"\",\"\",IF(VLOOKUP(A7,webmessage,8)=\"\",\"\",VLOOKUP(A7,webmessage,8)))","v":""}]
[]
[null,null,null,"Regular","Vocational"]
[null,"Instructional Services",null,{"$f":"IF($A$7=\"\",\"\",VLOOKUP($A$7,dataout,6))","v":14752761},{"$f":"IF($A$7=\"\",\"\",VLOOKUP($A$7,dataout,14))","v":0}]
[null,"Pupil Services",null,{"$f":"IF($A$7=\"\",\"\",VLOOKUP($A$7,dataout,7))","v":3095579},{"$f":"IF($A$7=\"\",\"\",VLOOKUP($A$7,dataout,15))","v":0}]
[null,"Administration and Fixed Charges",null,{"$f":"IF($A$7=\"\",\"\",VLOOKUP($A$7,dataout,8))","v":8723494},{"$f":"IF($A$7=\"\",\"\",VLOOKUP($A$7,dataout,16))","v":0}]
[null,"Total Expenditure",null,{"$f":"IF($A$7=\"\",\"\",VLOOKUP($A$7,dataout,9))","v":26571834},{"$f":"IF($A$7=\"\",\"\",VLOOKUP($A$7,dataout,17))","v":0}]
[null,"FTE Average Membership",null,{"$f":"IF($A$7=\"\",\"\",VLOOKUP($A$7,dataout,10))","v":3066.36},{"$f":"IF($A$7=\"\",\"\",VLOOKUP($A$7,dataout,18))","v":0}]
[null,"Average Cost",null,{"$f":"IF(A7=\"\",\"\",VLOOKUP($A$7,dataout,11))","v":8666},{"$f":"IF($A$7=\"\",\"\",VLOOKUP($A$7,dataout,19))","v":" "}]
[null,"Eligible Rate*",null,{"$f":"IF(A7=\"\",\"\",VLOOKUP($A$7,dataout,12))","v":5000},{"$f":"IF($A$7=\"\",\"\",VLOOKUP($A$7,dataout,20))","v":" "}]
[]
[]
[null,"* the lesser of 75 percent of average cost, or $5,000"]

{"sheet":"dataout","index":7,"n_rows":447,"n_cols":20,"rows_kept":447,"cut":false,"hidden":true,"merged":[[4,5,4,11],[4,12,4,19]]}
[]
[]
[]
[null,null,{"$f":"COUNTIF(C10:C447,\"Y\")","v":184}]
[null,null,null,null,null,"    -----------------------------------------regular ed -------------------------------------------------",null,null,null,null,null,null,"    -----------------------------------------vocational-------------------------------------------------"]
[null,null,"FY16",null,null,null,null,null,null,"average",null,null,null,null,null,null,null,"average"]
[null,null,"Choice","eoy year or","Date",null,"pupil","fixed",null,"member-","average","allowed",null,null,"pupil","fixed",null,"member-","average","allowed"]
[null,null,"District?","\"not in\"","Run","instructional","services","charges","total","ship","cost","cost",null,"instructional","services","charges","total","ship","cost","cost"]
["lea","district"]
[1,"ABINGTON","Y",null,"2016-06-15",8733024,2076999,4276349,15086372,1866.98,8081,5000,null,0,0,0,0,0," "," "]
[2,"ACTON"]
[3,"ACUSHNET"]
[4,"ADAMS"]
[5,"AGAWAM                       ","Y",null,"2016-06-15",18795316,3499660,10307626,32602602,3706.91,8795,5000,null,813,71392,446,72651,75.62,961,721]
[6,"ALFORD"]
[7,"AMESBURY                     ","Y",null,"2016-06-15",9828206,2264530,5294592,17387328,2094.88,8300,5000,null,0,0,0,0,0," "," "]
[8,"AMHERST","Y",null,"2016-06-15",8025536,1596220,4919781,14541537,1119.98,12984,5000,null,0,0,0,0,0," "," "]
[9,"ANDOVER"]
[10,"ARLINGTON"]
[11,"ASHBURNHAM"]
[12,"ASHBY"]
[13,"ASHFIELD"]
[14,"ASHLAND                      ","Y",null,"2016-06-15",14022878,1946921,6939153,22908952,2476.98,9249,5000,null,0,0,0,0,0," "," "]
[15,"ATHOL"]
[16,"ATTLEBORO"]
[17,"AUBURN                       ","Y",null,"2016-06-15",12242156,2296257,7048315,21586728,2284.17,9451,5000,null,0,0,0,0,0," "," "]
[18,"AVON                         ","Y",null,"2016-06-15",3742227,985654,2458370,7186251,695.36,10335,5000,null,0,0,0,0,0," "," "]
[19,"AYER                         "]
[20,"BARNSTABLE                   ","Y",null,"2016-06-15",27589610,5107918,14249704,46947232,4602.7299999999996,10200,5000,null,0,0,0,0,0," "," "]
[21,"BARRE"]
[22,"BECKET"]
[23,"BEDFORD"]
[24,"BELCHERTOWN                  ","Y",null,"2016-06-15",10308794,2025904,5617060,17951758,2201.42,8155,5000,null,0,0,0,0,0," "," "]
[25,"BELLINGHAM                   ","Y",null,"2016-06-15",11253923,2051469,6208589,19513981,2227.6999999999998,8760,5000,null,0,0,0,0,0," "," "]
[26,"BELMONT"]
[27,"BERKLEY                      ","Y",null,"2016-06-15",3638154,765554,1854082,6257790,801.72,7805,5000,null,0,0,0,0,0," "," "]
[28,"BERLIN                       ","Y",null,"2016-06-15",1260269,252855,648072,2161196,176.31,12258,5000,null,0,0,0,0,0," "," "]
[29,"BERNARDSTON"]
[30,"BEVERLY                      ","Y",null,"2016-06-15",20888798,3370736,12267641,36527175,4193.82,8710,5000,null,0,0,0,0,0," "," "]
[31,"BILLERICA"]
[32,"BLACKSTONE"]
[33,"BLANDFORD"]
[34,"BOLTON"]
[35,"BOSTON"]
[36,"BOURNE                       ","Y",null,"2016-06-15",10903771,1792938,7498537,20195246,1900.7,10625,5000,null,0,0,0,0,0," "," "]
[37,"BOXBOROUGH                   ",null,null,"2014-12-24",2915271,392407,1330448,4638126,412.21533333333326,11252,5000,null,0,0,0,0,0," "," "]
[38,"BOXFORD"]
[39,"BOYLSTON                     ","Y",null,"2016-06-15",1582052,272336,675313,2529701,288.72000000000003,8762,5000,null,0,0,0,0,0," "," "]
[40,"BRAINTREE"]
[41,"BREWSTER"]
[42,"BRIDGEWATER"]
[43,"BRIMFIELD"]
[44,"BROCKTON                     ","Y",null,"2016-06-15",88357258,17240687,53280560,158878505,15819.33,10043,5000,null,906372.96,219419,546555,1672346.96,201.33,8306,5000]
[45,"BROOKFIELD                   ","Y",null,"2016-06-15",1445829,332762,623134,2401725,319.86,7509,5000,null,0,0,0,0,0," "," "]
[46,"BROOKLINE"]
[47,"BUCKLAND"]
[48,"BURLINGTON","Y",null,"2016-06-15",28243622,4166946,12861210,45271778,3343.09,13542,5000,null,0,0,0,0,0," "," "]
[49,"CAMBRIDGE"]
[50,"CANTON"]
[51,"CARLISLE"]
[52,"CARVER","Y",null,"2016-06-15",8858450,1558965,5383439,15800854,1523.14,10374,5000,null,0,0,0,0,0," "," "]
[53,"CHARLEMONT"]
[54,"CHARLTON"]
[55,"CHATHAM                      "]
[56,"CHELMSFORD","Y",null,"2016-06-15",26700844,3296548,11133083,41130475,4806.9399999999996,8556,5000,null,0,0,0,0,0," "," "]
[57,"CHELSEA"]
[58,"CHESHIRE"]
[59,"CHESTER"]
[60,"CHESTERFIELD"]
[61,"CHICOPEE                     ","Y",null,"2016-06-15",35355518,6754430,19122692,61232640,6622.64,9246,5000,null,1577932,461036,853454,2892422,452.04,6399,4799]
[62,"CHILMARK"]
[63,"CLARKSBURG","Y",null,"2016-06-15",872179,157787,537603,1567569,159.18,9848,5000,null,0,0,0,0,0," "," "]
[64,"CLINTON                      ","Y",null,"2016-06-15",8224476,1364583,3777007,13366066,1716.73,7786,5000,null,0,0,0,0,0," "," "]
[65,"COHASSET"]
[66,"COLRAIN"]
[67,"CONCORD"]
[68,"CONWAY                       ","Y",null,"2016-06-15",1078420,234895,496117,1809432,157.1,11518,5000,null,0,0,0,0,0," "," "]
[69,"CUMMINGTON"]
[70,"DALTON"]
[71,"DANVERS"]
[72,"DARTMOUTH"]
[73,"DEDHAM"]
[74,"DEERFIELD                    ","Y",null,"2016-06-15",2618948,343754,956092,3918794,405.36,9667,5000,null,0,0,0,0,0," "," "]
[75,"DENNIS"]
[76,"DIGHTON"]
[77,"DOUGLAS                      ","Y",null,"2016-06-15",6500489,1385423,3629069,11514981,1453.58,7922,5000,null,0,0,0,0,0," "," "]
[78,"DOVER"]
[79,"DRACUT                       ","Y",null,"2016-06-15",14946057,1637394,10125890,26709341,3495.47,7641,5000,null,0,0,0,0,0," "," "]
[80,"DUDLEY"]
[81,"DUNSTABLE"]
[82,"DUXBURY"]
[83,"EAST BRIDGEWATER","Y",null,"2016-06-15",9130087,1727661,4489173,15346921,2147.6799999999998,7146,5000,null,0,0,0,0,0," "," "]
[84,"EAST BROOKFIELD"]
[85,"EASTHAM"]
[86,"EASTHAMPTON                  ","Y",null,"2016-06-15",6772890,1227673,4113099,12113662,1385.96,8740,5000,null,31668,51296,19232,102196,57.91,1765,1324]
[87,"EAST LONGMEADOW"]
[88,"EASTON"]
[89,"EDGARTOWN                    ","Y",null,"2016-06-15",3620460,845892,1996474,6462826,323.27,19992,5000,null,0,0,0,0,0," "," "]
[90,"EGREMONT"]
[91,"ERVING"]
[92,"ESSEX"]
[93,"EVERETT"]
[94,"FAIRHAVEN","T",null,"2016-06-15",9361125,1980184,5010117,16351426,1922.44,8506,5000,null,0,0,0,0,0," "," "]
[95,"FALL RIVER                   ","Y",null,"2016-06-15",39308956,7882573,29316929,76508458,9002.35,8499,5000,null,998216,322138,744477,2064831,367.9,5612,4209]
[96,"FALMOUTH                     ","Y",null,"2016-06-15",20547471,3749361,11860002,36156834,3124.3,11573,5000,null,0,244513,0,244513,203.75,1200,900]
[97,"FITCHBURG                    ","Y",null,"2016-06-15",22921906,3210983,13922609,40055498,4579.55,8747,5000,null,0,0,0,0,0," "," "]
[98,"FLORIDA","Y",null,"2016-06-15",483663,121264,368106,973033,77.67,12528,5000,null,0,0,0,0,0," "," "]
[99,"FOXBOROUGH"]
[100,"FRAMINGHAM"]
[101,"FRANKLIN                     ","Y",null,"2016-06-15",27757669,5611235,11695411,45064315,5370.36,8391,5000,null,0,0,0,0,0," "," "]
[102,"FREETOWN"]
[103,"GARDNER                      ","Y",null,"2016-06-15",9567893,2269321,6642042,18479256,2246.17,8227,5000,null,0,0,0,0,0," "," "]
[104,"AQUINNAH"]
[105,"GEORGETOWN                   ","Y",null,"2016-06-15",7484940,1514147,3454914,12454001,1409.14,8838,5000,null,0,0,0,0,0," "," "]
[106,"GILL"]
[107,"GLOUCESTER                   ","Y",null,"2016-06-15",15382562,2823459,9944347,28150368,2583.46,10896,5000,null,468762.87,129508,303041,901311.87,118.5,7606,5000]
[108,"GOSHEN"]
[109,"GOSNOLD"]
[110,"GRAFTON","Y",null,"2016-06-15",13178496,3196204,5345565,21720265,2971.32,7310,5000,null,0,0,0,0,0," "," "]
[111,"GRANBY                       ","Y",null,"2016-06-15",4320559,846625,1866337,7033521,828.83,8486,5000,null,0,0,0,0,0," "," "]
[112,"GRANVILLE"]
[113,"GREAT BARRINGTON"]
[114,"GREENFIELD                   ","Y",null,"2016-06-15",7421519,1755117,5586676,14763312,1581.44,9335,5000,null,0,0,0,0,0," "," "]
[115,"GROTON"]
[116,"GROVELAND"]
[117,"HADLEY                       ","Y",null,"2016-06-15",2768778,865571,1520535,5154884,593.42999999999995,8687,5000,null,0,0,0,0,0," "," "]
[118,"HALIFAX"]
[119,"HAMILTON"]
[120,"HAMPDEN"]
[121,"HANCOCK                      ","Y",null,"2016-06-15",315401,93057,60223,468681,39.380000000000003,11901,5000,null,0,0,0,0,0," "," "]
[122,"HANOVER"]
[123,"HANSON"]
[124,"HARDWICK"]
[125,"HARVARD                      ","Y",null,"2016-06-15",7542699,1178445,3394735,12115879,1114.19,10874,5000,null,0,0,0,0,0," "," "]
[126,"HARWICH                      "]
[127,"HATFIELD                     ","Y",null,"2016-06-15",2400758,567686,1352589,4321033,429.16,10069,5000,null,0,0,0,0,0," "," "]
[128,"HAVERHILL                    ","Y",null,"2016-06-15",26811580,6556223,16867173,50234976,6601.06,7610,5000,null,0,0,0,0,0," "," "]
[129,"HAWLEY"]
[130,"HEATH"]
[131,"HINGHAM"]
[132,"HINSDALE"]
[133,"HOLBROOK","Y",null,"2016-06-15",4807477,1032995,3815579,9656051,1110.8,8693,5000,null,0,0,0,0,0," "," "]
[134,"HOLDEN"]
[135,"HOLLAND                      ","Y",null,"2016-06-15",1183038,256034,599620,2038692,226.11,9016,5000,null,0,0,0,0,0," "," "]
[136,"HOLLISTON                    ","Y",null,"2016-06-15",16001609,2739467,4669840,23410916,2682.39,8728,5000,null,0,0,0,0,0," "," "]
[137,"HOLYOKE                      ","Y",null,"2016-06-15",22653670,4803080,12833489,40290239,4652.67,8660,5000,null,1712384.21,295070,970080,2977534.21,285.83,10417,5000]
[138,"HOPEDALE                     ","Y",null,"2016-06-15",5531903,1110646,2552253,9194802,1159.23,7932,5000,null,0,0,0,0,0," "," "]
[139,"HOPKINTON"]
[140,"HUBBARDSTON"]
[141,"HUDSON                       ","Y",null,"2016-06-15",16380862,3239611,6424736,26045209,2700.18,9646,5000,null,0,0,0,0,0," "," "]
[142,"HULL"]
[143,"HUNTINGTON"]
[144,"IPSWICH                      ","Y",null,"2016-06-15",10156906,1654472,4383103,16194481,1821.95,8889,5000,null,0,0,0,0,0," "," "]
[145,"KINGSTON"]
[146,"LAKEVILLE"]
[147,"LANCASTER"]
[148,"LANESBOROUGH                 ","Y",null,"2016-06-15",1161849,217443,870148,2249440,201.65,11155,5000,null,0,0,0,0,0," "," "]
[149,"LAWRENCE"]
[150,"LEE                          ","Y",null,"2016-06-15",4296455,903310,2859290,8059055,657.03,12266,5000,null,0,0,0,0,0," "," "]
[151,"LEICESTER                    ","Y",null,"2016-06-15",7627232,1427495,4087606,13142333,1527.8,8602,5000,null,0,0,0,0,0," "," "]
[152,"LENOX                        ","Y",null,"2016-06-15",6055396,1016233,3271455,10343084,710.93,14549,5000,null,0,0,0,0,0," "," "]
[153,"LEOMINSTER                   ","Y",null,"2016-06-15",25160817,3996265,13797111,42954193,5042.74,8518,5000,null,3528965,473427,1935132,5937524,597.4,9939,5000]
[154,"LEVERETT                     ","Y",null,"2016-06-15",821639,291853,555891,1669383,126.92,13153,5000,null,0,0,0,0,0," "," "]
[155,"LEXINGTON"]
[156,"LEYDEN"]
[157,"LINCOLN"]
[158,"LITTLETON                    ","Y",null,"2016-06-15",7826381,1334620,3995950,13156951,1512.94,8696,5000,null,0,0,0,0,0," "," "]
[159,"LONGMEADOW                   ","Y",null,"2016-06-15",16309500,3169596,7154084,26633180,2722.64,9782,5000,null,1901,7881,834,10616,6.77,1568,1176]
[160,"LOWELL"]
[161,"LUDLOW                       ","Y",null,"2016-06-15",12437539,2482146,7512333,22432018,2476.37,9058,5000,null,9247,35442,5585,50274,35.36,1422,1067]
[162,"LUNENBURG                    ","Y",null,"2016-06-15",7096047,1221563,3662675,11980285,1470.97,8144,5000,null,0,0,0,0,0," "," "]
[163,"LYNN"]
[164,"LYNNFIELD"]
[165,"MALDEN"]
[166,"MANCHESTER"]
[167,"MANSFIELD"]
[168,"MARBLEHEAD                   "]
[169,"MARION"]
[170,"MARLBOROUGH"]
[171,"MARSHFIELD                   ","Y",null,"2016-06-15",25223243,3391314,8474044,37088601,3960.79,9364,5000,null,7340,40713,2466,50519,47.55,1062,797]
[172,"MASHPEE","Y",null,"2016-06-15",10021897,2353669,6414320,18789886,1582.44,11874,5000,null,0,0,0,0,0," "," "]
[173,"MATTAPOISETT","Y",null,"2016-06-15",2558789,575980,1643536,4778305,488.59,9780,5000,null,0,0,0,0,0," "," "]
[174,"MAYNARD                      ","Y",null,"2016-06-15",7002220,1578840,4301693,12882753,1342.39,9597,5000,null,0,0,0,0,0," "," "]
[175,"MEDFIELD"]
[176,"MEDFORD"]
[177,"MEDWAY                       ","Y",null,"2016-06-15",13277689,2271085,6226308,21775082,2305.96,9443,5000,null,0,0,0,0,0," "," "]
[178,"MELROSE","Y",null,"2016-06-15",12703508,2796914,8775907,24276329,3535.91,6866,5000,null,0,0,0,0,0," "," "]
[179,"MENDON"]
[180,"MERRIMAC"]
[181,"METHUEN"]
[182,"MIDDLEBOROUGH                ","Y",null,"2016-06-15",15048281,2631491,8987002,26666774,2922.94,9123,5000,null,0,0,0,0,0," "," "]
[183,"MIDDLEFIELD"]
[184,"MIDDLETON"]
[185,"MILFORD                      ","Y",null,"2016-06-15",21173357,3283944,10302891,34760192,3884.65,8948,5000,null,2527,14287,1230,18044,16.899999999999999,1068,801]
[186,"MILLBURY"]
[187,"MILLIS                       ","Y",null,"2016-06-15",7497798,1445294,3429359,12372451,1330.03,9302,5000,null,0,0,0,0,0," "," "]
[188,"MILLVILLE"]
[189,"MILTON"]
[190,"MONROE"]
[191,"MONSON","Y",null,"2016-06-15",5029149,1246974,2472837,8748960,1031.98,8478,5000,null,0,0,0,0,0," "," "]
[192,"MONTAGUE"]
[193,"MONTEREY"]
[194,"MONTGOMERY"]
[195,"MOUNT WASHINGTON"]
[196,"NAHANT"]
[197,"NANTUCKET"]
[198,"NATICK","Y",null,"2016-06-15",27733116,4956110,14601140,47290366,5065.07,9337,5000,null,0,0,0,0,0," "," "]
[199,"NEEDHAM"]
[200,"NEW ASHFORD"]
[201,"NEW BEDFORD","T",null,"2016-06-15",51799139,9669846,31205604,92674589,11512.06,8050,5000,null,0,0,0,0,0," "," "]
[202,"NEW BRAINTREE"]
[203,"NEWBURY"]
[204,"NEWBURYPORT                  ","Y",null,"2016-06-15",12518092,2303905,6434941,21256938,2256.88,9419,5000,null,0,0,0,0,0," "," "]
[205,"NEW MARLBOROUGH"]
[206,"NEW SALEM"]
[207,"NEWTON"]
[208,"NORFOLK"]
[209,"NORTH ADAMS                  ","Y",null,"2016-06-15",7976369,1373935,5640901,14991205,1354.58,11067,5000,null,0,0,0,0,0," "," "]
[210,"NORTHAMPTON                  ","Y",null,"2016-06-15",12460287,2370813,7774163,22605263,2482.9499999999998,9104,5000,null,0,0,0,0,0," "," "]
[211,"NORTH ANDOVER"]
[212,"NORTH ATTLEBOROUGH"]
[213,"NORTHBOROUGH"]
[214,"NORTHBRIDGE                  ","Y",null,"2016-06-15",10733521,1759830,6410069,18903420,2284.23,8276,5000,null,0,0,0,0,0," "," "]
[215,"NORTH BROOKFIELD             ","Y",null,"2016-06-15",3066329,495848,2159589,5721766,538.35,10628,5000,null,0,0,0,0,0," "," "]
[216,"NORTHFIELD"]
[217,"NORTH READING"]
[218,"NORTON","Y",null,"2016-06-15",10472654,1991464,6642331,19106449,2390.83,7992,5000,null,0,0,0,0,0," "," "]
[219,"NORWELL"]
[220,"NORWOOD"]
[221,"OAK BLUFFS                   ","Y",null,"2016-06-15",3699555,704389,1658464,6062408,383.66,15802,5000,null,0,0,0,0,0," "," "]
[222,"OAKHAM"]
[223,"ORANGE                       ","Y",null,"2016-06-15",2396864,435023,1515181,4347068,590.45000000000005,7362,5000,null,0,0,0,0,0," "," "]
[224,"ORLEANS","Y",null,"2016-06-15",1691425,405216,1016788,3113429,210.4,14798,5000,null,0,0,0,0,0," "," "]
[225,"OTIS"]
[226,"OXFORD","Y",null,"2016-06-15",9348784,1492301,5284502,16125587,1737.12,9283,5000,null,0,0,0,0,0," "," "]
[227,"PALMER","Y",null,"2016-06-15",6490797,1386881,4185784,12063462,1325.49,9101,5000,null,0,0,0,0,0," "," "]
[228,"PAXTON"]
[229,"PEABODY","Y",null,"2016-06-15",28399424,3862619,16569136,48831179,5206.53,9379,5000,null,805824,290305,470144,1566273,391.31,4003,3002]
[230,"PELHAM                       ","Y",null,"2016-06-15",898842,197792,474184,1570818,115.47,13604,5000,null,0,0,0,0,0," "," "]
[231,"PEMBROKE"]
[232,"PEPPERELL"]
[233,"PERU"]
[234,"PETERSHAM                    ","Y",null,"2016-06-15",763212,184753,477061,1425026,110.72,12871,5000,null,0,0,0,0,0," "," "]
[235,"PHILLIPSTON"]
[236,"PITTSFIELD                   ","Y",null,"2016-06-15",27989453,3869249,17977761,49836463,4986.37,9995,5000,null,3881505,270075,2493109,6644689,348.05,19091,5000]
[237,"PLAINFIELD"]
[238,"PLAINVILLE"]
[239,"PLYMOUTH"]
[240,"PLYMPTON","Y",null,"2016-06-15",1371305,264754,661000,2297059,209.64,10957,5000,null,0,0,0,0,0," "," "]
[241,"PRINCETON"]
[242,"PROVINCETOWN                 ","Y",null,"2016-06-15",1540862,333029,1351384,3225275,105.94,30444,5000,null,0,0,0,0,0," "," "]
[243,"QUINCY"]
[244,"RANDOLPH","Y",null,"2016-06-15",15462717,4141513,8966983,28571213,2695.09,10601,5000,null,0,0,0,0,0," "," "]
[245,"RAYNHAM"]
[246,"READING"]
[247,"REHOBOTH"]
[248,"REVERE"]
[249,"RICHMOND                     ","Y",null,"2016-06-15",1594078,220608,673662,2488348,157.34,15815,5000,null,0,0,0,0,0," "," "]
[250,"ROCHESTER"]
[251,"ROCKLAND","Y",null,"2016-06-15",8964198,2505586,7310552,18780336,2125.91,8834,5000,null,0,0,0,0,0," "," "]
[252,"ROCKPORT                     ","Y",null,"2016-06-15",5926190,862944,3300170,10089304,907.3,11120,5000,null,0,0,0,0,0," "," "]
[253,"ROWE                         ","Y",null,"2016-06-15",511827,237177,329801,1078805,62.41,17286,5000,null,0,0,0,0,0," "," "]
[254,"ROWLEY"]
[255,"ROYALSTON"]
[256,"RUSSELL"]
[257,"RUTLAND"]
[258,"SALEM"]
[259,"SALISBURY"]
[260,"SANDISFIELD"]
[261,"SANDWICH","Y",null,"2016-06-15",15480974,3488630,9522600,28492204,2746.67,10373,5000,null,0,0,0,0,0," "," "]
[262,"SAUGUS"]
[263,"SAVOY                        ","Y",null,"2016-06-15",225862,43711,233037,502610,35.979999999999997,13969,5000,null,0,0,0,0,0," "," "]
[264,"SCITUATE"]
[265,"SEEKONK"]
[266,"SHARON"]
[267,"SHEFFIELD"]
[268,"SHELBURNE"]
[269,"SHERBORN"]
[270,"SHIRLEY                      "]
[271,"SHREWSBURY"]
[272,"SHUTESBURY"]
[273,"SOMERSET"]
[274,"SOMERVILLE"]
[275,"SOUTHAMPTON                  ","Y",null,"2016-06-15",2282915,282667,874294,3439876,501.79,6855,5000,null,0,0,0,0,0," "," "]
[276,"SOUTHBOROUGH"]
[277,"SOUTHBRIDGE                  ","Y",null,"2016-06-15",9273803,2103002,4818584,16195389,2111.69,7669,5000,null,0,0,0,0,0," "," "]
[278,"SOUTH HADLEY                 ","Y",null,"2016-06-15",9809949,2038935,4937464,16786348,1732.78,9688,5000,null,355902,35936,179130,570968,30.54,18696,5000]
[279,"SOUTHWICK"]
[280,"SPENCER"]
[281,"SPRINGFIELD                  ","Y",null,"2016-06-15",120593309,24719340,71224460,216537109,21922.080000000002,9878,5000,null,3560994,1117587,2103183,6781764,991.12,6843,5000]
[282,"STERLING"]
[283,"STOCKBRIDGE"]
[284,"STONEHAM"]
[285,"STOUGHTON"]
[286,"STOW"]
[287,"STURBRIDGE"]
[288,"SUDBURY"]
[289,"SUNDERLAND                   ","Y",null,"2016-06-15",1361310,227595,396247,1985152,191.7,10356,5000,null,0,0,0,0,0," "," "]
[290,"SUTTON                       ","Y",null,"2016-06-15",6740027,1341976,3210706,11292709,1422.95,7936,5000,null,0,0,0,0,0," "," "]
[291,"SWAMPSCOTT","T",null,"2016-06-15",12269913,2253160,6547050,21070123,2136.14,9864,5000,null,0,0,0,0,0," "," "]
[292,"SWANSEA"]
[293,"TAUNTON                      ","Y",null,"2016-06-15",31578622,4933283,16743509,53255414,6645.48,8014,5000,null,2114665,539044,1121230,3774939,726.13,5199,3899]
[294,"TEMPLETON"]
[295,"TEWKSBURY"]
[296,"TISBURY                      ","Y",null,"2016-06-15",3269545,699498,1857812,5826855,352.39,16535,5000,null,0,0,0,0,0," "," "]
[297,"TOLLAND"]
[298,"TOPSFIELD"]
[299,"TOWNSEND"]
[300,"TRURO                        ","Y",null,"2016-06-15",1161007,365108,771324,2297439,118.61,19370,5000,null,0,0,0,0,0," "," "]
[301,"TYNGSBOROUGH                 ","Y",null,"2016-06-15",8460056,1800556,3729180,13989792,1648.46,8487,5000,null,0,0,0,0,0," "," "]
[302,"TYRINGHAM"]
[303,"UPTON"]
[304,"UXBRIDGE                     ","Y",null,"2016-06-15",8200065,1843382,4322248,14365695,1730.34,8302,5000,null,0,0,0,0,0," "," "]
[305,"WAKEFIELD"]
[306,"WALES                        ","Y",null,"2016-06-15",730281,235320,498916,1464517,157.72,9286,5000,null,0,0,0,0,0," "," "]
[307,"WALPOLE"]
[308,"WALTHAM"]
[309,"WARE                         ","Y",null,"2016-06-15",4993703,1034114,3315335,9343152,1143.54,8170,5000,null,0,0,0,0,0," "," "]
[310,"WAREHAM                      ","Y",null,"2016-06-15",11687329,1908923,7833262,21429514,2148.96,9972,5000,null,79819,208742,53497,342058,234.99,1456,1092]
[311,"WARREN"]
[312,"WARWICK"]
[313,"WASHINGTON"]
[314,"WATERTOWN"]
[315,"WAYLAND"]
[316,"WEBSTER                      ","Y",null,"2016-06-15",8326941,1451524,4856651,14635116,1719.74,8510,5000,null,81862,22021,47746,151629,26.09,5812,4359]
[317,"WELLESLEY"]
[318,"WELLFLEET"]
[319,"WENDELL"]
[320,"WENHAM"]
[321,"WESTBOROUGH                  "]
[322,"WEST BOYLSTON                ","Y",null,"2016-06-15",5209822,876833,3057627,9144282,869.84,10513,5000,null,0,0,0,0,0," "," "]
[323,"WEST BRIDGEWATER             ","Y",null,"2016-06-15",6441500,1484083,2703318,10628901,1259.79,8437,5000,null,0,0,0,0,0," "," "]
[324,"WEST BROOKFIELD"]
[325,"WESTFIELD                    ","Y",null,"2016-06-15",25494499,5065224,14559705,45119428,4789.1400000000003,9421,5000,null,2747617,463197,1569142,4779956,437.95,10914,5000]
[326,"WESTFORD                     ","Y",null,"2016-06-15",28875629,4531533,12969957,46377119,4908.43,9448,5000,null,0,0,0,0,0," "," "]
[327,"WESTHAMPTON                  ","Y",null,"2016-06-15",866207,198533,432428,1497168,133.66,11201,5000,null,0,0,0,0,0," "," "]
[328,"WESTMINSTER"]
[329,"WEST NEWBURY"]
[330,"WESTON"]
[331,"WESTPORT                     "]
[332,"WEST SPRINGFIELD             ","Y",null,"2016-06-15",18245944,3464642,8745133,30455719,3609.31,8438,5000,null,54038,68125,25900,148063,70.97,2086,1565]
[333,"WEST STOCKBRIDGE"]
[334,"WEST TISBURY"]
[335,"WESTWOOD"]
[336,"WEYMOUTH"]
[337,"WHATELY                      ","Y",null,"2016-06-15",893721,289577,552578,1735876,126.46,13727,5000,null,0,0,0,0,0," "," "]
[338,"WHITMAN"]
[339,"WILBRAHAM"]
[340,"WILLIAMSBURG                 ","Y",null,"2016-06-15",1004654,180944,439159,1624757,147.72,10999,5000,null,0,0,0,0,0," "," "]
[341,"WILLIAMSTOWN                 ","Y",null,"2016-06-15",2663941,313430,1304653,4282024,431.88,9915,5000,null,0,0,0,0,0," "," "]
[342,"WILMINGTON"]
[343,"WINCHENDON                   ","Y",null,"2016-06-15",7409078,847407,3448427,11704912,1246.42,9391,5000,null,0,0,0,0,0," "," "]
[344,"WINCHESTER"]
[345,"WINDSOR"]
[346,"WINTHROP                     ","Y",null,"2016-06-15",8149562,1727825,4814956,14692343,1797.02,8176,5000,null,0,0,0,0,0," "," "]
[347,"WOBURN"]
[348,"WORCESTER                    ","Y",null,"2016-06-15",118605341,18483375,61831041,198919757,21450.38,9273,5000,null,7954669.7934426246,1500488,4146909,13602066.793442626,1741.35,7811,5000]
[349,"WORTHINGTON","Y",null,"2016-06-15",{"$error":"#DIV/0!"},{"$error":"#DIV/0!"},{"$error":"#DIV/0!"},{"$error":"#DIV/0!"},0," ",0,null,{"$error":"#DIV/0!"},{"$error":"#DIV/0!"},{"$error":"#DIV/0!"},{"$error":"#DIV/0!"},0," "," "]
[350,"WRENTHAM"]
[351,"YARMOUTH"]
[406,"NORTHAMPTON SMITH"]
[600,"ACTON BOXBOROUGH             ","Y",null,"2016-06-15",30160947,6118284,13917678,50196909,5407.2,9283,5000,null,0,0,0,0,0," "," "]
[603,"ADAMS CHESHIRE               ","Y",null,"2016-06-15",5871744,1212070,4550495,11634309,1284.04,9061,5000,null,0,0,0,0,0," "," "]
[605,"AMHERST PELHAM               ","Y",null,"2016-06-15",8741410,2454773,5794513,16990696,1336.05,12717,5000,null,0,0,0,0,0," "," "]
[610,"ASHBURNHAM WESTMINSTER       ","Y",null,"2016-06-15",10652269,2279930,5305586,18237785,2189.0500000000002,8331,5000,null,0,0,0,0,0," "," "]
[615,"ATHOL ROYALSTON              ","Y",null,"2016-06-15",5645560,1777847,4033402,11456809,1244.5,9206,5000,null,0,0,0,0,0," "," "]
[616,"AYER SHIRLEY","Y",null,"2016-06-15",8055153,1715848,4136584,13907585,1522.19,9137,5000,null,0,0,0,0,0," "," "]
[618,"BERKSHIRE HILLS              ","Y",null,"2016-06-15",7295560,1784280,5555490,14635330,1218.98,12006,5000,null,416799.57999999996,90167,317388,824354.58,61.6,13382,5000]
[620,"BERLIN BOYLSTON              ","Y",null,"2016-06-15",2985046,630079,1592194,5207319,520.72,10000,5000,null,0,0,0,0,0," "," "]
[622,"BLACKSTONE MILLVILLE         ","Y",null,"2016-06-15",8197824,2203169,4232827,14633820,1664.58,8791,5000,null,0,0,0,0,0," "," "]
[625,"BRIDGEWATER RAYNHAM          ","Y",null,"2016-06-15",24134817,4204100,13725320,42064237,5022.6099999999997,8375,5000,null,0,0,0,0,0," "," "]
[632,"CHESTERFIELD GOSHEN","Y",null,"2016-06-15",875241,219646,438065,1532952,146.15,10489,5000,null,0,0,0,0,0," "," "]
[635,"CENTRAL BERKSHIRE            ","Y",null,"2016-06-15",9813649,2037786,6965265,18816700,1636.11,11501,5000,null,0,0,0,0,0," "," "]
[640,"CONCORD CARLISLE"]
[645,"DENNIS YARMOUTH              ","Y",null,"2016-06-15",17139091,4008691,8919880,30067662,2814.05,10685,5000,null,679757.94,0,353774,1033531.94,0," "," "]
[650,"DIGHTON REHOBOTH","Y",null,"2016-06-15",13614893,2407934,6771098,22793925,2571.5100000000002,8864,5000,null,846192,211306,420837,1478335,225.66,6551,4913]
[655,"DOVER SHERBORN"]
[658,"DUDLEY CHARLTON              ","Y",null,"2016-06-15",17882336,2747557,8525272,29155165,3827.83,7617,5000,null,0,0,0,0,0," "," "]
[660,"NAUSET                       ","Y",null,"2016-06-15",11110206,2117984,5335750,18563940,1443.04,12864,5000,null,0,0,0,0,0," "," "]
[662,"FARMINGTON RIVER","Y",null,"2016-06-15",738679,302553,880068,1921300,118.3,16241,5000,null,0,0,0,0,0," "," "]
[665,"FREETOWN LAKEVILLE","Y",null,"2016-06-15",11920832,2267704,7106850,21295386,2727.28,7808,5000,null,0,0,0,0,0," "," "]
[670,"FRONTIER                     ","Y",null,"2016-06-15",3648701,738954,2383144,6770799,555.84,12181,5000,null,0,0,0,0,0," "," "]
[672,"GATEWAY                      ","Y",null,"2016-06-15",4859885,947044,3039144,8846073,836.83,10571,5000,null,66165,61055,41376,168596,53.95,3125,2344]
[673,"GROTON DUNSTABLE             ","Y",null,"2016-06-15",12258853,1946317,7015987,21221157,2431.02,8729,5000,null,0,0,0,0,0," "," "]
[674,"GILL MONTAGUE                ","Y",null,"2016-06-15",4783863,1668005,3690361,10142229,890.08,11395,5000,null,0,0,0,0,0," "," "]
[675,"HAMILTON WENHAM              ","Y",null,"2016-06-15",11370959,2553024,5002970,18926953,1776.3,10655,5000,null,5771,0,2539,8310,0," "," "]
[680,"HAMPDEN WILBRAHAM            ","Y",null,"2016-06-15",15032651,2905475,8549034,26487160,3044.2,8701,5000,null,1666,17180,947,19793,18,1100,825]
[683,"HAMPSHIRE                    ","Y",null,"2016-06-15",4215112,997429,2428903,7641444,691.1,11057,5000,null,0,0,0,0,0," "," "]
[685,"HAWLEMONT                    ","Y",null,"2016-06-15",473920,199325,359594,1032839,102.39,10087,5000,null,0,0,0,0,0," "," "]
[690,"KING PHILIP"]
[695,"LINCOLN SUDBURY"]
[698,"MANCHESTER ESSEX","Y",null,"2016-06-15",8929531,1984803,4254396,15168730,1433.32,10583,5000,null,0,0,0,0,0," "," "]
[700,"MARTHAS VINEYARD"]
[705,"MASCONOMET"]
[710,"MENDON UPTON                 ","Y",null,"2016-06-15",11654014,1670625,5927401,19252040,2211.17,8707,5000,null,0,0,0,0,0," "," "]
[712,"MONOMOY","Y",null,"2016-06-15",13070903,2436974,7902728,23410605,1823.69,12837,5000,null,0,0,0,0,0," "," "]
[715,"MOUNT GREYLOCK               ","Y",null,"2016-06-15",3900077,794391,2760174,7454642,514.1,14500,5000,null,0,0,0,0,0," "," "]
[717,"MOHAWK TRAIL                 ","Y",null,"2016-06-15",4890466,1394090,3477351,9761907,888.06,10992,5000,null,0,0,0,0,0," "," "]
[720,"NARRAGANSETT                 ","Y",null,"2016-06-15",6118525,1438967,3721026,11278518,1260.07,8951,5000,null,3278,21640,1994,26912,18.95,1420,1065]
[725,"NASHOBA                      ","Y",null,"2016-06-15",20045364,4075384,9564464,33685212,3304.31,10194,5000,null,0,0,0,0,0," "," "]
[728,"NEW SALEM WENDELL            ","Y",null,"2016-06-15",646457,246985,487609,1381051,143,9658,5000,null,0,0,0,0,0," "," "]
[730,"NORTHBORO SOUTHBORO"]
[735,"NORTH MIDDLESEX              ","Y",null,"2016-06-15",14752761,3095579,8723494,26571834,3066.36,8666,5000,null,0,0,0,0,0," "," "]
[740,"OLD ROCHESTER","Y",null,"2016-06-15",6589590,1436001,4116205,12141796,1208.69,10045,5000,null,0,0,0,0,0," "," "]
[745,"PENTUCKET                    ","Y",null,"2016-06-15",13589151,2373833,6863365,22826349,2538.85,8991,5000,null,0,0,0,0,0," "," "]
[750,"PIONEER                      ","Y",null,"2016-06-15",4878730,1052502,4208499,10139731,831.81,12190,5000,null,0,0,0,0,0," "," "]
[753,"QUABBIN                      ","Y",null,"2016-06-15",11910173,2780452,7011728,21702353,2307.06,9407,5000,null,0,0,0,0,0," "," "]
[755,"RALPH C MAHAR                ","Y",null,"2016-06-15",3880911,1279482,2697457,7857850,768.92,10219,5000,null,0,0,0,0,0," "," "]
[760,"SILVER LAKE"]
[763,"SOMERSET BERKLEY","Y",null,"2016-06-15",6348620,1302137,3283338,10934095,846.98,12910,5000,null,0,68091,0,68091,44.29,1537,1153]
[765,"SOUTHERN BERKSHIRE           ","Y",null,"2016-06-15",5751128,1189601,3850988,10791717,733.25,14718,5000,null,0,0,0,0,0," "," "]
[766,"SOUTHWICK TOLLAND","Y",null,"2016-06-15",8759458,1822330,3506584,14088372,1505.02,9361,5000,null,0,49463,0,49463,40.85,1211,908]
[767,"SPENCER EAST BROOKFIELD      ","Y",null,"2016-06-15",6623935,1400436,4829245,12853616,1398.09,9194,5000,null,31331,177457,22842,231630,177.16,1307,980]
[770,"TANTASQUA                    ","Y",null,"2016-06-15",8098336,1308443,3819897,13226676,1258.56,10509,5000,null,2448537,458729,1154948,4062214,441.24,9206,5000]
[773,"TRITON                       ","Y",null,"2016-06-15",15309727,2315981,8353605,25979313,2585.5500000000002,10048,5000,null,0,0,0,0,0," "," "]
[774,"UPISLAND","Y",null,"2016-06-15",3604701,935121,2064313,6604135,330.05,20009,5000,null,0,0,0,0,0," "," "]
[775,"WACHUSETT                    ","Y",null,"2016-06-15",30555846,5523854,15011417,51091117,6987.41,7312,5000,null,2496.88,0,1226,3722.88,0," "," "]
[778,"QUABOAG","Y",null,"2016-06-15",6008677,1026865,3306892,10342434,1313.42,7874,5000,null,0,0,0,0,0," "," "]
[780,"WHITMAN HANSON","Y",null,"2016-06-15",17811630,3559353,9703937,31074920,3824.04,8126,5000,null,0,0,0,0,0," "," "]
[801,"ASSABET VALLEY"]
[805,"BLACKSTONE VALLEY"]
[806,"BLUE HILLS"]
[810,"BRISTOL PLYMOUTH"]
[815,"CAPE COD"]
[817,"NORTH SHORE","Y",null,"2016-06-15",0,0,0,0,0," ",0,null,9149532.0700000003,1991289,6483141,17623962.07,1035.54,17019,5000]
[818,"FRANKLIN COUNTY"]
[821,"GREATER FALL RIVER"]
[823,"GREATER LAWRENCE             ","Y",null,"2016-06-15",203335,35695,156636,395666,19.04,20781,5000,null,10835306.92,2288791,8346815,21470912.920000002,1220.8699999999999,17587,5000]
[825,"GREATER NEW BEDFORD"]
[828,"GREATER LOWELL               ","Y",null,"2016-06-15",396038,13643,277699,687380,11.7,58750,5000,null,16256548.359999998,2242752,11398966,29898266.359999999,1923.35,15545,5000]
[829,"SOUTH MIDDLESEX"]
[830,"MINUTEMAN"]
[832,"MONTACHUSETT                 ","Y",null,"2016-06-15",0,0,0,0,0," ",0,null,11115669.800000001,1940351,7907874,20963894.800000001,1340.37,15640,5000]
[851,"NORTHERN BERKSHIRE"]
[852,"NASHOBA VALLEY               ","Y",null,"2016-06-15",0,0,0,0,0," ",0,null,5292164,932830,3732818,9957812,658.86,15114,5000]
[853,"NORTHEAST METROPOLITAN       ","Y",null,"2016-06-15",0,0,0,0,0," ",0,null,9579585,1515476,7518073,18613134,1157.19,16085,5000]
[855,"OLD COLONY"]
[860,"PATHFINDER                   ","Y",null,"2016-06-15",0,0,0,0,0," ",0,null,5804424.3300000001,853289,3415086,10072799.33,559.47,18004,5000]
[871,"SHAWSHEEN VALLEY"]
[872,"SOUTHEASTERN"]
[873,"SOUTH SHORE"]
[876,"SOUTHERN WORCESTER"]
[878,"TRI COUNTY"]
[879,"UPPER CAPE COD"]
[885,"WHITTIER                     ","Y",null,"2016-06-15",null,null,null,null,null,null,null,null,9882685,1880283,6268594,18031562,1189.8399999999999,15155,5000]
[910,"BRISTOL COUNTY"]
[915,"NORFOLK COUNTY"]

{"sheet":"webmessage","index":8,"n_rows":447,"n_cols":21,"rows_kept":447,"cut":false,"hidden":true,"merged":[]}
[null,null,null,null,null,null,null,"updated 6/15/2016"]
[]
[null,null,null,null,null,null,"0NO - don't show, non-op"]
[null,null,null,null,null,null,"1NO - not choice district"]
[null,null,null,null,null,null,"1Y0  - show"]
[null,null,null,null,null,null,"1Y2 - est $5k rate in use"]
[null,null,null,"which",null,null,"1T0 - tuition agreement",null,null,"for input to choicecalc"]
[null,null,null,"year's"]
["lea","opcode","choice?","rate?",null,"dist","Status","comment","lea","choice?","bad","reg","voke",null,null,null,null,"lea"]
[{"$f":"VALUE(E10)","v":1},1,{"$f":"IF(dataout!C10=\"Y\",\"Y\",IF(dataout!C10=\"T\",\"T\",\"N\"))","v":"Y"},{"$f":"IF(AND(dataout!C10=\"Y\",dataout!D10=\"not in\"),2,0)","v":0},"001","ABINGTON                     ",{"$f":"B10&C10&D10","v":"1Y0"},null,{"$f":"A10","v":1},{"$f":"C10","v":"Y"},{"$f":"IF(G10=\"1Y2\",\"bad\",\" \")","v":" "},{"$f":"dataout!L10","v":5000},{"$f":"dataout!T10","v":" "},{"$f":"O10-A10","v":0},1,"ABINGTON",null,252,"ROCKPORT","y","bad"]
[{"$f":"VALUE(E11)","v":2},0,{"$f":"IF(dataout!C11=\"Y\",\"Y\",IF(dataout!C11=\"T\",\"T\",\"N\"))","v":"N"},{"$f":"IF(AND(dataout!C11=\"Y\",dataout!D11=\"not in\"),2,0)","v":0},"002","ACTON                        ",{"$f":"B11&C11&D11","v":"0N0"},"You have chosen a non-operating school district",{"$f":"A11","v":2},{"$f":"C11","v":"N"},{"$f":"IF(G11=\"1Y2\",\"bad\",\" \")","v":" "},{"$f":"dataout!L11","v":0},{"$f":"dataout!T11","v":0},{"$f":"O11-A11","v":0},2,"ACTON",null,337,"WHATELY","y","bad"]
[3,1,{"$f":"IF(dataout!C12=\"Y\",\"Y\",IF(dataout!C12=\"T\",\"T\",\"N\"))","v":"N"},{"$f":"IF(AND(dataout!C12=\"Y\",dataout!D12=\"not in\"),2,0)","v":0},"003","ACUSHNET                     ","1N0","You have chosen a district that does not enroll school choice pupils in FY16",3,"N"," ",{"$f":"dataout!L12","v":0},{"$f":"dataout!T12","v":0},0,3,"ACUSHNET",null,343,"WINCHENDON","y","bad"]
[4,0,{"$f":"IF(dataout!C13=\"Y\",\"Y\",IF(dataout!C13=\"T\",\"T\",\"N\"))","v":"N"},{"$f":"IF(AND(dataout!C13=\"Y\",dataout!D13=\"not in\"),2,0)","v":0},"004","ADAMS                        ","0N0","You have chosen a non-operating school district",4,"N"," ",{"$f":"dataout!L13","v":0},{"$f":"dataout!T13","v":0},0,4,"ADAMS",null,349,"WORTHINGTON","y","bad"]
[5,1,{"$f":"IF(dataout!C14=\"Y\",\"Y\",IF(dataout!C14=\"T\",\"T\",\"N\"))","v":"Y"},{"$f":"IF(AND(dataout!C14=\"Y\",dataout!D14=\"not in\"),2,0)","v":0},"005","AGAWAM                       ","1Y0",null,5,"Y"," ",{"$f":"dataout!L14","v":5000},{"$f":"dataout!T14","v":721},0,5,"AGAWAM                       ",null,750,"PIONEER","y","bad"]
[6,0,{"$f":"IF(dataout!C15=\"Y\",\"Y\",IF(dataout!C15=\"T\",\"T\",\"N\"))","v":"N"},{"$f":"IF(AND(dataout!C15=\"Y\",dataout!D15=\"not in\"),2,0)","v":0},"006","ALFORD                       ","0N0","You have chosen a non-operating school district",6,"N"," ",{"$f":"dataout!L15","v":0},{"$f":"dataout!T15","v":0},0,6,"ALFORD",null,7,"AMESBURY","y","notin"]
[7,1,{"$f":"IF(dataout!C16=\"Y\",\"Y\",IF(dataout!C16=\"T\",\"T\",\"N\"))","v":"Y"},{"$f":"IF(AND(dataout!C16=\"Y\",dataout!D16=\"not in\"),2,0)","v":0},"007","AMESBURY                     ","1Y0",null,7,"Y"," ",{"$f":"dataout!L16","v":5000},{"$f":"dataout!T16","v":" "},0,7,"AMESBURY                     ",null,44,"BROCKTON","y","notin"]
[8,1,{"$f":"IF(dataout!C17=\"Y\",\"Y\",IF(dataout!C17=\"T\",\"T\",\"N\"))","v":"Y"},{"$f":"IF(AND(dataout!C17=\"Y\",dataout!D17=\"not in\"),2,0)","v":0},"008","AMHERST                      ","1Y0",null,8,"Y"," ",{"$f":"dataout!L17","v":5000},{"$f":"dataout!T17","v":" "},0,8,"AMHERST",null,56,"CHELMSFORD","y","notin"]
[9,1,{"$f":"IF(dataout!C18=\"Y\",\"Y\",IF(dataout!C18=\"T\",\"T\",\"N\"))","v":"N"},{"$f":"IF(AND(dataout!C18=\"Y\",dataout!D18=\"not in\"),2,0)","v":0},"009","ANDOVER                      ","1N0","You have chosen a district that does not enroll school choice pupils in FY16",9,"N"," ",{"$f":"dataout!L18","v":0},{"$f":"dataout!T18","v":0},0,9,"ANDOVER",null,64,"CLINTON","y","notin"]
[10,1,{"$f":"IF(dataout!C19=\"Y\",\"Y\",IF(dataout!C19=\"T\",\"T\",\"N\"))","v":"N"},{"$f":"IF(AND(dataout!C19=\"Y\",dataout!D19=\"not in\"),2,0)","v":0},"010","ARLINGTON                    ","1N0","You have chosen a district that does not enroll school choice pupils in FY16",10,"N"," ",{"$f":"dataout!L19","v":0},{"$f":"dataout!T19","v":0},0,10,"ARLINGTON",null,77,"DOUGLAS","y","notin"]
[11,0,{"$f":"IF(dataout!C20=\"Y\",\"Y\",IF(dataout!C20=\"T\",\"T\",\"N\"))","v":"N"},{"$f":"IF(AND(dataout!C20=\"Y\",dataout!D20=\"not in\"),2,0)","v":0},"011","ASHBURNHAM                   ","0N0","You have chosen a non-operating school district",11,"N"," ",{"$f":"dataout!L20","v":0},{"$f":"dataout!T20","v":0},0,11,"ASHBURNHAM",null,97,"FITCHBURG","y","notin"]
[12,0,{"$f":"IF(dataout!C21=\"Y\",\"Y\",IF(dataout!C21=\"T\",\"T\",\"N\"))","v":"N"},{"$f":"IF(AND(dataout!C21=\"Y\",dataout!D21=\"not in\"),2,0)","v":0},"012","ASHBY                        ","0N0","You have chosen a non-operating school district",12,"N"," ",{"$f":"dataout!L21","v":0},{"$f":"dataout!T21","v":0},0,12,"ASHBY",null,105,"GEORGETOWN","y","notin"]
[13,0,{"$f":"IF(dataout!C22=\"Y\",\"Y\",IF(dataout!C22=\"T\",\"T\",\"N\"))","v":"N"},{"$f":"IF(AND(dataout!C22=\"Y\",dataout!D22=\"not in\"),2,0)","v":0},"013","ASHFIELD                     ","0N0","You have chosen a non-operating school district",13,"N"," ",{"$f":"dataout!L22","v":0},{"$f":"dataout!T22","v":0},0,13,"ASHFIELD",null,110,"GRAFTON","y","notin"]
[14,1,{"$f":"IF(dataout!C23=\"Y\",\"Y\",IF(dataout!C23=\"T\",\"T\",\"N\"))","v":"Y"},{"$f":"IF(AND(dataout!C23=\"Y\",dataout!D23=\"not in\"),2,0)","v":0},"014","ASHLAND                      ","1Y0",null,14,"Y"," ",{"$f":"dataout!L23","v":5000},{"$f":"dataout!T23","v":" "},0,14,"ASHLAND                      ",null,114,"GREENFIELD","y","notin"]
[15,0,{"$f":"IF(dataout!C24=\"Y\",\"Y\",IF(dataout!C24=\"T\",\"T\",\"N\"))","v":"N"},{"$f":"IF(AND(dataout!C24=\"Y\",dataout!D24=\"not in\"),2,0)","v":0},"015","ATHOL                        ","0N0","You have chosen a non-operating school district",15,"N"," ",{"$f":"dataout!L24","v":0},{"$f":"dataout!T24","v":0},0,15,"ATHOL",null,128,"HAVERHILL","y","notin"]
[16,1,{"$f":"IF(dataout!C25=\"Y\",\"Y\",IF(dataout!C25=\"T\",\"T\",\"N\"))","v":"N"},{"$f":"IF(AND(dataout!C25=\"Y\",dataout!D25=\"not in\"),2,0)","v":0},"016","ATTLEBORO                    ","1N0","You have chosen a district that does not enroll school choice pupils in FY16",16,"N"," ",{"$f":"dataout!L25","v":0},{"$f":"dataout!T25","v":0},0,16,"ATTLEBORO",null,137,"HOLYOKE","y","notin"]
[17,1,{"$f":"IF(dataout!C26=\"Y\",\"Y\",IF(dataout!C26=\"T\",\"T\",\"N\"))","v":"Y"},{"$f":"IF(AND(dataout!C26=\"Y\",dataout!D26=\"not in\"),2,0)","v":0},"017","AUBURN                       ","1Y0",null,17,"Y"," ",{"$f":"dataout!L26","v":5000},{"$f":"dataout!T26","v":" "},0,17,"AUBURN                       ",null,153,"LEOMINSTER","y","notin"]
[18,1,{"$f":"IF(dataout!C27=\"Y\",\"Y\",IF(dataout!C27=\"T\",\"T\",\"N\"))","v":"Y"},{"$f":"IF(AND(dataout!C27=\"Y\",dataout!D27=\"not in\"),2,0)","v":0},"018","AVON                         ","1Y0",null,18,"Y"," ",{"$f":"dataout!L27","v":5000},{"$f":"dataout!T27","v":" "},0,18,"AVON                         ",null,191,"MONSON","y","notin"]
[19,0,{"$f":"IF(dataout!C28=\"Y\",\"Y\",IF(dataout!C28=\"T\",\"T\",\"N\"))","v":"N"},{"$f":"IF(AND(dataout!C28=\"Y\",dataout!D28=\"not in\"),2,0)","v":0},"019","AYER                         ","0N0","You have chosen a non-operating school district",19,"N"," ",{"$f":"dataout!L28","v":0},{"$f":"dataout!T28","v":0},0,19,"AYER                         ",null,221,"OAK BLUFFS","y","notin"]
[20,1,{"$f":"IF(dataout!C29=\"Y\",\"Y\",IF(dataout!C29=\"T\",\"T\",\"N\"))","v":"Y"},{"$f":"IF(AND(dataout!C29=\"Y\",dataout!D29=\"not in\"),2,0)","v":0},"020","BARNSTABLE                   ","1Y0",null,20,"Y"," ",{"$f":"dataout!L29","v":5000},{"$f":"dataout!T29","v":" "},0,20,"BARNSTABLE                   ",null,229,"PEABODY","y","notin"]
[21,0,{"$f":"IF(dataout!C30=\"Y\",\"Y\",IF(dataout!C30=\"T\",\"T\",\"N\"))","v":"N"},{"$f":"IF(AND(dataout!C30=\"Y\",dataout!D30=\"not in\"),2,0)","v":0},"021","BARRE                        ","0N0","You have chosen a non-operating school district",21,"N"," ",{"$f":"dataout!L30","v":0},{"$f":"dataout!T30","v":0},0,21,"BARRE",null,304,"UXBRIDGE","y","notin"]
[22,0,{"$f":"IF(dataout!C31=\"Y\",\"Y\",IF(dataout!C31=\"T\",\"T\",\"N\"))","v":"N"},{"$f":"IF(AND(dataout!C31=\"Y\",dataout!D31=\"not in\"),2,0)","v":0},"022","BECKET                       ","0N0","You have chosen a non-operating school district",22,"N"," ",{"$f":"dataout!L31","v":0},{"$f":"dataout!T31","v":0},0,22,"BECKET",null,322,"WEST BOYLSTON","y","notin"]
[23,1,{"$f":"IF(dataout!C32=\"Y\",\"Y\",IF(dataout!C32=\"T\",\"T\",\"N\"))","v":"N"},{"$f":"IF(AND(dataout!C32=\"Y\",dataout!D32=\"not in\"),2,0)","v":0},"023","BEDFORD                      ","1N0","You have chosen a district that does not enroll school choice pupils in FY16",23,"N"," ",{"$f":"dataout!L32","v":0},{"$f":"dataout!T32","v":0},0,23,"BEDFORD",null,348,"WORCESTER","y","notin"]
[24,1,{"$f":"IF(dataout!C33=\"Y\",\"Y\",IF(dataout!C33=\"T\",\"T\",\"N\"))","v":"Y"},{"$f":"IF(AND(dataout!C33=\"Y\",dataout!D33=\"not in\"),2,0)","v":0},"024","BELCHERTOWN                  ","1Y0",null,24,"Y"," ",{"$f":"dataout!L33","v":5000},{"$f":"dataout!T33","v":" "},0,24,"BELCHERTOWN                  ",null,600,"ACTON BOXBOROUGH","y","notin"]
[25,1,{"$f":"IF(dataout!C34=\"Y\",\"Y\",IF(dataout!C34=\"T\",\"T\",\"N\"))","v":"Y"},{"$f":"IF(AND(dataout!C34=\"Y\",dataout!D34=\"not in\"),2,0)","v":0},"025","BELLINGHAM                   ","1Y0",null,25,"Y"," ",{"$f":"dataout!L34","v":5000},{"$f":"dataout!T34","v":" "},0,25,"BELLINGHAM                   ",null,698,"MANCHESTER ESSEX","y","notin"]
[26,1,{"$f":"IF(dataout!C35=\"Y\",\"Y\",IF(dataout!C35=\"T\",\"T\",\"N\"))","v":"N"},{"$f":"IF(AND(dataout!C35=\"Y\",dataout!D35=\"not in\"),2,0)","v":0},"026","BELMONT                      ","1N0","You have chosen a district that does not enroll school choice pupils in FY16",26,"N"," ",{"$f":"dataout!L35","v":0},{"$f":"dataout!T35","v":0},0,26,"BELMONT",null,766,"SOUTHWICK TOLLAND","y","notin"]
[27,1,{"$f":"IF(dataout!C36=\"Y\",\"Y\",IF(dataout!C36=\"T\",\"T\",\"N\"))","v":"Y"},{"$f":"IF(AND(dataout!C36=\"Y\",dataout!D36=\"not in\"),2,0)","v":0},"027","BERKLEY                      ","1Y0",null,27,"Y"," ",{"$f":"dataout!L36","v":5000},{"$f":"dataout!T36","v":" "},0,27,"BERKLEY                      ",null,1,"ABINGTON","y"]
[28,1,{"$f":"IF(dataout!C37=\"Y\",\"Y\",IF(dataout!C37=\"T\",\"T\",\"N\"))","v":"Y"},{"$f":"IF(AND(dataout!C37=\"Y\",dataout!D37=\"not in\"),2,0)","v":0},"028","BERLIN                       ","1Y0",null,28,"Y"," ",{"$f":"dataout!L37","v":5000},{"$f":"dataout!T37","v":" "},0,28,"BERLIN                       ",null,5,"AGAWAM","y"]
[29,0,{"$f":"IF(dataout!C38=\"Y\",\"Y\",IF(dataout!C38=\"T\",\"T\",\"N\"))","v":"N"},{"$f":"IF(AND(dataout!C38=\"Y\",dataout!D38=\"not in\"),2,0)","v":0},"029","BERNARDSTON                  ","0N0","You have chosen a non-operating school district",29,"N"," ",{"$f":"dataout!L38","v":0},{"$f":"dataout!T38","v":0},0,29,"BERNARDSTON",null,8,"AMHERST   ","y"]
[30,1,{"$f":"IF(dataout!C39=\"Y\",\"Y\",IF(dataout!C39=\"T\",\"T\",\"N\"))","v":"Y"},{"$f":"IF(AND(dataout!C39=\"Y\",dataout!D39=\"not in\"),2,0)","v":0},"030","BEVERLY                      ","1Y0",null,30,"Y"," ",{"$f":"dataout!L39","v":5000},{"$f":"dataout!T39","v":" "},0,30,"BEVERLY                      ",null,14,"ASHLAND","y"]
[31,1,{"$f":"IF(dataout!C40=\"Y\",\"Y\",IF(dataout!C40=\"T\",\"T\",\"N\"))","v":"N"},{"$f":"IF(AND(dataout!C40=\"Y\",dataout!D40=\"not in\"),2,0)","v":0},"031","BILLERICA                    ","1N0","You have chosen a district that does not enroll school choice pupils in FY16",31,"N"," ",{"$f":"dataout!L40","v":0},{"$f":"dataout!T40","v":0},0,31,"BILLERICA",null,17,"AUBURN","y"]
[32,0,{"$f":"IF(dataout!C41=\"Y\",\"Y\",IF(dataout!C41=\"T\",\"T\",\"N\"))","v":"N"},{"$f":"IF(AND(dataout!C41=\"Y\",dataout!D41=\"not in\"),2,0)","v":0},"032","BLACKSTONE                   ","0N0","You have chosen a non-operating school district",32,"N"," ",{"$f":"dataout!L41","v":0},{"$f":"dataout!T41","v":0},0,32,"BLACKSTONE",null,18,"AVON","y"]
[33,0,{"$f":"IF(dataout!C42=\"Y\",\"Y\",IF(dataout!C42=\"T\",\"T\",\"N\"))","v":"N"},{"$f":"IF(AND(dataout!C42=\"Y\",dataout!D42=\"not in\"),2,0)","v":0},"033","BLANDFORD                    ","0N0","You have chosen a non-operating school district",33,"N"," ",{"$f":"dataout!L42","v":0},{"$f":"dataout!T42","v":0},0,33,"BLANDFORD",null,20,"BARNSTABLE","y"]
[34,0,{"$f":"IF(dataout!C43=\"Y\",\"Y\",IF(dataout!C43=\"T\",\"T\",\"N\"))","v":"N"},{"$f":"IF(AND(dataout!C43=\"Y\",dataout!D43=\"not in\"),2,0)","v":0},"034","BOLTON                       ","0N0","You have chosen a non-operating school district",34,"N"," ",{"$f":"dataout!L43","v":0},{"$f":"dataout!T43","v":0},0,34,"BOLTON",null,24,"BELCHERTOWN","y"]
[35,1,{"$f":"IF(dataout!C44=\"Y\",\"Y\",IF(dataout!C44=\"T\",\"T\",\"N\"))","v":"N"},{"$f":"IF(AND(dataout!C44=\"Y\",dataout!D44=\"not in\"),2,0)","v":0},"035","BOSTON                       ","1N0","You have chosen a district that does not enroll school choice pupils in FY16",35,"N"," ",{"$f":"dataout!L44","v":0},{"$f":"dataout!T44","v":0},0,35,"BOSTON",null,25,"BELLINGHAM","y"]
[36,1,{"$f":"IF(dataout!C45=\"Y\",\"Y\",IF(dataout!C45=\"T\",\"T\",\"N\"))","v":"Y"},{"$f":"IF(AND(dataout!C45=\"Y\",dataout!D45=\"not in\"),2,0)","v":0},"036","BOURNE                       ","1Y0",null,36,"Y"," ",{"$f":"dataout!L45","v":5000},{"$f":"dataout!T45","v":" "},0,36,"BOURNE                       ",null,27,"BERKLEY","y"]
[37,0,{"$f":"IF(dataout!C46=\"Y\",\"Y\",IF(dataout!C46=\"T\",\"T\",\"N\"))","v":"N"},{"$f":"IF(AND(dataout!C46=\"Y\",dataout!D46=\"not in\"),2,0)","v":0},"037","BOXBOROUGH                   ","0N0","You have chosen a non-operating school district",37,"N"," ",{"$f":"dataout!L46","v":5000},{"$f":"dataout!T46","v":" "},0,37,"BOXBOROUGH                   ",null,28,"BERLIN","y"]
[38,1,{"$f":"IF(dataout!C47=\"Y\",\"Y\",IF(dataout!C47=\"T\",\"T\",\"N\"))","v":"N"},{"$f":"IF(AND(dataout!C47=\"Y\",dataout!D47=\"not in\"),2,0)","v":0},"038","BOXFORD                      ","1N0","You have chosen a district that does not enroll school choice pupils in FY16",38,"N"," ",{"$f":"dataout!L47","v":0},{"$f":"dataout!T47","v":0},0,38,"BOXFORD",null,30,"BEVERLY","y"]
[39,1,{"$f":"IF(dataout!C48=\"Y\",\"Y\",IF(dataout!C48=\"T\",\"T\",\"N\"))","v":"Y"},{"$f":"IF(AND(dataout!C48=\"Y\",dataout!D48=\"not in\"),2,0)","v":0},"039","BOYLSTON                     ","1Y0",null,39,"Y"," ",{"$f":"dataout!L48","v":5000},{"$f":"dataout!T48","v":" "},0,39,"BOYLSTON                     ",null,36,"BOURNE","y"]
[40,1,{"$f":"IF(dataout!C49=\"Y\",\"Y\",IF(dataout!C49=\"T\",\"T\",\"N\"))","v":"N"},{"$f":"IF(AND(dataout!C49=\"Y\",dataout!D49=\"not in\"),2,0)","v":0},"040","BRAINTREE                    ","1N0","You have chosen a district that does not enroll school choice pupils in FY16",40,"N"," ",{"$f":"dataout!L49","v":0},{"$f":"dataout!T49","v":0},0,40,"BRAINTREE",null,39,"BOYLSTON","y"]
[{"$f":"VALUE(E50)","v":41},1,{"$f":"IF(dataout!C50=\"Y\",\"Y\",IF(dataout!C50=\"T\",\"T\",\"N\"))","v":"N"},{"$f":"IF(AND(dataout!C50=\"Y\",dataout!D50=\"not in\"),2,0)","v":0},"041","BREWSTER                     ","1N0","You have chosen a district that does not enroll school choice pupils in FY16",41,"N"," ",{"$f":"dataout!L50","v":0},{"$f":"dataout!T50","v":0},0,41,"BREWSTER",null,45,"BROOKFIELD","y"]
[42,0,{"$f":"IF(dataout!C51=\"Y\",\"Y\",IF(dataout!C51=\"T\",\"T\",\"N\"))","v":"N"},{"$f":"IF(AND(dataout!C51=\"Y\",dataout!D51=\"not in\"),2,0)","v":0},"042","BRIDGEWATER                  ","0N0","You have chosen a non-operating school district",42,"N"," ",{"$f":"dataout!L51","v":0},{"$f":"dataout!T51","v":0},0,42,"BRIDGEWATER",null,48,"BURLINGTON","y"]
[43,1,{"$f":"IF(dataout!C52=\"Y\",\"Y\",IF(dataout!C52=\"T\",\"T\",\"N\"))","v":"N"},{"$f":"IF(AND(dataout!C52=\"Y\",dataout!D52=\"not in\"),2,0)","v":0},"043","BRIMFIELD                    ","1N0","You have chosen a district that does not enroll school choice pupils in FY16",43,"N"," ",{"$f":"dataout!L52","v":0},{"$f":"dataout!T52","v":0},0,43,"BRIMFIELD",null,52,"CARVER","y"]
[44,1,{"$f":"IF(dataout!C53=\"Y\",\"Y\",IF(dataout!C53=\"T\",\"T\",\"N\"))","v":"Y"},{"$f":"IF(AND(dataout!C53=\"Y\",dataout!D53=\"not in\"),2,0)","v":0},"044","BROCKTON                     ","1Y0",null,44,"Y"," ",{"$f":"dataout!L53","v":5000},{"$f":"dataout!T53","v":5000},0,44,"BROCKTON                     ",null,61,"CHICOPEE","y"]
[45,1,{"$f":"IF(dataout!C54=\"Y\",\"Y\",IF(dataout!C54=\"T\",\"T\",\"N\"))","v":"Y"},{"$f":"IF(AND(dataout!C54=\"Y\",dataout!D54=\"not in\"),2,0)","v":0},"045","BROOKFIELD                   ","1Y0",null,45,"Y"," ",{"$f":"dataout!L54","v":5000},{"$f":"dataout!T54","v":" "},0,45,"BROOKFIELD                   ",null,63,"CLARKSBURG","y"]
[46,1,{"$f":"IF(dataout!C55=\"Y\",\"Y\",IF(dataout!C55=\"T\",\"T\",\"N\"))","v":"N"},{"$f":"IF(AND(dataout!C55=\"Y\",dataout!D55=\"not in\"),2,0)","v":0},"046","BROOKLINE                    ","1N0","You have chosen a district that does not enroll school choice pupils in FY16",46,"N"," ",{"$f":"dataout!L55","v":0},{"$f":"dataout!T55","v":0},0,46,"BROOKLINE",null,68,"CONWAY","y"]
[47,0,{"$f":"IF(dataout!C56=\"Y\",\"Y\",IF(dataout!C56=\"T\",\"T\",\"N\"))","v":"N"},{"$f":"IF(AND(dataout!C56=\"Y\",dataout!D56=\"not in\"),2,0)","v":0},"047","BUCKLAND                     ","0N0","You have chosen a non-operating school district",47,"N"," ",{"$f":"dataout!L56","v":0},{"$f":"dataout!T56","v":0},0,47,"BUCKLAND",null,74,"DEERFIELD","y"]
[48,1,{"$f":"IF(dataout!C57=\"Y\",\"Y\",IF(dataout!C57=\"T\",\"T\",\"N\"))","v":"Y"},{"$f":"IF(AND(dataout!C57=\"Y\",dataout!D57=\"not in\"),2,0)","v":0},"048","BURLINGTON                   ","1Y0",null,48,"Y"," ",{"$f":"dataout!L57","v":5000},{"$f":"dataout!T57","v":" "},0,48,"BURLINGTON",null,79,"DRACUT","y"]
[49,1,{"$f":"IF(dataout!C58=\"Y\",\"Y\",IF(dataout!C58=\"T\",\"T\",\"N\"))","v":"N"},{"$f":"IF(AND(dataout!C58=\"Y\",dataout!D58=\"not in\"),2,0)","v":0},"049","CAMBRIDGE                    ","1N0","You have chosen a district that does not enroll school choice pupils in FY16",49,"N"," ",{"$f":"dataout!L58","v":0},{"$f":"dataout!T58","v":0},0,49,"CAMBRIDGE",null,83,"EAST BRIDGEWATER","y"]
[50,1,{"$f":"IF(dataout!C59=\"Y\",\"Y\",IF(dataout!C59=\"T\",\"T\",\"N\"))","v":"N"},{"$f":"IF(AND(dataout!C59=\"Y\",dataout!D59=\"not in\"),2,0)","v":0},"050","CANTON                       ","1N0","You have chosen a district that does not enroll school choice pupils in FY16",50,"N"," ",{"$f":"dataout!L59","v":0},{"$f":"dataout!T59","v":0},0,50,"CANTON",null,86,"EASTHAMPTON","y"]
[51,1,{"$f":"IF(dataout!C60=\"Y\",\"Y\",IF(dataout!C60=\"T\",\"T\",\"N\"))","v":"N"},{"$f":"IF(AND(dataout!C60=\"Y\",dataout!D60=\"not in\"),2,0)","v":0},"051","CARLISLE                     ","1N0","You have chosen a district that does not enroll school choice pupils in FY16",51,"N"," ",{"$f":"dataout!L60","v":0},{"$f":"dataout!T60","v":0},0,51,"CARLISLE",null,89,"EDGARTOWN","y"]
[52,1,{"$f":"IF(dataout!C61=\"Y\",\"Y\",IF(dataout!C61=\"T\",\"T\",\"N\"))","v":"Y"},{"$f":"IF(AND(dataout!C61=\"Y\",dataout!D61=\"not in\"),2,0)","v":0},"052","CARVER                       ","1Y0",null,52,"Y"," ",{"$f":"dataout!L61","v":5000},{"$f":"dataout!T61","v":" "},0,52,"CARVER",null,95,"FALL RIVER","y"]
[53,0,{"$f":"IF(dataout!C62=\"Y\",\"Y\",IF(dataout!C62=\"T\",\"T\",\"N\"))","v":"N"},{"$f":"IF(AND(dataout!C62=\"Y\",dataout!D62=\"not in\"),2,0)","v":0},"053","CHARLEMONT                   ","0N0","You have chosen a non-operating school district",53,"N"," ",{"$f":"dataout!L62","v":0},{"$f":"dataout!T62","v":0},0,53,"CHARLEMONT",null,96,"FALMOUTH","y"]
[54,0,{"$f":"IF(dataout!C63=\"Y\",\"Y\",IF(dataout!C63=\"T\",\"T\",\"N\"))","v":"N"},{"$f":"IF(AND(dataout!C63=\"Y\",dataout!D63=\"not in\"),2,0)","v":0},"054","CHARLTON                     ","0N0","You have chosen a non-operating school district",54,"N"," ",{"$f":"dataout!L63","v":0},{"$f":"dataout!T63","v":0},0,54,"CHARLTON",null,98,"FLORIDA","y"]
[55,0,{"$f":"IF(dataout!C64=\"Y\",\"Y\",IF(dataout!C64=\"T\",\"T\",\"N\"))","v":"N"},{"$f":"IF(AND(dataout!C64=\"Y\",dataout!D64=\"not in\"),2,0)","v":0},"055","CHATHAM                      ","0N0","You have chosen a non-operating school district",55,"N"," ",{"$f":"dataout!L64","v":0},{"$f":"dataout!T64","v":0},0,55,"CHATHAM                      ",null,101,"FRANKLIN","y"]
[56,1,{"$f":"IF(dataout!C65=\"Y\",\"Y\",IF(dataout!C65=\"T\",\"T\",\"N\"))","v":"Y"},{"$f":"IF(AND(dataout!C65=\"Y\",dataout!D65=\"not in\"),2,0)","v":0},"056","CHELMSFORD                   ","1Y0",null,56,"Y"," ",{"$f":"dataout!L65","v":5000},{"$f":"dataout!T65","v":" "},0,56,"CHELMSFORD",null,103,"GARDNER","y"]
[57,1,{"$f":"IF(dataout!C66=\"Y\",\"Y\",IF(dataout!C66=\"T\",\"T\",\"N\"))","v":"N"},{"$f":"IF(AND(dataout!C66=\"Y\",dataout!D66=\"not in\"),2,0)","v":0},"057","CHELSEA                      ","1N0","You have chosen a district that does not enroll school choice pupils in FY16",57,"N"," ",{"$f":"dataout!L66","v":0},{"$f":"dataout!T66","v":0},0,57,"CHELSEA",null,107,"GLOUCESTER","y"]
[58,0,{"$f":"IF(dataout!C67=\"Y\",\"Y\",IF(dataout!C67=\"T\",\"T\",\"N\"))","v":"N"},{"$f":"IF(AND(dataout!C67=\"Y\",dataout!D67=\"not in\"),2,0)","v":0},"058","CHESHIRE                     ","0N0","You have chosen a non-operating school district",58,"N"," ",{"$f":"dataout!L67","v":0},{"$f":"dataout!T67","v":0},0,58,"CHESHIRE",null,111,"GRANBY","y"]
[59,0,{"$f":"IF(dataout!C68=\"Y\",\"Y\",IF(dataout!C68=\"T\",\"T\",\"N\"))","v":"N"},{"$f":"IF(AND(dataout!C68=\"Y\",dataout!D68=\"not in\"),2,0)","v":0},"059","CHESTER                      ","0N0","You have chosen a non-operating school district",59,"N"," ",{"$f":"dataout!L68","v":0},{"$f":"dataout!T68","v":0},0,59,"CHESTER",null,117,"HADLEY","y"]
[60,0,{"$f":"IF(dataout!C69=\"Y\",\"Y\",IF(dataout!C69=\"T\",\"T\",\"N\"))","v":"N"},{"$f":"IF(AND(dataout!C69=\"Y\",dataout!D69=\"not in\"),2,0)","v":0},"060","CHESTERFIELD                 ","0N0","You have chosen a non-operating school district",60,"N"," ",{"$f":"dataout!L69","v":0},{"$f":"dataout!T69","v":0},0,60,"CHESTERFIELD",null,121,"HANCOCK","y"]
[61,1,{"$f":"IF(dataout!C70=\"Y\",\"Y\",IF(dataout!C70=\"T\",\"T\",\"N\"))","v":"Y"},{"$f":"IF(AND(dataout!C70=\"Y\",dataout!D70=\"not in\"),2,0)","v":0},"061","CHICOPEE                     ","1Y0",null,61,"Y"," ",{"$f":"dataout!L70","v":5000},{"$f":"dataout!T70","v":4799},0,61,"CHICOPEE                     ",null,125,"HARVARD","y"]
[62,0,{"$f":"IF(dataout!C71=\"Y\",\"Y\",IF(dataout!C71=\"T\",\"T\",\"N\"))","v":"N"},{"$f":"IF(AND(dataout!C71=\"Y\",dataout!D71=\"not in\"),2,0)","v":0},"062","CHILMARK                     ","0N0","You have chosen a non-operating school district",62,"N"," ",{"$f":"dataout!L71","v":0},{"$f":"dataout!T71","v":0},0,62,"CHILMARK",null,127,"HATFIELD","y"]
[63,1,{"$f":"IF(dataout!C72=\"Y\",\"Y\",IF(dataout!C72=\"T\",\"T\",\"N\"))","v":"Y"},{"$f":"IF(AND(dataout!C72=\"Y\",dataout!D72=\"not in\"),2,0)","v":0},"063","CLARKSBURG                   ","1Y0",null,63,"Y"," ",{"$f":"dataout!L72","v":5000},{"$f":"dataout!T72","v":" "},0,63,"CLARKSBURG",null,133,"HOLBROOK","y"]
[64,1,{"$f":"IF(dataout!C73=\"Y\",\"Y\",IF(dataout!C73=\"T\",\"T\",\"N\"))","v":"Y"},{"$f":"IF(AND(dataout!C73=\"Y\",dataout!D73=\"not in\"),2,0)","v":0},"064","CLINTON                      ","1Y0",null,64,"Y"," ",{"$f":"dataout!L73","v":5000},{"$f":"dataout!T73","v":" "},0,64,"CLINTON                      ",null,135,"HOLLAND","y"]
[{"$f":"VALUE(E74)","v":65},1,{"$f":"IF(dataout!C74=\"Y\",\"Y\",IF(dataout!C74=\"T\",\"T\",\"N\"))","v":"N"},{"$f":"IF(AND(dataout!C74=\"Y\",dataout!D74=\"not in\"),2,0)","v":0},"065","COHASSET                     ","1N0","You have chosen a district that does not enroll school choice pupils in FY16",65,"N"," ",{"$f":"dataout!L74","v":0},{"$f":"dataout!T74","v":0},0,65,"COHASSET",null,136,"HOLLISTON","y"]
[66,0,{"$f":"IF(dataout!C75=\"Y\",\"Y\",IF(dataout!C75=\"T\",\"T\",\"N\"))","v":"N"},{"$f":"IF(AND(dataout!C75=\"Y\",dataout!D75=\"not in\"),2,0)","v":0},"066","COLRAIN                      ",{"$f":"B75&C75&D75","v":"0N0"},"You have chosen a non-operating school district",{"$f":"A75","v":66},{"$f":"C75","v":"N"},{"$f":"IF(G75=\"1Y2\",\"bad\",\" \")","v":" "},{"$f":"dataout!L75","v":0},{"$f":"dataout!T75","v":0},{"$f":"O75-A75","v":0},66,"COLRAIN",null,138,"HOPEDALE","y"]
[{"$f":"VALUE(E76)","v":67},1,{"$f":"IF(dataout!C76=\"Y\",\"Y\",IF(dataout!C76=\"T\",\"T\",\"N\"))","v":"N"},{"$f":"IF(AND(dataout!C76=\"Y\",dataout!D76=\"not in\"),2,0)","v":0},"067","CONCORD                      ","1N0","You have chosen a district that does not enroll school choice pupils in FY16",67,"N"," ",{"$f":"dataout!L76","v":0},{"$f":"dataout!T76","v":0},0,67,"CONCORD",null,141,"HUDSON","y"]
[68,1,{"$f":"IF(dataout!C77=\"Y\",\"Y\",IF(dataout!C77=\"T\",\"T\",\"N\"))","v":"Y"},{"$f":"IF(AND(dataout!C77=\"Y\",dataout!D77=\"not in\"),2,0)","v":0},"068","CONWAY                       ","1Y0",null,68,"Y"," ",{"$f":"dataout!L77","v":5000},{"$f":"dataout!T77","v":" "},0,68,"CONWAY                       ",null,144,"IPSWICH","y"]
[69,0,{"$f":"IF(dataout!C78=\"Y\",\"Y\",IF(dataout!C78=\"T\",\"T\",\"N\"))","v":"N"},{"$f":"IF(AND(dataout!C78=\"Y\",dataout!D78=\"not in\"),2,0)","v":0},"069","CUMMINGTON                   ","0N0","You have chosen a non-operating school district",69,"N"," ",{"$f":"dataout!L78","v":0},{"$f":"dataout!T78","v":0},0,69,"CUMMINGTON",null,148,"LANESBOROUGH","y"]
[70,0,{"$f":"IF(dataout!C79=\"Y\",\"Y\",IF(dataout!C79=\"T\",\"T\",\"N\"))","v":"N"},{"$f":"IF(AND(dataout!C79=\"Y\",dataout!D79=\"not in\"),2,0)","v":0},"070","DALTON                       ","0N0","You have chosen a non-operating school district",70,"N"," ",{"$f":"dataout!L79","v":0},{"$f":"dataout!T79","v":0},0,70,"DALTON",null,150,"LEE","y"]
[71,1,{"$f":"IF(dataout!C80=\"Y\",\"Y\",IF(dataout!C80=\"T\",\"T\",\"N\"))","v":"N"},{"$f":"IF(AND(dataout!C80=\"Y\",dataout!D80=\"not in\"),2,0)","v":0},"071","DANVERS                      ","1N0","You have chosen a district that does not enroll school choice pupils in FY16",71,"N"," ",{"$f":"dataout!L80","v":0},{"$f":"dataout!T80","v":0},0,71,"DANVERS",null,151,"LEICESTER","y"]
[72,1,{"$f":"IF(dataout!C81=\"Y\",\"Y\",IF(dataout!C81=\"T\",\"T\",\"N\"))","v":"N"},{"$f":"IF(AND(dataout!C81=\"Y\",dataout!D81=\"not in\"),2,0)","v":0},"072","DARTMOUTH                    ","1N0","You have chosen a district that does not enroll school choice pupils in FY16",72,"N"," ",{"$f":"dataout!L81","v":0},{"$f":"dataout!T81","v":0},0,72,"DARTMOUTH",null,152,"LENOX","y"]
[73,1,{"$f":"IF(dataout!C82=\"Y\",\"Y\",IF(dataout!C82=\"T\",\"T\",\"N\"))","v":"N"},{"$f":"IF(AND(dataout!C82=\"Y\",dataout!D82=\"not in\"),2,0)","v":0},"073","DEDHAM                       ","1N0","You have chosen a district that does not enroll school choice pupils in FY16",73,"N"," ",{"$f":"dataout!L82","v":0},{"$f":"dataout!T82","v":0},0,73,"DEDHAM",null,154,"LEVERETT","y"]
[74,1,{"$f":"IF(dataout!C83=\"Y\",\"Y\",IF(dataout!C83=\"T\",\"T\",\"N\"))","v":"Y"},{"$f":"IF(AND(dataout!C83=\"Y\",dataout!D83=\"not in\"),2,0)","v":0},"074","DEERFIELD                    ","1Y0",null,74,"Y"," ",{"$f":"dataout!L83","v":5000},{"$f":"dataout!T83","v":" "},0,74,"DEERFIELD                    ",null,158,"LITTLETON","y"]
[75,0,{"$f":"IF(dataout!C84=\"Y\",\"Y\",IF(dataout!C84=\"T\",\"T\",\"N\"))","v":"N"},{"$f":"IF(AND(dataout!C84=\"Y\",dataout!D84=\"not in\"),2,0)","v":0},"075","DENNIS                       ","0N0","You have chosen a non-operating school district",75,"N"," ",{"$f":"dataout!L84","v":0},{"$f":"dataout!T84","v":0},0,75,"DENNIS",null,159,"LONGMEADOW","y"]
[76,0,{"$f":"IF(dataout!C85=\"Y\",\"Y\",IF(dataout!C85=\"T\",\"T\",\"N\"))","v":"N"},{"$f":"IF(AND(dataout!C85=\"Y\",dataout!D85=\"not in\"),2,0)","v":0},"076","DIGHTON                      ","0N0","You have chosen a non-operating school district",76,"N"," ",{"$f":"dataout!L85","v":0},{"$f":"dataout!T85","v":0},0,76,"DIGHTON",null,161,"LUDLOW","y"]
[77,1,{"$f":"IF(dataout!C86=\"Y\",\"Y\",IF(dataout!C86=\"T\",\"T\",\"N\"))","v":"Y"},{"$f":"IF(AND(dataout!C86=\"Y\",dataout!D86=\"not in\"),2,0)","v":0},"077","DOUGLAS                      ","1Y0",null,77,"Y"," ",{"$f":"dataout!L86","v":5000},{"$f":"dataout!T86","v":" "},0,77,"DOUGLAS                      ",null,162,"LUNENBURG","y"]
[78,1,{"$f":"IF(dataout!C87=\"Y\",\"Y\",IF(dataout!C87=\"T\",\"T\",\"N\"))","v":"N"},{"$f":"IF(AND(dataout!C87=\"Y\",dataout!D87=\"not in\"),2,0)","v":0},"078","DOVER                        ","1N0","You have chosen a district that does not enroll school choice pupils in FY16",78,"N"," ",{"$f":"dataout!L87","v":0},{"$f":"dataout!T87","v":0},0,78,"DOVER",null,171,"MARSHFIELD","y"]
[79,1,{"$f":"IF(dataout!C88=\"Y\",\"Y\",IF(dataout!C88=\"T\",\"T\",\"N\"))","v":"Y"},{"$f":"IF(AND(dataout!C88=\"Y\",dataout!D88=\"not in\"),2,0)","v":0},"079","DRACUT                       ","1Y0",null,79,"Y"," ",{"$f":"dataout!L88","v":5000},{"$f":"dataout!T88","v":" "},0,79,"DRACUT                       ",null,172,"MASHPEE","y"]
[80,0,{"$f":"IF(dataout!C89=\"Y\",\"Y\",IF(dataout!C89=\"T\",\"T\",\"N\"))","v":"N"},{"$f":"IF(AND(dataout!C89=\"Y\",dataout!D89=\"not in\"),2,0)","v":0},"080","DUDLEY                       ","0N0","You have chosen a non-operating school district",80,"N"," ",{"$f":"dataout!L89","v":0},{"$f":"dataout!T89","v":0},0,80,"DUDLEY",null,173,"MATTAPOISETT","y"]
[81,0,{"$f":"IF(dataout!C90=\"Y\",\"Y\",IF(dataout!C90=\"T\",\"T\",\"N\"))","v":"N"},{"$f":"IF(AND(dataout!C90=\"Y\",dataout!D90=\"not in\"),2,0)","v":0},"081","DUNSTABLE                    ","0N0","You have chosen a non-operating school district",81,"N"," ",{"$f":"dataout!L90","v":0},{"$f":"dataout!T90","v":0},0,81,"DUNSTABLE",null,174,"MAYNARD","y"]
[82,1,{"$f":"IF(dataout!C91=\"Y\",\"Y\",IF(dataout!C91=\"T\",\"T\",\"N\"))","v":"N"},{"$f":"IF(AND(dataout!C91=\"Y\",dataout!D91=\"not in\"),2,0)","v":0},"082","DUXBURY                      ","1N0","You have chosen a district that does not enroll school choice pupils in FY16",82,"N"," ",{"$f":"dataout!L91","v":0},{"$f":"dataout!T91","v":0},0,82,"DUXBURY",null,177,"MEDWAY","y"]
[83,1,{"$f":"IF(dataout!C92=\"Y\",\"Y\",IF(dataout!C92=\"T\",\"T\",\"N\"))","v":"Y"},{"$f":"IF(AND(dataout!C92=\"Y\",dataout!D92=\"not in\"),2,0)","v":0},"083","EAST BRIDGEWATER             ","1Y0",null,83,"Y"," ",{"$f":"dataout!L92","v":5000},{"$f":"dataout!T92","v":" "},0,83,"EAST BRIDGEWATER",null,178,"MELROSE","y"]
[84,0,{"$f":"IF(dataout!C93=\"Y\",\"Y\",IF(dataout!C93=\"T\",\"T\",\"N\"))","v":"N"},{"$f":"IF(AND(dataout!C93=\"Y\",dataout!D93=\"not in\"),2,0)","v":0},"084","EAST BROOKFIELD              ","0N0","You have chosen a non-operating school district",84,"N"," ",{"$f":"dataout!L93","v":0},{"$f":"dataout!T93","v":0},0,84,"EAST BROOKFIELD",null,182,"MIDDLEBOROUGH","y"]
[85,1,{"$f":"IF(dataout!C94=\"Y\",\"Y\",IF(dataout!C94=\"T\",\"T\",\"N\"))","v":"N"},{"$f":"IF(AND(dataout!C94=\"Y\",dataout!D94=\"not in\"),2,0)","v":0},"085","EASTHAM                      ","1N0","You have chosen a district that does not enroll school choice pupils in FY16",85,"N"," ",{"$f":"dataout!L94","v":0},{"$f":"dataout!T94","v":0},0,85,"EASTHAM",null,185,"MILFORD","y"]
[86,1,{"$f":"IF(dataout!C95=\"Y\",\"Y\",IF(dataout!C95=\"T\",\"T\",\"N\"))","v":"Y"},{"$f":"IF(AND(dataout!C95=\"Y\",dataout!D95=\"not in\"),2,0)","v":0},"086","EASTHAMPTON                  ","1Y0",null,86,"Y"," ",{"$f":"dataout!L95","v":5000},{"$f":"dataout!T95","v":1324},0,86,"EASTHAMPTON                  ",null,187,"MILLIS","y"]
[87,1,{"$f":"IF(dataout!C96=\"Y\",\"Y\",IF(dataout!C96=\"T\",\"T\",\"N\"))","v":"N"},{"$f":"IF(AND(dataout!C96=\"Y\",dataout!D96=\"not in\"),2,0)","v":0},"087","EAST LONGMEADOW              ","1N0","You have chosen a district that does not enroll school choice pupils in FY16",87,"N"," ",{"$f":"dataout!L96","v":0},{"$f":"dataout!T96","v":0},0,87,"EAST LONGMEADOW",null,198,"NATICK","y"]
[88,1,{"$f":"IF(dataout!C97=\"Y\",\"Y\",IF(dataout!C97=\"T\",\"T\",\"N\"))","v":"N"},{"$f":"IF(AND(dataout!C97=\"Y\",dataout!D97=\"not in\"),2,0)","v":0},"088","EASTON                       ","1N0","You have chosen a district that does not enroll school choice pupils in FY16",88,"N"," ",{"$f":"dataout!L97","v":0},{"$f":"dataout!T97","v":0},0,88,"EASTON",null,204,"NEWBURYPORT","y"]
[89,1,{"$f":"IF(dataout!C98=\"Y\",\"Y\",IF(dataout!C98=\"T\",\"T\",\"N\"))","v":"Y"},{"$f":"IF(AND(dataout!C98=\"Y\",dataout!D98=\"not in\"),2,0)","v":0},"089","EDGARTOWN                    ","1Y0",null,89,"Y"," ",{"$f":"dataout!L98","v":5000},{"$f":"dataout!T98","v":" "},0,89,"EDGARTOWN                    ",null,209,"NORTH ADAMS","y"]
[90,0,{"$f":"IF(dataout!C99=\"Y\",\"Y\",IF(dataout!C99=\"T\",\"T\",\"N\"))","v":"N"},{"$f":"IF(AND(dataout!C99=\"Y\",dataout!D99=\"not in\"),2,0)","v":0},"090","EGREMONT                     ","0N0","You have chosen a non-operating school district",90,"N"," ",{"$f":"dataout!L99","v":0},{"$f":"dataout!T99","v":0},0,90,"EGREMONT",null,210,"NORTHAMPTON","y"]
[91,1,{"$f":"IF(dataout!C100=\"Y\",\"Y\",IF(dataout!C100=\"T\",\"T\",\"N\"))","v":"N"},{"$f":"IF(AND(dataout!C100=\"Y\",dataout!D100=\"not in\"),2,0)","v":0},"091","ERVING                       ","1N0","You have chosen a district that does not enroll school choice pupils in FY16",91,"N"," ",{"$f":"dataout!L100","v":0},{"$f":"dataout!T100","v":0},0,91,"ERVING",null,214,"NORTHBRIDGE","y"]
[92,0,{"$f":"IF(dataout!C101=\"Y\",\"Y\",IF(dataout!C101=\"T\",\"T\",\"N\"))","v":"N"},{"$f":"IF(AND(dataout!C101=\"Y\",dataout!D101=\"not in\"),2,0)","v":0},"092","ESSEX                        ","0N0","You have chosen a non-operating school district",92,"N"," ",{"$f":"dataout!L101","v":0},{"$f":"dataout!T101","v":0},0,92,"ESSEX",null,215,"NORTH BROOKFIELD","y"]
[93,1,{"$f":"IF(dataout!C102=\"Y\",\"Y\",IF(dataout!C102=\"T\",\"T\",\"N\"))","v":"N"},{"$f":"IF(AND(dataout!C102=\"Y\",dataout!D102=\"not in\"),2,0)","v":0},"093","EVERETT                      ","1N0","You have chosen a district that does not enroll school choice pupils in FY16",93,"N"," ",{"$f":"dataout!L102","v":0},{"$f":"dataout!T102","v":0},0,93,"EVERETT",null,218,"NORTON","y"]
[94,1,{"$f":"IF(dataout!C103=\"Y\",\"Y\",IF(dataout!C103=\"T\",\"T\",\"N\"))","v":"T"},{"$f":"IF(AND(dataout!C103=\"Y\",dataout!D103=\"not in\"),2,0)","v":0},"094","FAIRHAVEN                    ","1T0","Not a school choice district, but regular ed choice rate is used for tuitioning from other districts",94,"T"," ",{"$f":"dataout!L103","v":5000},{"$f":"dataout!T103","v":" "},0,94,"FAIRHAVEN",null,223,"ORANGE","y"]
[95,1,{"$f":"IF(dataout!C104=\"Y\",\"Y\",IF(dataout!C104=\"T\",\"T\",\"N\"))","v":"Y"},{"$f":"IF(AND(dataout!C104=\"Y\",dataout!D104=\"not in\"),2,0)","v":0},"095","FALL RIVER                   ","1Y0",null,95,"Y"," ",{"$f":"dataout!L104","v":5000},{"$f":"dataout!T104","v":4209},0,95,"FALL RIVER                   ",null,224,"ORLEANS","y"]
[96,1,{"$f":"IF(dataout!C105=\"Y\",\"Y\",IF(dataout!C105=\"T\",\"T\",\"N\"))","v":"Y"},{"$f":"IF(AND(dataout!C105=\"Y\",dataout!D105=\"not in\"),2,0)","v":0},"096","FALMOUTH                     ","1Y0",null,96,"Y"," ",{"$f":"dataout!L105","v":5000},{"$f":"dataout!T105","v":900},0,96,"FALMOUTH                     ",null,226,"OXFORD","y"]
[97,1,{"$f":"IF(dataout!C106=\"Y\",\"Y\",IF(dataout!C106=\"T\",\"T\",\"N\"))","v":"Y"},{"$f":"IF(AND(dataout!C106=\"Y\",dataout!D106=\"not in\"),2,0)","v":0},"097","FITCHBURG                    ","1Y0",null,97,"Y"," ",{"$f":"dataout!L106","v":5000},{"$f":"dataout!T106","v":" "},0,97,"FITCHBURG                    ",null,227,"PALMER","y"]
[98,1,{"$f":"IF(dataout!C107=\"Y\",\"Y\",IF(dataout!C107=\"T\",\"T\",\"N\"))","v":"Y"},{"$f":"IF(AND(dataout!C107=\"Y\",dataout!D107=\"not in\"),2,0)","v":0},"098","FLORIDA                      ","1Y0",null,98,"Y"," ",{"$f":"dataout!L107","v":5000},{"$f":"dataout!T107","v":" "},0,98,"FLORIDA",null,230,"PELHAM","y"]
[99,1,{"$f":"IF(dataout!C108=\"Y\",\"Y\",IF(dataout!C108=\"T\",\"T\",\"N\"))","v":"N"},{"$f":"IF(AND(dataout!C108=\"Y\",dataout!D108=\"not in\"),2,0)","v":0},"099","FOXBOROUGH                   ","1N0","You have chosen a district that does not enroll school choice pupils in FY16",99,"N"," ",{"$f":"dataout!L108","v":0},{"$f":"dataout!T108","v":0},0,99,"FOXBOROUGH",null,234,"PETERSHAM","y"]
[100,1,{"$f":"IF(dataout!C109=\"Y\",\"Y\",IF(dataout!C109=\"T\",\"T\",\"N\"))","v":"N"},{"$f":"IF(AND(dataout!C109=\"Y\",dataout!D109=\"not in\"),2,0)","v":0},100,"FRAMINGHAM                   ","1N0","You have chosen a district that does not enroll school choice pupils in FY16",100,"N"," ",{"$f":"dataout!L109","v":0},{"$f":"dataout!T109","v":0},0,100,"FRAMINGHAM",null,236,"PITTSFIELD","y"]
[101,1,{"$f":"IF(dataout!C110=\"Y\",\"Y\",IF(dataout!C110=\"T\",\"T\",\"N\"))","v":"Y"},{"$f":"IF(AND(dataout!C110=\"Y\",dataout!D110=\"not in\"),2,0)","v":0},101,"FRANKLIN                     ","1Y0",null,101,"Y"," ",{"$f":"dataout!L110","v":5000},{"$f":"dataout!T110","v":" "},0,101,"FRANKLIN                     ",null,240,"PLYMPTON","y"]
[102,0,{"$f":"IF(dataout!C111=\"Y\",\"Y\",IF(dataout!C111=\"T\",\"T\",\"N\"))","v":"N"},{"$f":"IF(AND(dataout!C111=\"Y\",dataout!D111=\"not in\"),2,0)","v":0},102,"FREETOWN                     ","0N0","You have chosen a non-operating school district",102,"N"," ",{"$f":"dataout!L111","v":0},{"$f":"dataout!T111","v":0},0,102,"FREETOWN",null,242,"PROVINCETOWN","y"]
[103,1,{"$f":"IF(dataout!C112=\"Y\",\"Y\",IF(dataout!C112=\"T\",\"T\",\"N\"))","v":"Y"},{"$f":"IF(AND(dataout!C112=\"Y\",dataout!D112=\"not in\"),2,0)","v":0},103,"GARDNER                      ","1Y0",null,103,"Y"," ",{"$f":"dataout!L112","v":5000},{"$f":"dataout!T112","v":" "},0,103,"GARDNER                      ",null,244,"RANDOLPH","y"]
[104,0,{"$f":"IF(dataout!C113=\"Y\",\"Y\",IF(dataout!C113=\"T\",\"T\",\"N\"))","v":"N"},{"$f":"IF(AND(dataout!C113=\"Y\",dataout!D113=\"not in\"),2,0)","v":0},104,"GAY HEAD                     ","0N0","You have chosen a non-operating school district",104,"N"," ",{"$f":"dataout!L113","v":0},{"$f":"dataout!T113","v":0},0,104,"AQUINNAH",null,249,"RICHMOND","y"]
[{"$f":"VALUE(E114)","v":105},1,{"$f":"IF(dataout!C114=\"Y\",\"Y\",IF(dataout!C114=\"T\",\"T\",\"N\"))","v":"Y"},{"$f":"IF(AND(dataout!C114=\"Y\",dataout!D114=\"not in\"),2,0)","v":0},105,"GEORGETOWN                   ","1Y0",null,105,"Y"," ",{"$f":"dataout!L114","v":5000},{"$f":"dataout!T114","v":" "},0,105,"GEORGETOWN                   ",null,251,"ROCKLAND","y"]
[106,0,{"$f":"IF(dataout!C115=\"Y\",\"Y\",IF(dataout!C115=\"T\",\"T\",\"N\"))","v":"N"},{"$f":"IF(AND(dataout!C115=\"Y\",dataout!D115=\"not in\"),2,0)","v":0},106,"GILL                         ","0N0","You have chosen a non-operating school district",106,"N"," ",{"$f":"dataout!L115","v":0},{"$f":"dataout!T115","v":0},0,106,"GILL",null,253,"ROWE","y"]
[107,1,{"$f":"IF(dataout!C116=\"Y\",\"Y\",IF(dataout!C116=\"T\",\"T\",\"N\"))","v":"Y"},{"$f":"IF(AND(dataout!C116=\"Y\",dataout!D116=\"not in\"),2,0)","v":0},107,"GLOUCESTER                   ","1Y0",null,107,"Y"," ",{"$f":"dataout!L116","v":5000},{"$f":"dataout!T116","v":5000},0,107,"GLOUCESTER                   ",null,261,"SANDWICH","y"]
[108,0,{"$f":"IF(dataout!C117=\"Y\",\"Y\",IF(dataout!C117=\"T\",\"T\",\"N\"))","v":"N"},{"$f":"IF(AND(dataout!C117=\"Y\",dataout!D117=\"not in\"),2,0)","v":0},108,"GOSHEN                       ","0N0","You have chosen a non-operating school district",108,"N"," ",{"$f":"dataout!L117","v":0},{"$f":"dataout!T117","v":0},0,108,"GOSHEN",null,263,"SAVOY","y"]
[109,0,{"$f":"IF(dataout!C118=\"Y\",\"Y\",IF(dataout!C118=\"T\",\"T\",\"N\"))","v":"N"},{"$f":"IF(AND(dataout!C118=\"Y\",dataout!D118=\"not in\"),2,0)","v":0},109,"GOSNOLD                      ","0N0","You have chosen a non-operating school district",109,"N"," ",{"$f":"dataout!L118","v":0},{"$f":"dataout!T118","v":0},0,109,"GOSNOLD",null,271,"SHREWSBURY","y"]
[110,1,{"$f":"IF(dataout!C119=\"Y\",\"Y\",IF(dataout!C119=\"T\",\"T\",\"N\"))","v":"Y"},{"$f":"IF(AND(dataout!C119=\"Y\",dataout!D119=\"not in\"),2,0)","v":0},110,"GRAFTON                      ","1Y0",null,110,"Y"," ",{"$f":"dataout!L119","v":5000},{"$f":"dataout!T119","v":" "},0,110,"GRAFTON",null,275,"SOUTHAMPTON","y"]
[111,1,{"$f":"IF(dataout!C120=\"Y\",\"Y\",IF(dataout!C120=\"T\",\"T\",\"N\"))","v":"Y"},{"$f":"IF(AND(dataout!C120=\"Y\",dataout!D120=\"not in\"),2,0)","v":0},111,"GRANBY                       ","1Y0",null,111,"Y"," ",{"$f":"dataout!L120","v":5000},{"$f":"dataout!T120","v":" "},0,111,"GRANBY                       ",null,277,"SOUTHBRIDGE","y"]
[112,0,{"$f":"IF(dataout!C121=\"Y\",\"Y\",IF(dataout!C121=\"T\",\"T\",\"N\"))","v":"N"},{"$f":"IF(AND(dataout!C121=\"Y\",dataout!D121=\"not in\"),2,0)","v":0},112,"GRANVILLE                    ","0N0","You have chosen a non-operating school district",112,"N"," ",{"$f":"dataout!L121","v":0},{"$f":"dataout!T121","v":0},0,112,"GRANVILLE",null,278,"SOUTH HADLEY","y"]
[{"$f":"VALUE(E122)","v":113},0,{"$f":"IF(dataout!C122=\"Y\",\"Y\",IF(dataout!C122=\"T\",\"T\",\"N\"))","v":"N"},{"$f":"IF(AND(dataout!C122=\"Y\",dataout!D122=\"not in\"),2,0)","v":0},113,"GREAT BARRINGTON             ","0N0","You have chosen a non-operating school district",113,"N"," ",{"$f":"dataout!L122","v":0},{"$f":"dataout!T122","v":0},0,113,"GREAT BARRINGTON",null,281,"SPRINGFIELD","y"]
[{"$f":"VALUE(E123)","v":114},1,{"$f":"IF(dataout!C123=\"Y\",\"Y\",IF(dataout!C123=\"T\",\"T\",\"N\"))","v":"Y"},{"$f":"IF(AND(dataout!C123=\"Y\",dataout!D123=\"not in\"),2,0)","v":0},114,"GREENFIELD                   ","1Y0",null,114,"Y"," ",{"$f":"dataout!L123","v":5000},{"$f":"dataout!T123","v":" "},0,114,"GREENFIELD                   ",null,289,"SUNDERLAND","y"]
[115,0,{"$f":"IF(dataout!C124=\"Y\",\"Y\",IF(dataout!C124=\"T\",\"T\",\"N\"))","v":"N"},{"$f":"IF(AND(dataout!C124=\"Y\",dataout!D124=\"not in\"),2,0)","v":0},115,"GROTON                       ","0N0","You have chosen a non-operating school district",115,"N"," ",{"$f":"dataout!L124","v":0},{"$f":"dataout!T124","v":0},0,115,"GROTON",null,290,"SUTTON","y"]
[116,0,{"$f":"IF(dataout!C125=\"Y\",\"Y\",IF(dataout!C125=\"T\",\"T\",\"N\"))","v":"N"},{"$f":"IF(AND(dataout!C125=\"Y\",dataout!D125=\"not in\"),2,0)","v":0},116,"GROVELAND                    ","0N0","You have chosen a non-operating school district",116,"N"," ",{"$f":"dataout!L125","v":0},{"$f":"dataout!T125","v":0},0,116,"GROVELAND",null,293,"TAUNTON","y"]
[117,1,{"$f":"IF(dataout!C126=\"Y\",\"Y\",IF(dataout!C126=\"T\",\"T\",\"N\"))","v":"Y"},{"$f":"IF(AND(dataout!C126=\"Y\",dataout!D126=\"not in\"),2,0)","v":0},117,"HADLEY                       ","1Y0",null,117,"Y"," ",{"$f":"dataout!L126","v":5000},{"$f":"dataout!T126","v":" "},0,117,"HADLEY                       ",null,296,"TISBURY","y"]
[118,1,{"$f":"IF(dataout!C127=\"Y\",\"Y\",IF(dataout!C127=\"T\",\"T\",\"N\"))","v":"N"},{"$f":"IF(AND(dataout!C127=\"Y\",dataout!D127=\"not in\"),2,0)","v":0},118,"HALIFAX                      ","1N0","You have chosen a district that does not enroll school choice pupils in FY16",118,"N"," ",{"$f":"dataout!L127","v":0},{"$f":"dataout!T127","v":0},0,118,"HALIFAX",null,300,"TRURO","y"]
[119,0,{"$f":"IF(dataout!C128=\"Y\",\"Y\",IF(dataout!C128=\"T\",\"T\",\"N\"))","v":"N"},{"$f":"IF(AND(dataout!C128=\"Y\",dataout!D128=\"not in\"),2,0)","v":0},119,"HAMILTON                     ","0N0","You have chosen a non-operating school district",119,"N"," ",{"$f":"dataout!L128","v":0},{"$f":"dataout!T128","v":0},0,119,"HAMILTON",null,301,"TYNGSBOROUGH","y"]
[120,0,{"$f":"IF(dataout!C129=\"Y\",\"Y\",IF(dataout!C129=\"T\",\"T\",\"N\"))","v":"N"},{"$f":"IF(AND(dataout!C129=\"Y\",dataout!D129=\"not in\"),2,0)","v":0},120,"HAMPDEN                      ","0N0","You have chosen a non-operating school district",120,"N"," ",{"$f":"dataout!L129","v":0},{"$f":"dataout!T129","v":0},0,120,"HAMPDEN",null,306,"WALES","y"]
[121,1,{"$f":"IF(dataout!C130=\"Y\",\"Y\",IF(dataout!C130=\"T\",\"T\",\"N\"))","v":"Y"},{"$f":"IF(AND(dataout!C130=\"Y\",dataout!D130=\"not in\"),2,0)","v":0},121,"HANCOCK                      ","1Y0",null,121,"Y"," ",{"$f":"dataout!L130","v":5000},{"$f":"dataout!T130","v":" "},0,121,"HANCOCK                      ",null,309,"WARE","y"]
[122,1,{"$f":"IF(dataout!C131=\"Y\",\"Y\",IF(dataout!C131=\"T\",\"T\",\"N\"))","v":"N"},{"$f":"IF(AND(dataout!C131=\"Y\",dataout!D131=\"not in\"),2,0)","v":0},122,"HANOVER                      ","1N0","You have chosen a district that does not enroll school choice pupils in FY16",122,"N"," ",{"$f":"dataout!L131","v":0},{"$f":"dataout!T131","v":0},0,122,"HANOVER",null,310,"WAREHAM","y"]
[123,0,{"$f":"IF(dataout!C132=\"Y\",\"Y\",IF(dataout!C132=\"T\",\"T\",\"N\"))","v":"N"},{"$f":"IF(AND(dataout!C132=\"Y\",dataout!D132=\"not in\"),2,0)","v":0},123,"HANSON                       ","0N0","You have chosen a non-operating school district",123,"N"," ",{"$f":"dataout!L132","v":0},{"$f":"dataout!T132","v":0},0,123,"HANSON",null,316,"WEBSTER","y"]
[124,0,{"$f":"IF(dataout!C133=\"Y\",\"Y\",IF(dataout!C133=\"T\",\"T\",\"N\"))","v":"N"},{"$f":"IF(AND(dataout!C133=\"Y\",dataout!D133=\"not in\"),2,0)","v":0},124,"HARDWICK                     ","0N0","You have chosen a non-operating school district",124,"N"," ",{"$f":"dataout!L133","v":0},{"$f":"dataout!T133","v":0},0,124,"HARDWICK",null,323,"WEST BRIDGEWATER","y"]
[125,1,{"$f":"IF(dataout!C134=\"Y\",\"Y\",IF(dataout!C134=\"T\",\"T\",\"N\"))","v":"Y"},{"$f":"IF(AND(dataout!C134=\"Y\",dataout!D134=\"not in\"),2,0)","v":0},125,"HARVARD                      ","1Y0",null,125,"Y"," ",{"$f":"dataout!L134","v":5000},{"$f":"dataout!T134","v":" "},0,125,"HARVARD                      ",null,325,"WESTFIELD","y"]
[126,0,{"$f":"IF(dataout!C135=\"Y\",\"Y\",IF(dataout!C135=\"T\",\"T\",\"N\"))","v":"N"},{"$f":"IF(AND(dataout!C135=\"Y\",dataout!D135=\"not in\"),2,0)","v":0},126,"HARWICH                      ","0N0","You have chosen a non-operating school district",126,"N"," ",{"$f":"dataout!L135","v":0},{"$f":"dataout!T135","v":0},0,126,"HARWICH                      ",null,326,"WESTFORD","y"]
[127,1,{"$f":"IF(dataout!C136=\"Y\",\"Y\",IF(dataout!C136=\"T\",\"T\",\"N\"))","v":"Y"},{"$f":"IF(AND(dataout!C136=\"Y\",dataout!D136=\"not in\"),2,0)","v":0},127,"HATFIELD                     ","1Y0",null,127,"Y"," ",{"$f":"dataout!L136","v":5000},{"$f":"dataout!T136","v":" "},0,127,"HATFIELD                     ",null,327,"WESTHAMPTON","y"]
[128,1,{"$f":"IF(dataout!C137=\"Y\",\"Y\",IF(dataout!C137=\"T\",\"T\",\"N\"))","v":"Y"},{"$f":"IF(AND(dataout!C137=\"Y\",dataout!D137=\"not in\"),2,0)","v":0},128,"HAVERHILL                    ","1Y0",null,128,"Y"," ",{"$f":"dataout!L137","v":5000},{"$f":"dataout!T137","v":" "},0,128,"HAVERHILL                    ",null,332,"WEST SPRINGFIELD","y"]
[129,0,{"$f":"IF(dataout!C138=\"Y\",\"Y\",IF(dataout!C138=\"T\",\"T\",\"N\"))","v":"N"},{"$f":"IF(AND(dataout!C138=\"Y\",dataout!D138=\"not in\"),2,0)","v":0},129,"HAWLEY                       ","0N0","You have chosen a non-operating school district",129,"N"," ",{"$f":"dataout!L138","v":0},{"$f":"dataout!T138","v":0},0,129,"HAWLEY",null,340,"WILLIAMSBURG","y"]
[130,0,{"$f":"IF(dataout!C139=\"Y\",\"Y\",IF(dataout!C139=\"T\",\"T\",\"N\"))","v":"N"},{"$f":"IF(AND(dataout!C139=\"Y\",dataout!D139=\"not in\"),2,0)","v":0},130,"HEATH                        ",{"$f":"B139&C139&D139","v":"0N0"},"You have chosen a non-operating school district",{"$f":"A139","v":130},{"$f":"C139","v":"N"},{"$f":"IF(G139=\"1Y2\",\"bad\",\" \")","v":" "},{"$f":"dataout!L139","v":0},{"$f":"dataout!T139","v":0},{"$f":"O139-A139","v":0},130,"HEATH",null,341,"WILLIAMSTOWN","y"]
[131,1,{"$f":"IF(dataout!C140=\"Y\",\"Y\",IF(dataout!C140=\"T\",\"T\",\"N\"))","v":"N"},{"$f":"IF(AND(dataout!C140=\"Y\",dataout!D140=\"not in\"),2,0)","v":0},131,"HINGHAM                      ","1N0","You have chosen a district that does not enroll school choice pupils in FY16",131,"N"," ",{"$f":"dataout!L140","v":0},{"$f":"dataout!T140","v":0},0,131,"HINGHAM",null,346,"WINTHROP","y"]
[132,0,{"$f":"IF(dataout!C141=\"Y\",\"Y\",IF(dataout!C141=\"T\",\"T\",\"N\"))","v":"N"},{"$f":"IF(AND(dataout!C141=\"Y\",dataout!D141=\"not in\"),2,0)","v":0},132,"HINSDALE                     ","0N0","You have chosen a non-operating school district",132,"N"," ",{"$f":"dataout!L141","v":0},{"$f":"dataout!T141","v":0},0,132,"HINSDALE",null,603,"ADAMS CHESHIRE","y"]
[133,1,{"$f":"IF(dataout!C142=\"Y\",\"Y\",IF(dataout!C142=\"T\",\"T\",\"N\"))","v":"Y"},{"$f":"IF(AND(dataout!C142=\"Y\",dataout!D142=\"not in\"),2,0)","v":0},133,"HOLBROOK                     ","1Y0",null,133,"Y",null,{"$f":"dataout!L142","v":5000},{"$f":"dataout!T142","v":" "},0,133,"HOLBROOK",null,605,"AMHERST PELHAM","y"]
[134,0,{"$f":"IF(dataout!C143=\"Y\",\"Y\",IF(dataout!C143=\"T\",\"T\",\"N\"))","v":"N"},{"$f":"IF(AND(dataout!C143=\"Y\",dataout!D143=\"not in\"),2,0)","v":0},134,"HOLDEN                       ","0N0","You have chosen a non-operating school district",134,"N"," ",{"$f":"dataout!L143","v":0},{"$f":"dataout!T143","v":0},0,134,"HOLDEN",null,610,"ASHBURNHAM WESTMINSTER","y"]
[135,1,{"$f":"IF(dataout!C144=\"Y\",\"Y\",IF(dataout!C144=\"T\",\"T\",\"N\"))","v":"Y"},{"$f":"IF(AND(dataout!C144=\"Y\",dataout!D144=\"not in\"),2,0)","v":0},135,"HOLLAND                      ","1Y0",null,135,"Y"," ",{"$f":"dataout!L144","v":5000},{"$f":"dataout!T144","v":" "},0,135,"HOLLAND                      ",null,615,"ATHOL ROYALSTON","y"]
[136,1,{"$f":"IF(dataout!C145=\"Y\",\"Y\",IF(dataout!C145=\"T\",\"T\",\"N\"))","v":"Y"},{"$f":"IF(AND(dataout!C145=\"Y\",dataout!D145=\"not in\"),2,0)","v":0},136,"HOLLISTON                    ","1Y0",null,136,"Y"," ",{"$f":"dataout!L145","v":5000},{"$f":"dataout!T145","v":" "},0,136,"HOLLISTON                    ",null,616,"AYER SHIRLEY","y"]
[137,1,{"$f":"IF(dataout!C146=\"Y\",\"Y\",IF(dataout!C146=\"T\",\"T\",\"N\"))","v":"Y"},{"$f":"IF(AND(dataout!C146=\"Y\",dataout!D146=\"not in\"),2,0)","v":0},137,"HOLYOKE                      ","1Y0",null,137,"Y"," ",{"$f":"dataout!L146","v":5000},{"$f":"dataout!T146","v":5000},0,137,"HOLYOKE                      ",null,618,"BERKSHIRE HILLS","y"]
[138,1,{"$f":"IF(dataout!C147=\"Y\",\"Y\",IF(dataout!C147=\"T\",\"T\",\"N\"))","v":"Y"},{"$f":"IF(AND(dataout!C147=\"Y\",dataout!D147=\"not in\"),2,0)","v":0},138,"HOPEDALE                     ","1Y0",null,138,"Y"," ",{"$f":"dataout!L147","v":5000},{"$f":"dataout!T147","v":" "},0,138,"HOPEDALE                     ",null,620,"BERLIN BOYLSTON","y"]
[139,1,{"$f":"IF(dataout!C148=\"Y\",\"Y\",IF(dataout!C148=\"T\",\"T\",\"N\"))","v":"N"},{"$f":"IF(AND(dataout!C148=\"Y\",dataout!D148=\"not in\"),2,0)","v":0},139,"HOPKINTON                    ","1N0","You have chosen a district that does not enroll school choice pupils in FY16",139,"N"," ",{"$f":"dataout!L148","v":0},{"$f":"dataout!T148","v":0},0,139,"HOPKINTON",null,622,"BLACKSTONE MILLVILLE","y"]
[140,0,{"$f":"IF(dataout!C149=\"Y\",\"Y\",IF(dataout!C149=\"T\",\"T\",\"N\"))","v":"N"},{"$f":"IF(AND(dataout!C149=\"Y\",dataout!D149=\"not in\"),2,0)","v":0},140,"HUBBARDSTON                  ","0N0","You have chosen a non-operating school district",140,"N"," ",{"$f":"dataout!L149","v":0},{"$f":"dataout!T149","v":0},0,140,"HUBBARDSTON",null,625,"BRIDGEWATER RAYNHAM","y"]
[141,1,{"$f":"IF(dataout!C150=\"Y\",\"Y\",IF(dataout!C150=\"T\",\"T\",\"N\"))","v":"Y"},{"$f":"IF(AND(dataout!C150=\"Y\",dataout!D150=\"not in\"),2,0)","v":0},141,"HUDSON                       ","1Y0",null,141,"Y"," ",{"$f":"dataout!L150","v":5000},{"$f":"dataout!T150","v":" "},0,141,"HUDSON                       ",null,632,"CHESTERFIELD GOSHEN","y"]
[142,1,{"$f":"IF(dataout!C151=\"Y\",\"Y\",IF(dataout!C151=\"T\",\"T\",\"N\"))","v":"N"},{"$f":"IF(AND(dataout!C151=\"Y\",dataout!D151=\"not in\"),2,0)","v":0},142,"HULL                         ","1N0","You have chosen a district that does not enroll school choice pupils in FY16",142,"N"," ",{"$f":"dataout!L151","v":0},{"$f":"dataout!T151","v":0},0,142,"HULL",null,635,"CENTRAL BERKSHIRE","y"]
[143,0,{"$f":"IF(dataout!C152=\"Y\",\"Y\",IF(dataout!C152=\"T\",\"T\",\"N\"))","v":"N"},{"$f":"IF(AND(dataout!C152=\"Y\",dataout!D152=\"not in\"),2,0)","v":0},143,"HUNTINGTON                   ","0N0","You have chosen a non-operating school district",143,"N"," ",{"$f":"dataout!L152","v":0},{"$f":"dataout!T152","v":0},0,143,"HUNTINGTON",null,645,"DENNIS YARMOUTH","y"]
[144,1,{"$f":"IF(dataout!C153=\"Y\",\"Y\",IF(dataout!C153=\"T\",\"T\",\"N\"))","v":"Y"},{"$f":"IF(AND(dataout!C153=\"Y\",dataout!D153=\"not in\"),2,0)","v":0},144,"IPSWICH                      ","1Y0",null,144,"Y"," ",{"$f":"dataout!L153","v":5000},{"$f":"dataout!T153","v":" "},0,144,"IPSWICH                      ",null,650,"DIGHTON REHOBOTH","y"]
[145,1,{"$f":"IF(dataout!C154=\"Y\",\"Y\",IF(dataout!C154=\"T\",\"T\",\"N\"))","v":"N"},{"$f":"IF(AND(dataout!C154=\"Y\",dataout!D154=\"not in\"),2,0)","v":0},145,"KINGSTON                     ","1N0","You have chosen a district that does not enroll school choice pupils in FY16",145,"N"," ",{"$f":"dataout!L154","v":0},{"$f":"dataout!T154","v":0},0,145,"KINGSTON",null,658,"DUDLEY CHARLTON","y"]
[146,0,{"$f":"IF(dataout!C155=\"Y\",\"Y\",IF(dataout!C155=\"T\",\"T\",\"N\"))","v":"N"},{"$f":"IF(AND(dataout!C155=\"Y\",dataout!D155=\"not in\"),2,0)","v":0},146,"LAKEVILLE                    ","0N0","You have chosen a non-operating school district",146,"N"," ",{"$f":"dataout!L155","v":0},{"$f":"dataout!T155","v":0},0,146,"LAKEVILLE",null,660,"NAUSET","y"]
[147,0,{"$f":"IF(dataout!C156=\"Y\",\"Y\",IF(dataout!C156=\"T\",\"T\",\"N\"))","v":"N"},{"$f":"IF(AND(dataout!C156=\"Y\",dataout!D156=\"not in\"),2,0)","v":0},147,"LANCASTER                    ","0N0","You have chosen a non-operating school district",147,"N"," ",{"$f":"dataout!L156","v":0},{"$f":"dataout!T156","v":0},0,147,"LANCASTER",null,662,"FARMINGTON RIVER","y"]
[148,1,{"$f":"IF(dataout!C157=\"Y\",\"Y\",IF(dataout!C157=\"T\",\"T\",\"N\"))","v":"Y"},{"$f":"IF(AND(dataout!C157=\"Y\",dataout!D157=\"not in\"),2,0)","v":0},148,"LANESBOROUGH                 ","1Y0",null,148,"Y"," ",{"$f":"dataout!L157","v":5000},{"$f":"dataout!T157","v":" "},0,148,"LANESBOROUGH                 ",null,665,"FREETOWN LAKEVILLE","y"]
[149,1,{"$f":"IF(dataout!C158=\"Y\",\"Y\",IF(dataout!C158=\"T\",\"T\",\"N\"))","v":"N"},{"$f":"IF(AND(dataout!C158=\"Y\",dataout!D158=\"not in\"),2,0)","v":0},149,"LAWRENCE                     ","1N0","You have chosen a district that does not enroll school choice pupils in FY16",149,"N"," ",{"$f":"dataout!L158","v":0},{"$f":"dataout!T158","v":0},0,149,"LAWRENCE",null,670,"FRONTIER","y"]
[150,1,{"$f":"IF(dataout!C159=\"Y\",\"Y\",IF(dataout!C159=\"T\",\"T\",\"N\"))","v":"Y"},{"$f":"IF(AND(dataout!C159=\"Y\",dataout!D159=\"not in\"),2,0)","v":0},150,"LEE                          ","1Y0",null,150,"Y"," ",{"$f":"dataout!L159","v":5000},{"$f":"dataout!T159","v":" "},0,150,"LEE                          ",null,672,"GATEWAY","y"]
[151,1,{"$f":"IF(dataout!C160=\"Y\",\"Y\",IF(dataout!C160=\"T\",\"T\",\"N\"))","v":"Y"},{"$f":"IF(AND(dataout!C160=\"Y\",dataout!D160=\"not in\"),2,0)","v":0},151,"LEICESTER                    ","1Y0",null,151,"Y"," ",{"$f":"dataout!L160","v":5000},{"$f":"dataout!T160","v":" "},0,151,"LEICESTER                    ",null,673,"GROTON DUNSTABLE","y"]
[152,1,{"$f":"IF(dataout!C161=\"Y\",\"Y\",IF(dataout!C161=\"T\",\"T\",\"N\"))","v":"Y"},{"$f":"IF(AND(dataout!C161=\"Y\",dataout!D161=\"not in\"),2,0)","v":0},152,"LENOX                        ","1Y0",null,152,"Y"," ",{"$f":"dataout!L161","v":5000},{"$f":"dataout!T161","v":" "},0,152,"LENOX                        ",null,674,"GILL MONTAGUE","y"]
[{"$f":"VALUE(E162)","v":153},1,{"$f":"IF(dataout!C162=\"Y\",\"Y\",IF(dataout!C162=\"T\",\"T\",\"N\"))","v":"Y"},{"$f":"IF(AND(dataout!C162=\"Y\",dataout!D162=\"not in\"),2,0)","v":0},153,"LEOMINSTER                   ","1Y0",null,153,"Y"," ",{"$f":"dataout!L162","v":5000},{"$f":"dataout!T162","v":5000},0,153,"LEOMINSTER                   ",null,675,"HAMILTON WENHAM","y"]
[154,1,{"$f":"IF(dataout!C163=\"Y\",\"Y\",IF(dataout!C163=\"T\",\"T\",\"N\"))","v":"Y"},{"$f":"IF(AND(dataout!C163=\"Y\",dataout!D163=\"not in\"),2,0)","v":0},154,"LEVERETT                     ","1Y0",null,154,"Y"," ",{"$f":"dataout!L163","v":5000},{"$f":"dataout!T163","v":" "},0,154,"LEVERETT                     ",null,680,"HAMPDEN WILBRAHAM","y"]
[155,1,{"$f":"IF(dataout!C164=\"Y\",\"Y\",IF(dataout!C164=\"T\",\"T\",\"N\"))","v":"N"},{"$f":"IF(AND(dataout!C164=\"Y\",dataout!D164=\"not in\"),2,0)","v":0},155,"LEXINGTON                    ","1N0","You have chosen a district that does not enroll school choice pupils in FY16",155,"N"," ",{"$f":"dataout!L164","v":0},{"$f":"dataout!T164","v":0},0,155,"LEXINGTON",null,683,"HAMPSHIRE","y"]
[156,0,{"$f":"IF(dataout!C165=\"Y\",\"Y\",IF(dataout!C165=\"T\",\"T\",\"N\"))","v":"N"},{"$f":"IF(AND(dataout!C165=\"Y\",dataout!D165=\"not in\"),2,0)","v":0},156,"LEYDEN                       ","0N0","You have chosen a non-operating school district",156,"N"," ",{"$f":"dataout!L165","v":0},{"$f":"dataout!T165","v":0},0,156,"LEYDEN",null,685,"HAWLEMONT","y"]
[157,1,{"$f":"IF(dataout!C166=\"Y\",\"Y\",IF(dataout!C166=\"T\",\"T\",\"N\"))","v":"N"},{"$f":"IF(AND(dataout!C166=\"Y\",dataout!D166=\"not in\"),2,0)","v":0},157,"LINCOLN                      ","1N0","You have chosen a district that does not enroll school choice pupils in FY16",157,"N"," ",{"$f":"dataout!L166","v":0},{"$f":"dataout!T166","v":0},0,157,"LINCOLN",null,710,"MENDON UPTON","y"]
[158,1,{"$f":"IF(dataout!C167=\"Y\",\"Y\",IF(dataout!C167=\"T\",\"T\",\"N\"))","v":"Y"},{"$f":"IF(AND(dataout!C167=\"Y\",dataout!D167=\"not in\"),2,0)","v":0},158,"LITTLETON                    ","1Y0",null,158,"Y"," ",{"$f":"dataout!L167","v":5000},{"$f":"dataout!T167","v":" "},0,158,"LITTLETON                    ",null,712,"MONOMOY","y"]
[159,1,{"$f":"IF(dataout!C168=\"Y\",\"Y\",IF(dataout!C168=\"T\",\"T\",\"N\"))","v":"Y"},{"$f":"IF(AND(dataout!C168=\"Y\",dataout!D168=\"not in\"),2,0)","v":0},159,"LONGMEADOW                   ","1Y0",null,159,"Y"," ",{"$f":"dataout!L168","v":5000},{"$f":"dataout!T168","v":1176},0,159,"LONGMEADOW                   ",null,715,"MOUNT GREYLOCK","y"]
[160,1,{"$f":"IF(dataout!C169=\"Y\",\"Y\",IF(dataout!C169=\"T\",\"T\",\"N\"))","v":"N"},{"$f":"IF(AND(dataout!C169=\"Y\",dataout!D169=\"not in\"),2,0)","v":0},160,"LOWELL                       ","1N0","You have chosen a district that does not enroll school choice pupils in FY16",160,"N"," ",{"$f":"dataout!L169","v":0},{"$f":"dataout!T169","v":0},0,160,"LOWELL",null,717,"MOHAWK TRAIL","y"]
[161,1,{"$f":"IF(dataout!C170=\"Y\",\"Y\",IF(dataout!C170=\"T\",\"T\",\"N\"))","v":"Y"},{"$f":"IF(AND(dataout!C170=\"Y\",dataout!D170=\"not in\"),2,0)","v":0},161,"LUDLOW                       ","1Y0",null,161,"Y"," ",{"$f":"dataout!L170","v":5000},{"$f":"dataout!T170","v":1067},0,161,"LUDLOW                       ",null,720,"NARRAGANSETT","y"]
[162,1,{"$f":"IF(dataout!C171=\"Y\",\"Y\",IF(dataout!C171=\"T\",\"T\",\"N\"))","v":"Y"},{"$f":"IF(AND(dataout!C171=\"Y\",dataout!D171=\"not in\"),2,0)","v":0},162,"LUNENBURG                    ","1Y0",null,162,"Y"," ",{"$f":"dataout!L171","v":5000},{"$f":"dataout!T171","v":" "},0,162,"LUNENBURG                    ",null,725,"NASHOBA","y"]
[163,1,{"$f":"IF(dataout!C172=\"Y\",\"Y\",IF(dataout!C172=\"T\",\"T\",\"N\"))","v":"N"},{"$f":"IF(AND(dataout!C172=\"Y\",dataout!D172=\"not in\"),2,0)","v":0},163,"LYNN                         ","1N0","You have chosen a district that does not enroll school choice pupils in FY16",163,"N"," ",{"$f":"dataout!L172","v":0},{"$f":"dataout!T172","v":0},0,163,"LYNN",null,728,"NEW SALEM WENDELL","y"]
[164,1,{"$f":"IF(dataout!C173=\"Y\",\"Y\",IF(dataout!C173=\"T\",\"T\",\"N\"))","v":"N"},{"$f":"IF(AND(dataout!C173=\"Y\",dataout!D173=\"not in\"),2,0)","v":0},164,"LYNNFIELD                    ","1N0","You have chosen a district that does not enroll school choice pupils in FY16",164,"N"," ",{"$f":"dataout!L173","v":0},{"$f":"dataout!T173","v":0},0,164,"LYNNFIELD",null,735,"NORTH MIDDLESEX","y"]
[165,1,{"$f":"IF(dataout!C174=\"Y\",\"Y\",IF(dataout!C174=\"T\",\"T\",\"N\"))","v":"N"},{"$f":"IF(AND(dataout!C174=\"Y\",dataout!D174=\"not in\"),2,0)","v":0},165,"MALDEN                       ","1N0","You have chosen a district that does not enroll school choice pupils in FY16",165,"N"," ",{"$f":"dataout!L174","v":0},{"$f":"dataout!T174","v":0},0,165,"MALDEN",null,740,"OLD ROCHESTER","y"]
[166,0,{"$f":"IF(dataout!C175=\"Y\",\"Y\",IF(dataout!C175=\"T\",\"T\",\"N\"))","v":"N"},{"$f":"IF(AND(dataout!C175=\"Y\",dataout!D175=\"not in\"),2,0)","v":0},166,"MANCHESTER                   ","0N0","You have chosen a non-operating school district",166,"N"," ",{"$f":"dataout!L175","v":0},{"$f":"dataout!T175","v":0},0,166,"MANCHESTER",null,745,"PENTUCKET","y"]
[167,1,{"$f":"IF(dataout!C176=\"Y\",\"Y\",IF(dataout!C176=\"T\",\"T\",\"N\"))","v":"N"},{"$f":"IF(AND(dataout!C176=\"Y\",dataout!D176=\"not in\"),2,0)","v":0},167,"MANSFIELD                    ","1N0","You have chosen a district that does not enroll school choice pupils in FY16",167,"N"," ",{"$f":"dataout!L176","v":0},{"$f":"dataout!T176","v":0},0,167,"MANSFIELD",null,753,"QUABBIN","y"]
[168,1,{"$f":"IF(dataout!C177=\"Y\",\"Y\",IF(dataout!C177=\"T\",\"T\",\"N\"))","v":"N"},{"$f":"IF(AND(dataout!C177=\"Y\",dataout!D177=\"not in\"),2,0)","v":0},168,"MARBLEHEAD                   ","1N0","You have chosen a district that does not enroll school choice pupils in FY16",168,"N"," ",{"$f":"dataout!L177","v":0},{"$f":"dataout!T177","v":0},0,168,"MARBLEHEAD                   ",null,755,"RALPH C MAHAR","y"]
[169,1,{"$f":"IF(dataout!C178=\"Y\",\"Y\",IF(dataout!C178=\"T\",\"T\",\"N\"))","v":"N"},{"$f":"IF(AND(dataout!C178=\"Y\",dataout!D178=\"not in\"),2,0)","v":0},169,"MARION                       ","1N0","You have chosen a district that does not enroll school choice pupils in FY16",169,"N"," ",{"$f":"dataout!L178","v":0},{"$f":"dataout!T178","v":0},0,169,"MARION",null,763,"SOMERSET BERKLEY","y"]
[170,1,{"$f":"IF(dataout!C179=\"Y\",\"Y\",IF(dataout!C179=\"T\",\"T\",\"N\"))","v":"N"},{"$f":"IF(AND(dataout!C179=\"Y\",dataout!D179=\"not in\"),2,0)","v":0},170,"MARLBOROUGH                  ","1N0","You have chosen a district that does not enroll school choice pupils in FY16",170,"N"," ",{"$f":"dataout!L179","v":0},{"$f":"dataout!T179","v":0},0,170,"MARLBOROUGH",null,765,"SOUTHERN BERKSHIRE","y"]
[171,1,{"$f":"IF(dataout!C180=\"Y\",\"Y\",IF(dataout!C180=\"T\",\"T\",\"N\"))","v":"Y"},{"$f":"IF(AND(dataout!C180=\"Y\",dataout!D180=\"not in\"),2,0)","v":0},171,"MARSHFIELD                   ","1Y0",null,171,"Y"," ",{"$f":"dataout!L180","v":5000},{"$f":"dataout!T180","v":797},0,171,"MARSHFIELD                   ",null,767,"SPENCER EAST BROOKFIELD","y"]
[172,1,{"$f":"IF(dataout!C181=\"Y\",\"Y\",IF(dataout!C181=\"T\",\"T\",\"N\"))","v":"Y"},{"$f":"IF(AND(dataout!C181=\"Y\",dataout!D181=\"not in\"),2,0)","v":0},172,"MASHPEE                      ","1Y0",null,172,"Y"," ",{"$f":"dataout!L181","v":5000},{"$f":"dataout!T181","v":" "},0,172,"MASHPEE",null,770,"TANTASQUA","y"]
[173,1,{"$f":"IF(dataout!C182=\"Y\",\"Y\",IF(dataout!C182=\"T\",\"T\",\"N\"))","v":"Y"},{"$f":"IF(AND(dataout!C182=\"Y\",dataout!D182=\"not in\"),2,0)","v":0},173,"MATTAPOISETT                 ","1Y0",null,173,"Y"," ",{"$f":"dataout!L182","v":5000},{"$f":"dataout!T182","v":" "},0,173,"MATTAPOISETT",null,773,"TRITON","y"]
[174,1,{"$f":"IF(dataout!C183=\"Y\",\"Y\",IF(dataout!C183=\"T\",\"T\",\"N\"))","v":"Y"},{"$f":"IF(AND(dataout!C183=\"Y\",dataout!D183=\"not in\"),2,0)","v":0},174,"MAYNARD                      ","1Y0",null,174,"Y"," ",{"$f":"dataout!L183","v":5000},{"$f":"dataout!T183","v":" "},0,174,"MAYNARD                      ",null,774,"UPISLAND","y"]
[{"$f":"VALUE(E184)","v":175},1,{"$f":"IF(dataout!C184=\"Y\",\"Y\",IF(dataout!C184=\"T\",\"T\",\"N\"))","v":"N"},{"$f":"IF(AND(dataout!C184=\"Y\",dataout!D184=\"not in\"),2,0)","v":0},175,"MEDFIELD                     ","1N0","You have chosen a district that does not enroll school choice pupils in FY16",175,"N"," ",{"$f":"dataout!L184","v":0},{"$f":"dataout!T184","v":0},0,175,"MEDFIELD",null,775,"WACHUSETT","y"]
[{"$f":"VALUE(E185)","v":176},1,{"$f":"IF(dataout!C185=\"Y\",\"Y\",IF(dataout!C185=\"T\",\"T\",\"N\"))","v":"N"},{"$f":"IF(AND(dataout!C185=\"Y\",dataout!D185=\"not in\"),2,0)","v":0},176,"MEDFORD                      ","1N0","You have chosen a district that does not enroll school choice pupils in FY16",176,"N"," ",{"$f":"dataout!L185","v":0},{"$f":"dataout!T185","v":0},0,176,"MEDFORD",null,778,"QUABOAG","y"]
[177,1,{"$f":"IF(dataout!C186=\"Y\",\"Y\",IF(dataout!C186=\"T\",\"T\",\"N\"))","v":"Y"},{"$f":"IF(AND(dataout!C186=\"Y\",dataout!D186=\"not in\"),2,0)","v":0},177,"MEDWAY                       ","1Y0",null,177,"Y"," ",{"$f":"dataout!L186","v":5000},{"$f":"dataout!T186","v":" "},0,177,"MEDWAY                       ",null,780,"WHITMAN HANSON","y"]
[178,1,{"$f":"IF(dataout!C187=\"Y\",\"Y\",IF(dataout!C187=\"T\",\"T\",\"N\"))","v":"Y"},{"$f":"IF(AND(dataout!C187=\"Y\",dataout!D187=\"not in\"),2,0)","v":0},178,"MELROSE                      ","1Y0",null,178,"Y"," ",{"$f":"dataout!L187","v":5000},{"$f":"dataout!T187","v":" "},0,178,"MELROSE",null,817,"NORTH SHORE","y"]
[179,0,{"$f":"IF(dataout!C188=\"Y\",\"Y\",IF(dataout!C188=\"T\",\"T\",\"N\"))","v":"N"},{"$f":"IF(AND(dataout!C188=\"Y\",dataout!D188=\"not in\"),2,0)","v":0},179,"MENDON                       ","0N0","You have chosen a non-operating school district",179,"N"," ",{"$f":"dataout!L188","v":0},{"$f":"dataout!T188","v":0},0,179,"MENDON",null,823,"GREATER LAWRENCE","y"]
[180,0,{"$f":"IF(dataout!C189=\"Y\",\"Y\",IF(dataout!C189=\"T\",\"T\",\"N\"))","v":"N"},{"$f":"IF(AND(dataout!C189=\"Y\",dataout!D189=\"not in\"),2,0)","v":0},180,"MERRIMAC                     ","0N0","You have chosen a non-operating school district",180,"N"," ",{"$f":"dataout!L189","v":0},{"$f":"dataout!T189","v":0},0,180,"MERRIMAC",null,828,"GREATER LOWELL","y"]
[181,1,{"$f":"IF(dataout!C190=\"Y\",\"Y\",IF(dataout!C190=\"T\",\"T\",\"N\"))","v":"N"},{"$f":"IF(AND(dataout!C190=\"Y\",dataout!D190=\"not in\"),2,0)","v":0},181,"METHUEN                      ","1N0","You have chosen a district that does not enroll school choice pupils in FY16",181,"N"," ",{"$f":"dataout!L190","v":0},{"$f":"dataout!T190","v":0},0,181,"METHUEN",null,832,"MONTACHUSETT","y"]
[182,1,{"$f":"IF(dataout!C191=\"Y\",\"Y\",IF(dataout!C191=\"T\",\"T\",\"N\"))","v":"Y"},{"$f":"IF(AND(dataout!C191=\"Y\",dataout!D191=\"not in\"),2,0)","v":0},182,"MIDDLEBOROUGH                ","1Y0",null,182,"Y"," ",{"$f":"dataout!L191","v":5000},{"$f":"dataout!T191","v":" "},0,182,"MIDDLEBOROUGH                ",null,852,"NASHOBA VALLEY","y"]
[183,0,{"$f":"IF(dataout!C192=\"Y\",\"Y\",IF(dataout!C192=\"T\",\"T\",\"N\"))","v":"N"},{"$f":"IF(AND(dataout!C192=\"Y\",dataout!D192=\"not in\"),2,0)","v":0},183,"MIDDLEFIELD                  ","0N0","You have chosen a non-operating school district",183,"N"," ",{"$f":"dataout!L192","v":0},{"$f":"dataout!T192","v":0},0,183,"MIDDLEFIELD",null,853,"NORTHEAST METROPOLITAN","y"]
[184,1,{"$f":"IF(dataout!C193=\"Y\",\"Y\",IF(dataout!C193=\"T\",\"T\",\"N\"))","v":"N"},{"$f":"IF(AND(dataout!C193=\"Y\",dataout!D193=\"not in\"),2,0)","v":0},184,"MIDDLETON                    ","1N0","You have chosen a district that does not enroll school choice pupils in FY16",184,"N"," ",{"$f":"dataout!L193","v":0},{"$f":"dataout!T193","v":0},0,184,"MIDDLETON",null,860,"PATHFINDER","y"]
[185,1,{"$f":"IF(dataout!C194=\"Y\",\"Y\",IF(dataout!C194=\"T\",\"T\",\"N\"))","v":"Y"},{"$f":"IF(AND(dataout!C194=\"Y\",dataout!D194=\"not in\"),2,0)","v":0},185,"MILFORD                      ","1Y0",null,185,"Y"," ",{"$f":"dataout!L194","v":5000},{"$f":"dataout!T194","v":801},0,185,"MILFORD                      ",null,885,"WHITTIER","y"]
[186,1,{"$f":"IF(dataout!C195=\"Y\",\"Y\",IF(dataout!C195=\"T\",\"T\",\"N\"))","v":"N"},{"$f":"IF(AND(dataout!C195=\"Y\",dataout!D195=\"not in\"),2,0)","v":0},186,"MILLBURY                     ","1N0","You have chosen a district that does not enroll school choice pupils in FY16",186,"N"," ",{"$f":"dataout!L195","v":0},{"$f":"dataout!T195","v":0},0,186,"MILLBURY"]
[187,1,{"$f":"IF(dataout!C196=\"Y\",\"Y\",IF(dataout!C196=\"T\",\"T\",\"N\"))","v":"Y"},{"$f":"IF(AND(dataout!C196=\"Y\",dataout!D196=\"not in\"),2,0)","v":0},187,"MILLIS                       ","1Y0",null,187,"Y"," ",{"$f":"dataout!L196","v":5000},{"$f":"dataout!T196","v":" "},0,187,"MILLIS                       "]
[188,0,{"$f":"IF(dataout!C197=\"Y\",\"Y\",IF(dataout!C197=\"T\",\"T\",\"N\"))","v":"N"},{"$f":"IF(AND(dataout!C197=\"Y\",dataout!D197=\"not in\"),2,0)","v":0},188,"MILLVILLE                    ","0N0","You have chosen a non-operating school district",188,"N"," ",{"$f":"dataout!L197","v":0},{"$f":"dataout!T197","v":0},0,188,"MILLVILLE"]
[189,1,{"$f":"IF(dataout!C198=\"Y\",\"Y\",IF(dataout!C198=\"T\",\"T\",\"N\"))","v":"N"},{"$f":"IF(AND(dataout!C198=\"Y\",dataout!D198=\"not in\"),2,0)","v":0},189,"MILTON                       ","1N0","You have chosen a district that does not enroll school choice pupils in FY16",189,"N"," ",{"$f":"dataout!L198","v":0},{"$f":"dataout!T198","v":0},0,189,"MILTON"]
[190,0,{"$f":"IF(dataout!C199=\"Y\",\"Y\",IF(dataout!C199=\"T\",\"T\",\"N\"))","v":"N"},{"$f":"IF(AND(dataout!C199=\"Y\",dataout!D199=\"not in\"),2,0)","v":0},190,"MONROE                       ","0N0","You have chosen a non-operating school district",190,"N"," ",{"$f":"dataout!L199","v":0},{"$f":"dataout!T199","v":0},0,190,"MONROE"]
[191,1,{"$f":"IF(dataout!C200=\"Y\",\"Y\",IF(dataout!C200=\"T\",\"T\",\"N\"))","v":"Y"},{"$f":"IF(AND(dataout!C200=\"Y\",dataout!D200=\"not in\"),2,0)","v":0},191,"MONSON                       ","1Y0",null,191,"Y"," ",{"$f":"dataout!L200","v":5000},{"$f":"dataout!T200","v":" "},0,191,"MONSON"]
[192,0,{"$f":"IF(dataout!C201=\"Y\",\"Y\",IF(dataout!C201=\"T\",\"T\",\"N\"))","v":"N"},{"$f":"IF(AND(dataout!C201=\"Y\",dataout!D201=\"not in\"),2,0)","v":0},192,"MONTAGUE                     ","0N0","You have chosen a non-operating school district",192,"N"," ",{"$f":"dataout!L201","v":0},{"$f":"dataout!T201","v":0},0,192,"MONTAGUE"]
[193,0,{"$f":"IF(dataout!C202=\"Y\",\"Y\",IF(dataout!C202=\"T\",\"T\",\"N\"))","v":"N"},{"$f":"IF(AND(dataout!C202=\"Y\",dataout!D202=\"not in\"),2,0)","v":0},193,"MONTEREY                     ","0N0","You have chosen a non-operating school district",193,"N"," ",{"$f":"dataout!L202","v":0},{"$f":"dataout!T202","v":0},0,193,"MONTEREY"]
[194,0,{"$f":"IF(dataout!C203=\"Y\",\"Y\",IF(dataout!C203=\"T\",\"T\",\"N\"))","v":"N"},{"$f":"IF(AND(dataout!C203=\"Y\",dataout!D203=\"not in\"),2,0)","v":0},194,"MONTGOMERY                   ",{"$f":"B203&C203&D203","v":"0N0"},"You have chosen a non-operating school district",{"$f":"A203","v":194},{"$f":"C203","v":"N"},{"$f":"IF(G203=\"1Y2\",\"bad\",\" \")","v":" "},{"$f":"dataout!L203","v":0},{"$f":"dataout!T203","v":0},{"$f":"O203-A203","v":0},194,"MONTGOMERY"]
[195,0,{"$f":"IF(dataout!C204=\"Y\",\"Y\",IF(dataout!C204=\"T\",\"T\",\"N\"))","v":"N"},{"$f":"IF(AND(dataout!C204=\"Y\",dataout!D204=\"not in\"),2,0)","v":0},195,"MOUNT WASHINGTON             ","0N0","You have chosen a non-operating school district",195,"N"," ",{"$f":"dataout!L204","v":0},{"$f":"dataout!T204","v":0},0,195,"MOUNT WASHINGTON"]
[196,1,{"$f":"IF(dataout!C205=\"Y\",\"Y\",IF(dataout!C205=\"T\",\"T\",\"N\"))","v":"N"},{"$f":"IF(AND(dataout!C205=\"Y\",dataout!D205=\"not in\"),2,0)","v":0},196,"NAHANT                       ","1N0","You have chosen a district that does not enroll school choice pupils in FY16",196,"N"," ",{"$f":"dataout!L205","v":0},{"$f":"dataout!T205","v":0},0,196,"NAHANT"]
[197,1,{"$f":"IF(dataout!C206=\"Y\",\"Y\",IF(dataout!C206=\"T\",\"T\",\"N\"))","v":"N"},{"$f":"IF(AND(dataout!C206=\"Y\",dataout!D206=\"not in\"),2,0)","v":0},197,"NANTUCKET                    ","1N0","You have chosen a district that does not enroll school choice pupils in FY16",197,"N"," ",{"$f":"dataout!L206","v":0},{"$f":"dataout!T206","v":0},0,197,"NANTUCKET"]
[198,1,{"$f":"IF(dataout!C207=\"Y\",\"Y\",IF(dataout!C207=\"T\",\"T\",\"N\"))","v":"Y"},{"$f":"IF(AND(dataout!C207=\"Y\",dataout!D207=\"not in\"),2,0)","v":0},198,"NATICK                       ","1Y0",null,198,"Y"," ",{"$f":"dataout!L207","v":5000},{"$f":"dataout!T207","v":" "},0,198,"NATICK"]
[199,1,{"$f":"IF(dataout!C208=\"Y\",\"Y\",IF(dataout!C208=\"T\",\"T\",\"N\"))","v":"N"},{"$f":"IF(AND(dataout!C208=\"Y\",dataout!D208=\"not in\"),2,0)","v":0},199,"NEEDHAM                      ","1N0","You have chosen a district that does not enroll school choice pupils in FY16",199,"N"," ",{"$f":"dataout!L208","v":0},{"$f":"dataout!T208","v":0},0,199,"NEEDHAM"]
[200,0,{"$f":"IF(dataout!C209=\"Y\",\"Y\",IF(dataout!C209=\"T\",\"T\",\"N\"))","v":"N"},{"$f":"IF(AND(dataout!C209=\"Y\",dataout!D209=\"not in\"),2,0)","v":0},200,"NEW ASHFORD                  ","0N0","You have chosen a non-operating school district",200,"N"," ",{"$f":"dataout!L209","v":0},{"$f":"dataout!T209","v":0},0,200,"NEW ASHFORD"]
[201,1,{"$f":"IF(dataout!C210=\"Y\",\"Y\",IF(dataout!C210=\"T\",\"T\",\"N\"))","v":"T"},{"$f":"IF(AND(dataout!C210=\"Y\",dataout!D210=\"not in\"),2,0)","v":0},201,"NEW BEDFORD                  ","1T0","Not a school choice district, but regular ed choice rate is used for tuitioning from other districts",201,"T"," ",{"$f":"dataout!L210","v":5000},{"$f":"dataout!T210","v":" "},0,201,"NEW BEDFORD"]
[202,0,{"$f":"IF(dataout!C211=\"Y\",\"Y\",IF(dataout!C211=\"T\",\"T\",\"N\"))","v":"N"},{"$f":"IF(AND(dataout!C211=\"Y\",dataout!D211=\"not in\"),2,0)","v":0},202,"NEW BRAINTREE                ","0N0","You have chosen a non-operating school district",202,"N"," ",{"$f":"dataout!L211","v":0},{"$f":"dataout!T211","v":0},0,202,"NEW BRAINTREE"]
[203,0,{"$f":"IF(dataout!C212=\"Y\",\"Y\",IF(dataout!C212=\"T\",\"T\",\"N\"))","v":"N"},{"$f":"IF(AND(dataout!C212=\"Y\",dataout!D212=\"not in\"),2,0)","v":0},203,"NEWBURY                      ","0N0","You have chosen a non-operating school district",203,"N"," ",{"$f":"dataout!L212","v":0},{"$f":"dataout!T212","v":0},0,203,"NEWBURY"]
[204,1,{"$f":"IF(dataout!C213=\"Y\",\"Y\",IF(dataout!C213=\"T\",\"T\",\"N\"))","v":"Y"},{"$f":"IF(AND(dataout!C213=\"Y\",dataout!D213=\"not in\"),2,0)","v":0},204,"NEWBURYPORT                  ","1Y0",null,204,"Y"," ",{"$f":"dataout!L213","v":5000},{"$f":"dataout!T213","v":" "},0,204,"NEWBURYPORT                  "]
[205,0,{"$f":"IF(dataout!C214=\"Y\",\"Y\",IF(dataout!C214=\"T\",\"T\",\"N\"))","v":"N"},{"$f":"IF(AND(dataout!C214=\"Y\",dataout!D214=\"not in\"),2,0)","v":0},205,"NEW MARLBOROUGH              ","0N0","You have chosen a non-operating school district",205,"N"," ",{"$f":"dataout!L214","v":0},{"$f":"dataout!T214","v":0},0,205,"NEW MARLBOROUGH"]
[206,0,{"$f":"IF(dataout!C215=\"Y\",\"Y\",IF(dataout!C215=\"T\",\"T\",\"N\"))","v":"N"},{"$f":"IF(AND(dataout!C215=\"Y\",dataout!D215=\"not in\"),2,0)","v":0},206,"NEW SALEM                    ","0N0","You have chosen a non-operating school district",206,"N"," ",{"$f":"dataout!L215","v":0},{"$f":"dataout!T215","v":0},0,206,"NEW SALEM"]
[207,1,{"$f":"IF(dataout!C216=\"Y\",\"Y\",IF(dataout!C216=\"T\",\"T\",\"N\"))","v":"N"},{"$f":"IF(AND(dataout!C216=\"Y\",dataout!D216=\"not in\"),2,0)","v":0},207,"NEWTON                       ","1N0","You have chosen a district that does not enroll school choice pupils in FY16",207,"N"," ",{"$f":"dataout!L216","v":0},{"$f":"dataout!T216","v":0},0,207,"NEWTON"]
[208,1,{"$f":"IF(dataout!C217=\"Y\",\"Y\",IF(dataout!C217=\"T\",\"T\",\"N\"))","v":"N"},{"$f":"IF(AND(dataout!C217=\"Y\",dataout!D217=\"not in\"),2,0)","v":0},208,"NORFOLK                      ","1N0","You have chosen a district that does not enroll school choice pupils in FY16",208,"N"," ",{"$f":"dataout!L217","v":0},{"$f":"dataout!T217","v":0},0,208,"NORFOLK"]
[209,1,{"$f":"IF(dataout!C218=\"Y\",\"Y\",IF(dataout!C218=\"T\",\"T\",\"N\"))","v":"Y"},{"$f":"IF(AND(dataout!C218=\"Y\",dataout!D218=\"not in\"),2,0)","v":0},209,"NORTH ADAMS                  ","1Y0",null,209,"Y"," ",{"$f":"dataout!L218","v":5000},{"$f":"dataout!T218","v":" "},0,209,"NORTH ADAMS                  "]
[210,1,{"$f":"IF(dataout!C219=\"Y\",\"Y\",IF(dataout!C219=\"T\",\"T\",\"N\"))","v":"Y"},{"$f":"IF(AND(dataout!C219=\"Y\",dataout!D219=\"not in\"),2,0)","v":0},210,"NORTHAMPTON                  ","1Y0",null,210,"Y"," ",{"$f":"dataout!L219","v":5000},{"$f":"dataout!T219","v":" "},0,210,"NORTHAMPTON                  "]
[211,1,{"$f":"IF(dataout!C220=\"Y\",\"Y\",IF(dataout!C220=\"T\",\"T\",\"N\"))","v":"N"},{"$f":"IF(AND(dataout!C220=\"Y\",dataout!D220=\"not in\"),2,0)","v":0},211,"NORTH ANDOVER                ","1N0","You have chosen a district that does not enroll school choice pupils in FY16",211,"N"," ",{"$f":"dataout!L220","v":0},{"$f":"dataout!T220","v":0},0,211,"NORTH ANDOVER"]
[212,1,{"$f":"IF(dataout!C221=\"Y\",\"Y\",IF(dataout!C221=\"T\",\"T\",\"N\"))","v":"N"},{"$f":"IF(AND(dataout!C221=\"Y\",dataout!D221=\"not in\"),2,0)","v":0},212,"NORTH ATTLEBOROUGH           ","1N0","You have chosen a district that does not enroll school choice pupils in FY16",212,"N"," ",{"$f":"dataout!L221","v":0},{"$f":"dataout!T221","v":0},0,212,"NORTH ATTLEBOROUGH"]
[213,1,{"$f":"IF(dataout!C222=\"Y\",\"Y\",IF(dataout!C222=\"T\",\"T\",\"N\"))","v":"N"},{"$f":"IF(AND(dataout!C222=\"Y\",dataout!D222=\"not in\"),2,0)","v":0},213,"NORTHBOROUGH                 ","1N0","You have chosen a district that does not enroll school choice pupils in FY16",213,"N"," ",{"$f":"dataout!L222","v":0},{"$f":"dataout!T222","v":0},0,213,"NORTHBOROUGH"]
[214,1,{"$f":"IF(dataout!C223=\"Y\",\"Y\",IF(dataout!C223=\"T\",\"T\",\"N\"))","v":"Y"},{"$f":"IF(AND(dataout!C223=\"Y\",dataout!D223=\"not in\"),2,0)","v":0},214,"NORTHBRIDGE                  ","1Y0",null,214,"Y"," ",{"$f":"dataout!L223","v":5000},{"$f":"dataout!T223","v":" "},0,214,"NORTHBRIDGE                  "]
[{"$f":"VALUE(E224)","v":215},1,{"$f":"IF(dataout!C224=\"Y\",\"Y\",IF(dataout!C224=\"T\",\"T\",\"N\"))","v":"Y"},{"$f":"IF(AND(dataout!C224=\"Y\",dataout!D224=\"not in\"),2,0)","v":0},215,"NORTH BROOKFIELD             ","1Y0",null,215,"Y"," ",{"$f":"dataout!L224","v":5000},{"$f":"dataout!T224","v":" "},0,215,"NORTH BROOKFIELD             "]
[{"$f":"VALUE(E225)","v":216},0,{"$f":"IF(dataout!C225=\"Y\",\"Y\",IF(dataout!C225=\"T\",\"T\",\"N\"))","v":"N"},{"$f":"IF(AND(dataout!C225=\"Y\",dataout!D225=\"not in\"),2,0)","v":0},216,"NORTHFIELD                   ","0N0","You have chosen a non-operating school district",216,"N"," ",{"$f":"dataout!L225","v":0},{"$f":"dataout!T225","v":0},0,216,"NORTHFIELD"]
[217,1,{"$f":"IF(dataout!C226=\"Y\",\"Y\",IF(dataout!C226=\"T\",\"T\",\"N\"))","v":"N"},{"$f":"IF(AND(dataout!C226=\"Y\",dataout!D226=\"not in\"),2,0)","v":0},217,"NORTH READING                ","1N0","You have chosen a district that does not enroll school choice pupils in FY16",217,"N"," ",{"$f":"dataout!L226","v":0},{"$f":"dataout!T226","v":0},0,217,"NORTH READING"]
[218,1,{"$f":"IF(dataout!C227=\"Y\",\"Y\",IF(dataout!C227=\"T\",\"T\",\"N\"))","v":"Y"},{"$f":"IF(AND(dataout!C227=\"Y\",dataout!D227=\"not in\"),2,0)","v":0},218,"NORTON                       ","1Y0",null,218,"Y"," ",{"$f":"dataout!L227","v":5000},{"$f":"dataout!T227","v":" "},0,218,"NORTON"]
[219,1,{"$f":"IF(dataout!C228=\"Y\",\"Y\",IF(dataout!C228=\"T\",\"T\",\"N\"))","v":"N"},{"$f":"IF(AND(dataout!C228=\"Y\",dataout!D228=\"not in\"),2,0)","v":0},219,"NORWELL                      ","1N0","You have chosen a district that does not enroll school choice pupils in FY16",219,"N"," ",{"$f":"dataout!L228","v":0},{"$f":"dataout!T228","v":0},0,219,"NORWELL"]
[220,1,{"$f":"IF(dataout!C229=\"Y\",\"Y\",IF(dataout!C229=\"T\",\"T\",\"N\"))","v":"N"},{"$f":"IF(AND(dataout!C229=\"Y\",dataout!D229=\"not in\"),2,0)","v":0},220,"NORWOOD                      ","1N0","You have chosen a district that does not enroll school choice pupils in FY16",220,"N"," ",{"$f":"dataout!L229","v":0},{"$f":"dataout!T229","v":0},0,220,"NORWOOD"]
[221,1,{"$f":"IF(dataout!C230=\"Y\",\"Y\",IF(dataout!C230=\"T\",\"T\",\"N\"))","v":"Y"},{"$f":"IF(AND(dataout!C230=\"Y\",dataout!D230=\"not in\"),2,0)","v":0},221,"OAK BLUFFS                   ","1Y0",null,221,"Y"," ",{"$f":"dataout!L230","v":5000},{"$f":"dataout!T230","v":" "},0,221,"OAK BLUFFS                   "]
[222,0,{"$f":"IF(dataout!C231=\"Y\",\"Y\",IF(dataout!C231=\"T\",\"T\",\"N\"))","v":"N"},{"$f":"IF(AND(dataout!C231=\"Y\",dataout!D231=\"not in\"),2,0)","v":0},222,"OAKHAM                       ","0N0","You have chosen a non-operating school district",222,"N"," ",{"$f":"dataout!L231","v":0},{"$f":"dataout!T231","v":0},0,222,"OAKHAM"]
[223,1,{"$f":"IF(dataout!C232=\"Y\",\"Y\",IF(dataout!C232=\"T\",\"T\",\"N\"))","v":"Y"},{"$f":"IF(AND(dataout!C232=\"Y\",dataout!D232=\"not in\"),2,0)","v":0},223,"ORANGE                       ","1Y0",null,223,"Y"," ",{"$f":"dataout!L232","v":5000},{"$f":"dataout!T232","v":" "},0,223,"ORANGE                       "]
[224,1,{"$f":"IF(dataout!C233=\"Y\",\"Y\",IF(dataout!C233=\"T\",\"T\",\"N\"))","v":"Y"},{"$f":"IF(AND(dataout!C233=\"Y\",dataout!D233=\"not in\"),2,0)","v":0},224,"ORLEANS                      ","1Y0",null,224,"Y"," ",{"$f":"dataout!L233","v":5000},{"$f":"dataout!T233","v":" "},0,224,"ORLEANS"]
[225,0,{"$f":"IF(dataout!C234=\"Y\",\"Y\",IF(dataout!C234=\"T\",\"T\",\"N\"))","v":"N"},{"$f":"IF(AND(dataout!C234=\"Y\",dataout!D234=\"not in\"),2,0)","v":0},225,"OTIS                         ","0N0","You have chosen a non-operating school district",225,"N"," ",{"$f":"dataout!L234","v":0},{"$f":"dataout!T234","v":0},0,225,"OTIS"]
[226,1,{"$f":"IF(dataout!C235=\"Y\",\"Y\",IF(dataout!C235=\"T\",\"T\",\"N\"))","v":"Y"},{"$f":"IF(AND(dataout!C235=\"Y\",dataout!D235=\"not in\"),2,0)","v":0},226,"OXFORD                       ","1Y0",null,226,"Y"," ",{"$f":"dataout!L235","v":5000},{"$f":"dataout!T235","v":" "},0,226,"OXFORD"]
[227,1,{"$f":"IF(dataout!C236=\"Y\",\"Y\",IF(dataout!C236=\"T\",\"T\",\"N\"))","v":"Y"},{"$f":"IF(AND(dataout!C236=\"Y\",dataout!D236=\"not in\"),2,0)","v":0},227,"PALMER                       ","1Y0",null,227,"Y"," ",{"$f":"dataout!L236","v":5000},{"$f":"dataout!T236","v":" "},0,227,"PALMER"]
[228,0,{"$f":"IF(dataout!C237=\"Y\",\"Y\",IF(dataout!C237=\"T\",\"T\",\"N\"))","v":"N"},{"$f":"IF(AND(dataout!C237=\"Y\",dataout!D237=\"not in\"),2,0)","v":0},228,"PAXTON                       ","0N0","You have chosen a non-operating school district",228,"N"," ",{"$f":"dataout!L237","v":0},{"$f":"dataout!T237","v":0},0,228,"PAXTON"]
[229,1,{"$f":"IF(dataout!C238=\"Y\",\"Y\",IF(dataout!C238=\"T\",\"T\",\"N\"))","v":"Y"},{"$f":"IF(AND(dataout!C238=\"Y\",dataout!D238=\"not in\"),2,0)","v":0},229,"PEABODY                      ","1Y0",null,229,"Y"," ",{"$f":"dataout!L238","v":5000},{"$f":"dataout!T238","v":3002},0,229,"PEABODY"]
[230,1,{"$f":"IF(dataout!C239=\"Y\",\"Y\",IF(dataout!C239=\"T\",\"T\",\"N\"))","v":"Y"},{"$f":"IF(AND(dataout!C239=\"Y\",dataout!D239=\"not in\"),2,0)","v":0},230,"PELHAM                       ","1Y0",null,230,"Y"," ",{"$f":"dataout!L239","v":5000},{"$f":"dataout!T239","v":" "},0,230,"PELHAM                       "]
[231,1,{"$f":"IF(dataout!C240=\"Y\",\"Y\",IF(dataout!C240=\"T\",\"T\",\"N\"))","v":"N"},{"$f":"IF(AND(dataout!C240=\"Y\",dataout!D240=\"not in\"),2,0)","v":0},231,"PEMBROKE                     ","1N0","You have chosen a district that does not enroll school choice pupils in FY16",231,"N"," ",{"$f":"dataout!L240","v":0},{"$f":"dataout!T240","v":0},0,231,"PEMBROKE"]
[232,0,{"$f":"IF(dataout!C241=\"Y\",\"Y\",IF(dataout!C241=\"T\",\"T\",\"N\"))","v":"N"},{"$f":"IF(AND(dataout!C241=\"Y\",dataout!D241=\"not in\"),2,0)","v":0},232,"PEPPERELL                    ","0N0","You have chosen a non-operating school district",232,"N"," ",{"$f":"dataout!L241","v":0},{"$f":"dataout!T241","v":0},0,232,"PEPPERELL"]
[233,0,{"$f":"IF(dataout!C242=\"Y\",\"Y\",IF(dataout!C242=\"T\",\"T\",\"N\"))","v":"N"},{"$f":"IF(AND(dataout!C242=\"Y\",dataout!D242=\"not in\"),2,0)","v":0},233,"PERU                         ","0N0","You have chosen a non-operating school district",233,"N"," ",{"$f":"dataout!L242","v":0},{"$f":"dataout!T242","v":0},0,233,"PERU"]
[234,1,{"$f":"IF(dataout!C243=\"Y\",\"Y\",IF(dataout!C243=\"T\",\"T\",\"N\"))","v":"Y"},{"$f":"IF(AND(dataout!C243=\"Y\",dataout!D243=\"not in\"),2,0)","v":0},234,"PETERSHAM                    ","1Y0",null,234,"Y"," ",{"$f":"dataout!L243","v":5000},{"$f":"dataout!T243","v":" "},0,234,"PETERSHAM                    "]
[235,0,{"$f":"IF(dataout!C244=\"Y\",\"Y\",IF(dataout!C244=\"T\",\"T\",\"N\"))","v":"N"},{"$f":"IF(AND(dataout!C244=\"Y\",dataout!D244=\"not in\"),2,0)","v":0},235,"PHILLIPSTON                  ","0N0","You have chosen a non-operating school district",235,"N"," ",{"$f":"dataout!L244","v":0},{"$f":"dataout!T244","v":0},0,235,"PHILLIPSTON"]
[236,1,{"$f":"IF(dataout!C245=\"Y\",\"Y\",IF(dataout!C245=\"T\",\"T\",\"N\"))","v":"Y"},{"$f":"IF(AND(dataout!C245=\"Y\",dataout!D245=\"not in\"),2,0)","v":0},236,"PITTSFIELD                   ","1Y0",null,236,"Y"," ",{"$f":"dataout!L245","v":5000},{"$f":"dataout!T245","v":5000},0,236,"PITTSFIELD                   "]
[237,0,{"$f":"IF(dataout!C246=\"Y\",\"Y\",IF(dataout!C246=\"T\",\"T\",\"N\"))","v":"N"},{"$f":"IF(AND(dataout!C246=\"Y\",dataout!D246=\"not in\"),2,0)","v":0},237,"PLAINFIELD                   ","0N0","You have chosen a non-operating school district",237,"N"," ",{"$f":"dataout!L246","v":0},{"$f":"dataout!T246","v":0},0,237,"PLAINFIELD"]
[238,1,{"$f":"IF(dataout!C247=\"Y\",\"Y\",IF(dataout!C247=\"T\",\"T\",\"N\"))","v":"N"},{"$f":"IF(AND(dataout!C247=\"Y\",dataout!D247=\"not in\"),2,0)","v":0},238,"PLAINVILLE                   ","1N0","You have chosen a district that does not enroll school choice pupils in FY16",238,"N"," ",{"$f":"dataout!L247","v":0},{"$f":"dataout!T247","v":0},0,238,"PLAINVILLE"]
[239,1,{"$f":"IF(dataout!C248=\"Y\",\"Y\",IF(dataout!C248=\"T\",\"T\",\"N\"))","v":"N"},{"$f":"IF(AND(dataout!C248=\"Y\",dataout!D248=\"not in\"),2,0)","v":0},239,"PLYMOUTH                     ","1N0","You have chosen a district that does not enroll school choice pupils in FY16",239,"N"," ",{"$f":"dataout!L248","v":0},{"$f":"dataout!T248","v":0},0,239,"PLYMOUTH"]
[240,1,{"$f":"IF(dataout!C249=\"Y\",\"Y\",IF(dataout!C249=\"T\",\"T\",\"N\"))","v":"Y"},{"$f":"IF(AND(dataout!C249=\"Y\",dataout!D249=\"not in\"),2,0)","v":0},240,"PLYMPTON                     ","1Y0",null,240,"Y"," ",{"$f":"dataout!L249","v":5000},{"$f":"dataout!T249","v":" "},0,240,"PLYMPTON"]
[241,0,{"$f":"IF(dataout!C250=\"Y\",\"Y\",IF(dataout!C250=\"T\",\"T\",\"N\"))","v":"N"},{"$f":"IF(AND(dataout!C250=\"Y\",dataout!D250=\"not in\"),2,0)","v":0},241,"PRINCETON                    ","0N0","You have chosen a non-operating school district",241,"N"," ",{"$f":"dataout!L250","v":0},{"$f":"dataout!T250","v":0},0,241,"PRINCETON"]
[242,1,{"$f":"IF(dataout!C251=\"Y\",\"Y\",IF(dataout!C251=\"T\",\"T\",\"N\"))","v":"Y"},{"$f":"IF(AND(dataout!C251=\"Y\",dataout!D251=\"not in\"),2,0)","v":0},242,"PROVINCETOWN                 ","1Y0",null,242,"Y"," ",{"$f":"dataout!L251","v":5000},{"$f":"dataout!T251","v":" "},0,242,"PROVINCETOWN                 "]
[243,1,{"$f":"IF(dataout!C252=\"Y\",\"Y\",IF(dataout!C252=\"T\",\"T\",\"N\"))","v":"N"},{"$f":"IF(AND(dataout!C252=\"Y\",dataout!D252=\"not in\"),2,0)","v":0},243,"QUINCY                       ","1N0","You have chosen a district that does not enroll school choice pupils in FY16",243,"N"," ",{"$f":"dataout!L252","v":0},{"$f":"dataout!T252","v":0},0,243,"QUINCY"]
[244,1,{"$f":"IF(dataout!C253=\"Y\",\"Y\",IF(dataout!C253=\"T\",\"T\",\"N\"))","v":"Y"},{"$f":"IF(AND(dataout!C253=\"Y\",dataout!D253=\"not in\"),2,0)","v":0},244,"RANDOLPH                     ","1Y0",null,244,"Y"," ",{"$f":"dataout!L253","v":5000},{"$f":"dataout!T253","v":" "},0,244,"RANDOLPH"]
[245,0,{"$f":"IF(dataout!C254=\"Y\",\"Y\",IF(dataout!C254=\"T\",\"T\",\"N\"))","v":"N"},{"$f":"IF(AND(dataout!C254=\"Y\",dataout!D254=\"not in\"),2,0)","v":0},245,"RAYNHAM                      ","0N0","You have chosen a non-operating school district",245,"N"," ",{"$f":"dataout!L254","v":0},{"$f":"dataout!T254","v":0},0,245,"RAYNHAM"]
[246,1,{"$f":"IF(dataout!C255=\"Y\",\"Y\",IF(dataout!C255=\"T\",\"T\",\"N\"))","v":"N"},{"$f":"IF(AND(dataout!C255=\"Y\",dataout!D255=\"not in\"),2,0)","v":0},246,"READING                      ","1N0","You have chosen a district that does not enroll school choice pupils in FY16",246,"N"," ",{"$f":"dataout!L255","v":0},{"$f":"dataout!T255","v":0},0,246,"READING"]
[247,0,{"$f":"IF(dataout!C256=\"Y\",\"Y\",IF(dataout!C256=\"T\",\"T\",\"N\"))","v":"N"},{"$f":"IF(AND(dataout!C256=\"Y\",dataout!D256=\"not in\"),2,0)","v":0},247,"REHOBOTH                     ","0N0","You have chosen a non-operating school district",247,"N"," ",{"$f":"dataout!L256","v":0},{"$f":"dataout!T256","v":0},0,247,"REHOBOTH"]
[248,1,{"$f":"IF(dataout!C257=\"Y\",\"Y\",IF(dataout!C257=\"T\",\"T\",\"N\"))","v":"N"},{"$f":"IF(AND(dataout!C257=\"Y\",dataout!D257=\"not in\"),2,0)","v":0},248,"REVERE                       ","1N0","You have chosen a district that does not enroll school choice pupils in FY16",248,"N"," ",{"$f":"dataout!L257","v":0},{"$f":"dataout!T257","v":0},0,248,"REVERE"]
[249,1,{"$f":"IF(dataout!C258=\"Y\",\"Y\",IF(dataout!C258=\"T\",\"T\",\"N\"))","v":"Y"},{"$f":"IF(AND(dataout!C258=\"Y\",dataout!D258=\"not in\"),2,0)","v":0},249,"RICHMOND                     ","1Y0",null,249,"Y"," ",{"$f":"dataout!L258","v":5000},{"$f":"dataout!T258","v":" "},0,249,"RICHMOND                     "]
[250,1,{"$f":"IF(dataout!C259=\"Y\",\"Y\",IF(dataout!C259=\"T\",\"T\",\"N\"))","v":"N"},{"$f":"IF(AND(dataout!C259=\"Y\",dataout!D259=\"not in\"),2,0)","v":0},250,"ROCHESTER                    ","1N0","You have chosen a district that does not enroll school choice pupils in FY16",250,"N"," ",{"$f":"dataout!L259","v":0},{"$f":"dataout!T259","v":0},0,250,"ROCHESTER"]
[251,1,{"$f":"IF(dataout!C260=\"Y\",\"Y\",IF(dataout!C260=\"T\",\"T\",\"N\"))","v":"Y"},{"$f":"IF(AND(dataout!C260=\"Y\",dataout!D260=\"not in\"),2,0)","v":0},251,"ROCKLAND                     ","1Y0",null,251,"Y"," ",{"$f":"dataout!L260","v":5000},{"$f":"dataout!T260","v":" "},0,251,"ROCKLAND"]
[252,1,{"$f":"IF(dataout!C261=\"Y\",\"Y\",IF(dataout!C261=\"T\",\"T\",\"N\"))","v":"Y"},{"$f":"IF(AND(dataout!C261=\"Y\",dataout!D261=\"not in\"),2,0)","v":0},252,"ROCKPORT                     ","1Y0",null,252,"Y"," ",{"$f":"dataout!L261","v":5000},{"$f":"dataout!T261","v":" "},0,252,"ROCKPORT                     "]
[253,1,{"$f":"IF(dataout!C262=\"Y\",\"Y\",IF(dataout!C262=\"T\",\"T\",\"N\"))","v":"Y"},{"$f":"IF(AND(dataout!C262=\"Y\",dataout!D262=\"not in\"),2,0)","v":0},253,"ROWE                         ","1Y0",null,253,"Y"," ",{"$f":"dataout!L262","v":5000},{"$f":"dataout!T262","v":" "},0,253,"ROWE                         "]
[254,0,{"$f":"IF(dataout!C263=\"Y\",\"Y\",IF(dataout!C263=\"T\",\"T\",\"N\"))","v":"N"},{"$f":"IF(AND(dataout!C263=\"Y\",dataout!D263=\"not in\"),2,0)","v":0},254,"ROWLEY                       ","0N0","You have chosen a non-operating school district",254,"N"," ",{"$f":"dataout!L263","v":0},{"$f":"dataout!T263","v":0},0,254,"ROWLEY"]
[{"$f":"VALUE(E264)","v":255},0,{"$f":"IF(dataout!C264=\"Y\",\"Y\",IF(dataout!C264=\"T\",\"T\",\"N\"))","v":"N"},{"$f":"IF(AND(dataout!C264=\"Y\",dataout!D264=\"not in\"),2,0)","v":0},255,"ROYALSTON                    ","0N0","You have chosen a non-operating school district",255,"N"," ",{"$f":"dataout!L264","v":0},{"$f":"dataout!T264","v":0},0,255,"ROYALSTON"]
[256,0,{"$f":"IF(dataout!C265=\"Y\",\"Y\",IF(dataout!C265=\"T\",\"T\",\"N\"))","v":"N"},{"$f":"IF(AND(dataout!C265=\"Y\",dataout!D265=\"not in\"),2,0)","v":0},256,"RUSSELL                      ","0N0","You have chosen a non-operating school district",256,"N"," ",{"$f":"dataout!L265","v":0},{"$f":"dataout!T265","v":0},0,256,"RUSSELL"]
[257,0,{"$f":"IF(dataout!C266=\"Y\",\"Y\",IF(dataout!C266=\"T\",\"T\",\"N\"))","v":"N"},{"$f":"IF(AND(dataout!C266=\"Y\",dataout!D266=\"not in\"),2,0)","v":0},257,"RUTLAND                      ","0N0","You have chosen a non-operating school district",257,"N"," ",{"$f":"dataout!L266","v":0},{"$f":"dataout!T266","v":0},0,257,"RUTLAND"]
[{"$f":"VALUE(E267)","v":258},1,{"$f":"IF(dataout!C267=\"Y\",\"Y\",IF(dataout!C267=\"T\",\"T\",\"N\"))","v":"N"},{"$f":"IF(AND(dataout!C267=\"Y\",dataout!D267=\"not in\"),2,0)","v":0},258,"SALEM                        ",{"$f":"B267&C267&D267","v":"1N0"},"You have chosen a district that does not enroll school choice pupils in FY16",{"$f":"A267","v":258},{"$f":"C267","v":"N"},{"$f":"IF(G267=\"1Y2\",\"bad\",\" \")","v":" "},{"$f":"dataout!L267","v":0},{"$f":"dataout!T267","v":0},{"$f":"O267-A267","v":0},258,"SALEM"]
[{"$f":"VALUE(E268)","v":259},0,{"$f":"IF(dataout!C268=\"Y\",\"Y\",IF(dataout!C268=\"T\",\"T\",\"N\"))","v":"N"},{"$f":"IF(AND(dataout!C268=\"Y\",dataout!D268=\"not in\"),2,0)","v":0},259,"SALISBURY                    ","0N0","You have chosen a non-operating school district",259,"N"," ",{"$f":"dataout!L268","v":0},{"$f":"dataout!T268","v":0},0,259,"SALISBURY"]
[260,0,{"$f":"IF(dataout!C269=\"Y\",\"Y\",IF(dataout!C269=\"T\",\"T\",\"N\"))","v":"N"},{"$f":"IF(AND(dataout!C269=\"Y\",dataout!D269=\"not in\"),2,0)","v":0},260,"SANDISFIELD                  ","0N0","You have chosen a non-operating school district",260,"N"," ",{"$f":"dataout!L269","v":0},{"$f":"dataout!T269","v":0},0,260,"SANDISFIELD"]
[261,1,{"$f":"IF(dataout!C270=\"Y\",\"Y\",IF(dataout!C270=\"T\",\"T\",\"N\"))","v":"Y"},{"$f":"IF(AND(dataout!C270=\"Y\",dataout!D270=\"not in\"),2,0)","v":0},261,"SANDWICH                     ","1Y0",null,261,"Y"," ",{"$f":"dataout!L270","v":5000},{"$f":"dataout!T270","v":" "},0,261,"SANDWICH"]
[262,1,{"$f":"IF(dataout!C271=\"Y\",\"Y\",IF(dataout!C271=\"T\",\"T\",\"N\"))","v":"N"},{"$f":"IF(AND(dataout!C271=\"Y\",dataout!D271=\"not in\"),2,0)","v":0},262,"SAUGUS                       ","1N0","You have chosen a district that does not enroll school choice pupils in FY16",262,"N"," ",{"$f":"dataout!L271","v":0},{"$f":"dataout!T271","v":0},0,262,"SAUGUS"]
[263,1,{"$f":"IF(dataout!C272=\"Y\",\"Y\",IF(dataout!C272=\"T\",\"T\",\"N\"))","v":"Y"},{"$f":"IF(AND(dataout!C272=\"Y\",dataout!D272=\"not in\"),2,0)","v":0},263,"SAVOY                        ","1Y0",null,263,"Y"," ",{"$f":"dataout!L272","v":5000},{"$f":"dataout!T272","v":" "},0,263,"SAVOY                        "]
[264,1,{"$f":"IF(dataout!C273=\"Y\",\"Y\",IF(dataout!C273=\"T\",\"T\",\"N\"))","v":"N"},{"$f":"IF(AND(dataout!C273=\"Y\",dataout!D273=\"not in\"),2,0)","v":0},264,"SCITUATE                     ","1N0","You have chosen a district that does not enroll school choice pupils in FY16",264,"N"," ",{"$f":"dataout!L273","v":0},{"$f":"dataout!T273","v":0},0,264,"SCITUATE"]
[265,1,{"$f":"IF(dataout!C274=\"Y\",\"Y\",IF(dataout!C274=\"T\",\"T\",\"N\"))","v":"N"},{"$f":"IF(AND(dataout!C274=\"Y\",dataout!D274=\"not in\"),2,0)","v":0},265,"SEEKONK                      ","1N0","You have chosen a district that does not enroll school choice pupils in FY16",265,"N"," ",{"$f":"dataout!L274","v":0},{"$f":"dataout!T274","v":0},0,265,"SEEKONK"]
[266,1,{"$f":"IF(dataout!C275=\"Y\",\"Y\",IF(dataout!C275=\"T\",\"T\",\"N\"))","v":"N"},{"$f":"IF(AND(dataout!C275=\"Y\",dataout!D275=\"not in\"),2,0)","v":0},266,"SHARON                       ","1N0","You have chosen a district that does not enroll school choice pupils in FY16",266,"N"," ",{"$f":"dataout!L275","v":0},{"$f":"dataout!T275","v":0},0,266,"SHARON"]
[267,0,{"$f":"IF(dataout!C276=\"Y\",\"Y\",IF(dataout!C276=\"T\",\"T\",\"N\"))","v":"N"},{"$f":"IF(AND(dataout!C276=\"Y\",dataout!D276=\"not in\"),2,0)","v":0},267,"SHEFFIELD                    ","0N0","You have chosen a non-operating school district",267,"N"," ",{"$f":"dataout!L276","v":0},{"$f":"dataout!T276","v":0},0,267,"SHEFFIELD"]
[268,0,{"$f":"IF(dataout!C277=\"Y\",\"Y\",IF(dataout!C277=\"T\",\"T\",\"N\"))","v":"N"},{"$f":"IF(AND(dataout!C277=\"Y\",dataout!D277=\"not in\"),2,0)","v":0},268,"SHELBURNE                    ","0N0","You have chosen a non-operating school district",268,"N"," ",{"$f":"dataout!L277","v":0},{"$f":"dataout!T277","v":0},0,268,"SHELBURNE"]
[269,1,{"$f":"IF(dataout!C278=\"Y\",\"Y\",IF(dataout!C278=\"T\",\"T\",\"N\"))","v":"N"},{"$f":"IF(AND(dataout!C278=\"Y\",dataout!D278=\"not in\"),2,0)","v":0},269,"SHERBORN                     ","1N0","You have chosen a district that does not enroll school choice pupils in FY16",269,"N"," ",{"$f":"dataout!L278","v":0},{"$f":"dataout!T278","v":0},0,269,"SHERBORN"]
[270,0,{"$f":"IF(dataout!C279=\"Y\",\"Y\",IF(dataout!C279=\"T\",\"T\",\"N\"))","v":"N"},{"$f":"IF(AND(dataout!C279=\"Y\",dataout!D279=\"not in\"),2,0)","v":0},270,"SHIRLEY                      ","0N0","You have chosen a non-operating school district",270,"N"," ",{"$f":"dataout!L279","v":0},{"$f":"dataout!T279","v":0},0,270,"SHIRLEY                      "]
[271,1,{"$f":"IF(dataout!C280=\"Y\",\"Y\",IF(dataout!C280=\"T\",\"T\",\"N\"))","v":"N"},{"$f":"IF(AND(dataout!C280=\"Y\",dataout!D280=\"not in\"),2,0)","v":0},271,"SHREWSBURY                   ","1N0",null,271,"N"," ",{"$f":"dataout!L280","v":0},{"$f":"dataout!T280","v":0},0,271,"SHREWSBURY"]
[272,1,{"$f":"IF(dataout!C281=\"Y\",\"Y\",IF(dataout!C281=\"T\",\"T\",\"N\"))","v":"N"},{"$f":"IF(AND(dataout!C281=\"Y\",dataout!D281=\"not in\"),2,0)","v":0},272,"SHUTESBURY                   ","1N0","You have chosen a district that does not enroll school choice pupils in FY16",272,"N"," ",{"$f":"dataout!L281","v":0},{"$f":"dataout!T281","v":0},0,272,"SHUTESBURY"]
[273,1,{"$f":"IF(dataout!C282=\"Y\",\"Y\",IF(dataout!C282=\"T\",\"T\",\"N\"))","v":"N"},{"$f":"IF(AND(dataout!C282=\"Y\",dataout!D282=\"not in\"),2,0)","v":0},273,"SOMERSET                     ","1N0","You have chosen a district that does not enroll school choice pupils in FY16",273,"N"," ",{"$f":"dataout!L282","v":0},{"$f":"dataout!T282","v":0},0,273,"SOMERSET"]
[274,1,{"$f":"IF(dataout!C283=\"Y\",\"Y\",IF(dataout!C283=\"T\",\"T\",\"N\"))","v":"N"},{"$f":"IF(AND(dataout!C283=\"Y\",dataout!D283=\"not in\"),2,0)","v":0},274,"SOMERVILLE                   ","1N0","You have chosen a district that does not enroll school choice pupils in FY16",274,"N"," ",{"$f":"dataout!L283","v":0},{"$f":"dataout!T283","v":0},0,274,"SOMERVILLE"]
[275,1,{"$f":"IF(dataout!C284=\"Y\",\"Y\",IF(dataout!C284=\"T\",\"T\",\"N\"))","v":"Y"},{"$f":"IF(AND(dataout!C284=\"Y\",dataout!D284=\"not in\"),2,0)","v":0},275,"SOUTHAMPTON                  ","1Y0",null,275,"Y"," ",{"$f":"dataout!L284","v":5000},{"$f":"dataout!T284","v":" "},0,275,"SOUTHAMPTON                  "]
[276,1,{"$f":"IF(dataout!C285=\"Y\",\"Y\",IF(dataout!C285=\"T\",\"T\",\"N\"))","v":"N"},{"$f":"IF(AND(dataout!C285=\"Y\",dataout!D285=\"not in\"),2,0)","v":0},276,"SOUTHBOROUGH                 ","1N0","You have chosen a district that does not enroll school choice pupils in FY16",276,"N"," ",{"$f":"dataout!L285","v":0},{"$f":"dataout!T285","v":0},0,276,"SOUTHBOROUGH"]
[277,1,{"$f":"IF(dataout!C286=\"Y\",\"Y\",IF(dataout!C286=\"T\",\"T\",\"N\"))","v":"Y"},{"$f":"IF(AND(dataout!C286=\"Y\",dataout!D286=\"not in\"),2,0)","v":0},277,"SOUTHBRIDGE                  ","1Y0",null,277,"Y"," ",{"$f":"dataout!L286","v":5000},{"$f":"dataout!T286","v":" "},0,277,"SOUTHBRIDGE                  "]
[278,1,{"$f":"IF(dataout!C287=\"Y\",\"Y\",IF(dataout!C287=\"T\",\"T\",\"N\"))","v":"Y"},{"$f":"IF(AND(dataout!C287=\"Y\",dataout!D287=\"not in\"),2,0)","v":0},278,"SOUTH HADLEY                 ","1Y0",null,278,"Y"," ",{"$f":"dataout!L287","v":5000},{"$f":"dataout!T287","v":5000},0,278,"SOUTH HADLEY                 "]
[279,0,{"$f":"IF(dataout!C288=\"Y\",\"Y\",IF(dataout!C288=\"T\",\"T\",\"N\"))","v":"N"},{"$f":"IF(AND(dataout!C288=\"Y\",dataout!D288=\"not in\"),2,0)","v":0},279,"SOUTHWICK                    ","0N0","You have chosen a non-operating school district",279,"N"," ",{"$f":"dataout!L288","v":0},{"$f":"dataout!T288","v":0},0,279,"SOUTHWICK"]
[280,0,{"$f":"IF(dataout!C289=\"Y\",\"Y\",IF(dataout!C289=\"T\",\"T\",\"N\"))","v":"N"},{"$f":"IF(AND(dataout!C289=\"Y\",dataout!D289=\"not in\"),2,0)","v":0},280,"SPENCER                      ","0N0","You have chosen a non-operating school district",280,"N"," ",{"$f":"dataout!L289","v":0},{"$f":"dataout!T289","v":0},0,280,"SPENCER"]
[281,1,{"$f":"IF(dataout!C290=\"Y\",\"Y\",IF(dataout!C290=\"T\",\"T\",\"N\"))","v":"Y"},{"$f":"IF(AND(dataout!C290=\"Y\",dataout!D290=\"not in\"),2,0)","v":0},281,"SPRINGFIELD                  ","1Y0",null,281,"Y"," ",{"$f":"dataout!L290","v":5000},{"$f":"dataout!T290","v":5000},0,281,"SPRINGFIELD                  "]
[282,0,{"$f":"IF(dataout!C291=\"Y\",\"Y\",IF(dataout!C291=\"T\",\"T\",\"N\"))","v":"N"},{"$f":"IF(AND(dataout!C291=\"Y\",dataout!D291=\"not in\"),2,0)","v":0},282,"STERLING                     ","0N0","You have chosen a non-operating school district",282,"N"," ",{"$f":"dataout!L291","v":0},{"$f":"dataout!T291","v":0},0,282,"STERLING"]
[283,0,{"$f":"IF(dataout!C292=\"Y\",\"Y\",IF(dataout!C292=\"T\",\"T\",\"N\"))","v":"N"},{"$f":"IF(AND(dataout!C292=\"Y\",dataout!D292=\"not in\"),2,0)","v":0},283,"STOCKBRIDGE                  ","0N0","You have chosen a non-operating school district",283,"N"," ",{"$f":"dataout!L292","v":0},{"$f":"dataout!T292","v":0},0,283,"STOCKBRIDGE"]
[284,1,{"$f":"IF(dataout!C293=\"Y\",\"Y\",IF(dataout!C293=\"T\",\"T\",\"N\"))","v":"N"},{"$f":"IF(AND(dataout!C293=\"Y\",dataout!D293=\"not in\"),2,0)","v":0},284,"STONEHAM                     ","1N0","You have chosen a district that does not enroll school choice pupils in FY16",284,"N"," ",{"$f":"dataout!L293","v":0},{"$f":"dataout!T293","v":0},0,284,"STONEHAM"]
[285,1,{"$f":"IF(dataout!C294=\"Y\",\"Y\",IF(dataout!C294=\"T\",\"T\",\"N\"))","v":"N"},{"$f":"IF(AND(dataout!C294=\"Y\",dataout!D294=\"not in\"),2,0)","v":0},285,"STOUGHTON                    ","1N0","You have chosen a district that does not enroll school choice pupils in FY16",285,"N"," ",{"$f":"dataout!L294","v":0},{"$f":"dataout!T294","v":0},0,285,"STOUGHTON"]
[286,0,{"$f":"IF(dataout!C295=\"Y\",\"Y\",IF(dataout!C295=\"T\",\"T\",\"N\"))","v":"N"},{"$f":"IF(AND(dataout!C295=\"Y\",dataout!D295=\"not in\"),2,0)","v":0},286,"STOW                         ","0N0","You have chosen a non-operating school district",286,"N"," ",{"$f":"dataout!L295","v":0},{"$f":"dataout!T295","v":0},0,286,"STOW"]
[287,1,{"$f":"IF(dataout!C296=\"Y\",\"Y\",IF(dataout!C296=\"T\",\"T\",\"N\"))","v":"N"},{"$f":"IF(AND(dataout!C296=\"Y\",dataout!D296=\"not in\"),2,0)","v":0},287,"STURBRIDGE                   ","1N0","You have chosen a district that does not enroll school choice pupils in FY16",287,"N"," ",{"$f":"dataout!L296","v":0},{"$f":"dataout!T296","v":0},0,287,"STURBRIDGE"]
[288,1,{"$f":"IF(dataout!C297=\"Y\",\"Y\",IF(dataout!C297=\"T\",\"T\",\"N\"))","v":"N"},{"$f":"IF(AND(dataout!C297=\"Y\",dataout!D297=\"not in\"),2,0)","v":0},288,"SUDBURY                      ","1N0","You have chosen a district that does not enroll school choice pupils in FY16",288,"N"," ",{"$f":"dataout!L297","v":0},{"$f":"dataout!T297","v":0},0,288,"SUDBURY"]
[289,1,{"$f":"IF(dataout!C298=\"Y\",\"Y\",IF(dataout!C298=\"T\",\"T\",\"N\"))","v":"Y"},{"$f":"IF(AND(dataout!C298=\"Y\",dataout!D298=\"not in\"),2,0)","v":0},289,"SUNDERLAND                   ","1Y0",null,289,"Y"," ",{"$f":"dataout!L298","v":5000},{"$f":"dataout!T298","v":" "},0,289,"SUNDERLAND                   "]
[290,1,{"$f":"IF(dataout!C299=\"Y\",\"Y\",IF(dataout!C299=\"T\",\"T\",\"N\"))","v":"Y"},{"$f":"IF(AND(dataout!C299=\"Y\",dataout!D299=\"not in\"),2,0)","v":0},290,"SUTTON                       ","1Y0",null,290,"Y"," ",{"$f":"dataout!L299","v":5000},{"$f":"dataout!T299","v":" "},0,290,"SUTTON                       "]
[291,1,{"$f":"IF(dataout!C300=\"Y\",\"Y\",IF(dataout!C300=\"T\",\"T\",\"N\"))","v":"T"},{"$f":"IF(AND(dataout!C300=\"Y\",dataout!D300=\"not in\"),2,0)","v":0},291,"SWAMPSCOTT                   ","1T0","Not a school choice district, but regular ed choice rate is used for tuitioning from other districts",291,"T"," ",{"$f":"dataout!L300","v":5000},{"$f":"dataout!T300","v":" "},0,291,"SWAMPSCOTT"]
[292,1,{"$f":"IF(dataout!C301=\"Y\",\"Y\",IF(dataout!C301=\"T\",\"T\",\"N\"))","v":"N"},{"$f":"IF(AND(dataout!C301=\"Y\",dataout!D301=\"not in\"),2,0)","v":0},292,"SWANSEA                      ","1N0","You have chosen a district that does not enroll school choice pupils in FY16",292,"N"," ",{"$f":"dataout!L301","v":0},{"$f":"dataout!T301","v":0},0,292,"SWANSEA"]
[293,1,{"$f":"IF(dataout!C302=\"Y\",\"Y\",IF(dataout!C302=\"T\",\"T\",\"N\"))","v":"Y"},{"$f":"IF(AND(dataout!C302=\"Y\",dataout!D302=\"not in\"),2,0)","v":0},293,"TAUNTON                      ","1Y0",null,293,"Y"," ",{"$f":"dataout!L302","v":5000},{"$f":"dataout!T302","v":3899},0,293,"TAUNTON                      "]
[294,0,{"$f":"IF(dataout!C303=\"Y\",\"Y\",IF(dataout!C303=\"T\",\"T\",\"N\"))","v":"N"},{"$f":"IF(AND(dataout!C303=\"Y\",dataout!D303=\"not in\"),2,0)","v":0},294,"TEMPLETON                    ","0N0","You have chosen a non-operating school district",294,"N"," ",{"$f":"dataout!L303","v":0},{"$f":"dataout!T303","v":0},0,294,"TEMPLETON"]
[295,1,{"$f":"IF(dataout!C304=\"Y\",\"Y\",IF(dataout!C304=\"T\",\"T\",\"N\"))","v":"N"},{"$f":"IF(AND(dataout!C304=\"Y\",dataout!D304=\"not in\"),2,0)","v":0},295,"TEWKSBURY                    ","1N0","You have chosen a district that does not enroll school choice pupils in FY16",295,"N"," ",{"$f":"dataout!L304","v":0},{"$f":"dataout!T304","v":0},0,295,"TEWKSBURY"]
[296,1,{"$f":"IF(dataout!C305=\"Y\",\"Y\",IF(dataout!C305=\"T\",\"T\",\"N\"))","v":"Y"},{"$f":"IF(AND(dataout!C305=\"Y\",dataout!D305=\"not in\"),2,0)","v":0},296,"TISBURY                      ","1Y0",null,296,"Y"," ",{"$f":"dataout!L305","v":5000},{"$f":"dataout!T305","v":" "},0,296,"TISBURY                      "]
[297,0,{"$f":"IF(dataout!C306=\"Y\",\"Y\",IF(dataout!C306=\"T\",\"T\",\"N\"))","v":"N"},{"$f":"IF(AND(dataout!C306=\"Y\",dataout!D306=\"not in\"),2,0)","v":0},297,"TOLLAND                      ","0N0","You have chosen a non-operating school district",297,"N"," ",{"$f":"dataout!L306","v":0},{"$f":"dataout!T306","v":0},0,297,"TOLLAND"]
[{"$f":"VALUE(E307)","v":298},1,{"$f":"IF(dataout!C307=\"Y\",\"Y\",IF(dataout!C307=\"T\",\"T\",\"N\"))","v":"N"},{"$f":"IF(AND(dataout!C307=\"Y\",dataout!D307=\"not in\"),2,0)","v":0},298,"TOPSFIELD                    ","1N0","You have chosen a district that does not enroll school choice pupils in FY16",298,"N"," ",{"$f":"dataout!L307","v":0},{"$f":"dataout!T307","v":0},0,298,"TOPSFIELD"]
[299,0,{"$f":"IF(dataout!C308=\"Y\",\"Y\",IF(dataout!C308=\"T\",\"T\",\"N\"))","v":"N"},{"$f":"IF(AND(dataout!C308=\"Y\",dataout!D308=\"not in\"),2,0)","v":0},299,"TOWNSEND                     ","0N0","You have chosen a non-operating school district",299,"N"," ",{"$f":"dataout!L308","v":0},{"$f":"dataout!T308","v":0},0,299,"TOWNSEND"]
[300,1,{"$f":"IF(dataout!C309=\"Y\",\"Y\",IF(dataout!C309=\"T\",\"T\",\"N\"))","v":"Y"},{"$f":"IF(AND(dataout!C309=\"Y\",dataout!D309=\"not in\"),2,0)","v":0},300,"TRURO                        ","1Y0",null,300,"Y"," ",{"$f":"dataout!L309","v":5000},{"$f":"dataout!T309","v":" "},0,300,"TRURO                        "]
[301,1,{"$f":"IF(dataout!C310=\"Y\",\"Y\",IF(dataout!C310=\"T\",\"T\",\"N\"))","v":"Y"},{"$f":"IF(AND(dataout!C310=\"Y\",dataout!D310=\"not in\"),2,0)","v":0},301,"TYNGSBOROUGH                 ","1Y0",null,301,"Y"," ",{"$f":"dataout!L310","v":5000},{"$f":"dataout!T310","v":" "},0,301,"TYNGSBOROUGH                 "]
[302,0,{"$f":"IF(dataout!C311=\"Y\",\"Y\",IF(dataout!C311=\"T\",\"T\",\"N\"))","v":"N"},{"$f":"IF(AND(dataout!C311=\"Y\",dataout!D311=\"not in\"),2,0)","v":0},302,"TYRINGHAM                    ","0N0","You have chosen a non-operating school district",302,"N"," ",{"$f":"dataout!L311","v":0},{"$f":"dataout!T311","v":0},0,302,"TYRINGHAM"]
[303,0,{"$f":"IF(dataout!C312=\"Y\",\"Y\",IF(dataout!C312=\"T\",\"T\",\"N\"))","v":"N"},{"$f":"IF(AND(dataout!C312=\"Y\",dataout!D312=\"not in\"),2,0)","v":0},303,"UPTON                        ","0N0","You have chosen a non-operating school district",303,"N"," ",{"$f":"dataout!L312","v":0},{"$f":"dataout!T312","v":0},0,303,"UPTON"]
[304,1,{"$f":"IF(dataout!C313=\"Y\",\"Y\",IF(dataout!C313=\"T\",\"T\",\"N\"))","v":"Y"},{"$f":"IF(AND(dataout!C313=\"Y\",dataout!D313=\"not in\"),2,0)","v":0},304,"UXBRIDGE                     ","1Y0",null,304,"Y"," ",{"$f":"dataout!L313","v":5000},{"$f":"dataout!T313","v":" "},0,304,"UXBRIDGE                     "]
[305,1,{"$f":"IF(dataout!C314=\"Y\",\"Y\",IF(dataout!C314=\"T\",\"T\",\"N\"))","v":"N"},{"$f":"IF(AND(dataout!C314=\"Y\",dataout!D314=\"not in\"),2,0)","v":0},305,"WAKEFIELD                    ","1N0","You have chosen a district that does not enroll school choice pupils in FY16",305,"N"," ",{"$f":"dataout!L314","v":0},{"$f":"dataout!T314","v":0},0,305,"WAKEFIELD"]
[306,1,{"$f":"IF(dataout!C315=\"Y\",\"Y\",IF(dataout!C315=\"T\",\"T\",\"N\"))","v":"Y"},{"$f":"IF(AND(dataout!C315=\"Y\",dataout!D315=\"not in\"),2,0)","v":0},306,"WALES                        ","1Y0",null,306,"Y"," ",{"$f":"dataout!L315","v":5000},{"$f":"dataout!T315","v":" "},0,306,"WALES                        "]
[307,1,{"$f":"IF(dataout!C316=\"Y\",\"Y\",IF(dataout!C316=\"T\",\"T\",\"N\"))","v":"N"},{"$f":"IF(AND(dataout!C316=\"Y\",dataout!D316=\"not in\"),2,0)","v":0},307,"WALPOLE                      ","1N0","You have chosen a district that does not enroll school choice pupils in FY16",307,"N"," ",{"$f":"dataout!L316","v":0},{"$f":"dataout!T316","v":0},0,307,"WALPOLE"]
[308,1,{"$f":"IF(dataout!C317=\"Y\",\"Y\",IF(dataout!C317=\"T\",\"T\",\"N\"))","v":"N"},{"$f":"IF(AND(dataout!C317=\"Y\",dataout!D317=\"not in\"),2,0)","v":0},308,"WALTHAM                      ","1N0","You have chosen a district that does not enroll school choice pupils in FY16",308,"N"," ",{"$f":"dataout!L317","v":0},{"$f":"dataout!T317","v":0},0,308,"WALTHAM"]
[309,1,{"$f":"IF(dataout!C318=\"Y\",\"Y\",IF(dataout!C318=\"T\",\"T\",\"N\"))","v":"Y"},{"$f":"IF(AND(dataout!C318=\"Y\",dataout!D318=\"not in\"),2,0)","v":0},309,"WARE                         ","1Y0",null,309,"Y"," ",{"$f":"dataout!L318","v":5000},{"$f":"dataout!T318","v":" "},0,309,"WARE                         "]
[310,1,{"$f":"IF(dataout!C319=\"Y\",\"Y\",IF(dataout!C319=\"T\",\"T\",\"N\"))","v":"Y"},{"$f":"IF(AND(dataout!C319=\"Y\",dataout!D319=\"not in\"),2,0)","v":0},310,"WAREHAM                      ","1Y0",null,310,"Y"," ",{"$f":"dataout!L319","v":5000},{"$f":"dataout!T319","v":1092},0,310,"WAREHAM                      "]
[{"$f":"VALUE(E320)","v":311},0,{"$f":"IF(dataout!C320=\"Y\",\"Y\",IF(dataout!C320=\"T\",\"T\",\"N\"))","v":"N"},{"$f":"IF(AND(dataout!C320=\"Y\",dataout!D320=\"not in\"),2,0)","v":0},311,"WARREN                       ","0N0","You have chosen a non-operating school district",311,"N"," ",{"$f":"dataout!L320","v":0},{"$f":"dataout!T320","v":0},0,311,"WARREN"]
[{"$f":"VALUE(E321)","v":312},0,{"$f":"IF(dataout!C321=\"Y\",\"Y\",IF(dataout!C321=\"T\",\"T\",\"N\"))","v":"N"},{"$f":"IF(AND(dataout!C321=\"Y\",dataout!D321=\"not in\"),2,0)","v":0},312,"WARWICK                      ","0N0","You have chosen a non-operating school district",312,"N"," ",{"$f":"dataout!L321","v":0},{"$f":"dataout!T321","v":0},0,312,"WARWICK"]
[313,0,{"$f":"IF(dataout!C322=\"Y\",\"Y\",IF(dataout!C322=\"T\",\"T\",\"N\"))","v":"N"},{"$f":"IF(AND(dataout!C322=\"Y\",dataout!D322=\"not in\"),2,0)","v":0},313,"WASHINGTON                   ","0N0","You have chosen a non-operating school district",313,"N"," ",{"$f":"dataout!L322","v":0},{"$f":"dataout!T322","v":0},0,313,"WASHINGTON"]
[314,1,{"$f":"IF(dataout!C323=\"Y\",\"Y\",IF(dataout!C323=\"T\",\"T\",\"N\"))","v":"N"},{"$f":"IF(AND(dataout!C323=\"Y\",dataout!D323=\"not in\"),2,0)","v":0},314,"WATERTOWN                    ","1N0","You have chosen a district that does not enroll school choice pupils in FY16",314,"N"," ",{"$f":"dataout!L323","v":0},{"$f":"dataout!T323","v":0},0,314,"WATERTOWN"]
[315,1,{"$f":"IF(dataout!C324=\"Y\",\"Y\",IF(dataout!C324=\"T\",\"T\",\"N\"))","v":"N"},{"$f":"IF(AND(dataout!C324=\"Y\",dataout!D324=\"not in\"),2,0)","v":0},315,"WAYLAND                      ","1N0","You have chosen a district that does not enroll school choice pupils in FY16",315,"N"," ",{"$f":"dataout!L324","v":0},{"$f":"dataout!T324","v":0},0,315,"WAYLAND"]
[316,1,{"$f":"IF(dataout!C325=\"Y\",\"Y\",IF(dataout!C325=\"T\",\"T\",\"N\"))","v":"Y"},{"$f":"IF(AND(dataout!C325=\"Y\",dataout!D325=\"not in\"),2,0)","v":0},316,"WEBSTER                      ","1Y0",null,316,"Y"," ",{"$f":"dataout!L325","v":5000},{"$f":"dataout!T325","v":4359},0,316,"WEBSTER                      "]
[317,1,{"$f":"IF(dataout!C326=\"Y\",\"Y\",IF(dataout!C326=\"T\",\"T\",\"N\"))","v":"N"},{"$f":"IF(AND(dataout!C326=\"Y\",dataout!D326=\"not in\"),2,0)","v":0},317,"WELLESLEY                    ","1N0","You have chosen a district that does not enroll school choice pupils in FY16",317,"N"," ",{"$f":"dataout!L326","v":0},{"$f":"dataout!T326","v":0},0,317,"WELLESLEY"]
[318,1,{"$f":"IF(dataout!C327=\"Y\",\"Y\",IF(dataout!C327=\"T\",\"T\",\"N\"))","v":"N"},{"$f":"IF(AND(dataout!C327=\"Y\",dataout!D327=\"not in\"),2,0)","v":0},318,"WELLFLEET                    ","1N0","You have chosen a district that does not enroll school choice pupils in FY16",318,"N"," ",{"$f":"dataout!L327","v":0},{"$f":"dataout!T327","v":0},0,318,"WELLFLEET"]
[319,0,{"$f":"IF(dataout!C328=\"Y\",\"Y\",IF(dataout!C328=\"T\",\"T\",\"N\"))","v":"N"},{"$f":"IF(AND(dataout!C328=\"Y\",dataout!D328=\"not in\"),2,0)","v":0},319,"WENDELL                      ","0N0","You have chosen a non-operating school district",319,"N"," ",{"$f":"dataout!L328","v":0},{"$f":"dataout!T328","v":0},0,319,"WENDELL"]
[320,0,{"$f":"IF(dataout!C329=\"Y\",\"Y\",IF(dataout!C329=\"T\",\"T\",\"N\"))","v":"N"},{"$f":"IF(AND(dataout!C329=\"Y\",dataout!D329=\"not in\"),2,0)","v":0},320,"WENHAM                       ","0N0","You have chosen a non-operating school district",320,"N"," ",{"$f":"dataout!L329","v":0},{"$f":"dataout!T329","v":0},0,320,"WENHAM"]
[321,1,{"$f":"IF(dataout!C330=\"Y\",\"Y\",IF(dataout!C330=\"T\",\"T\",\"N\"))","v":"N"},{"$f":"IF(AND(dataout!C330=\"Y\",dataout!D330=\"not in\"),2,0)","v":0},321,"WESTBOROUGH                  ","1N0","You have chosen a district that does not enroll school choice pupils in FY16",321,"N"," ",{"$f":"dataout!L330","v":0},{"$f":"dataout!T330","v":0},0,321,"WESTBOROUGH                  "]
[322,1,{"$f":"IF(dataout!C331=\"Y\",\"Y\",IF(dataout!C331=\"T\",\"T\",\"N\"))","v":"Y"},{"$f":"IF(AND(dataout!C331=\"Y\",dataout!D331=\"not in\"),2,0)","v":0},322,"WEST BOYLSTON                ",{"$f":"B331&C331&D331","v":"1Y0"},null,{"$f":"A331","v":322},{"$f":"C331","v":"Y"},{"$f":"IF(G331=\"1Y2\",\"bad\",\" \")","v":" "},{"$f":"dataout!L331","v":5000},{"$f":"dataout!T331","v":" "},{"$f":"O331-A331","v":0},322,"WEST BOYLSTON                "]
[323,1,{"$f":"IF(dataout!C332=\"Y\",\"Y\",IF(dataout!C332=\"T\",\"T\",\"N\"))","v":"Y"},{"$f":"IF(AND(dataout!C332=\"Y\",dataout!D332=\"not in\"),2,0)","v":0},323,"WEST BRIDGEWATER             ","1Y0",null,323,"Y"," ",{"$f":"dataout!L332","v":5000},{"$f":"dataout!T332","v":" "},0,323,"WEST BRIDGEWATER             "]
[324,0,{"$f":"IF(dataout!C333=\"Y\",\"Y\",IF(dataout!C333=\"T\",\"T\",\"N\"))","v":"N"},{"$f":"IF(AND(dataout!C333=\"Y\",dataout!D333=\"not in\"),2,0)","v":0},324,"WEST BROOKFIELD              ","0N0","You have chosen a non-operating school district",324,"N"," ",{"$f":"dataout!L333","v":0},{"$f":"dataout!T333","v":0},0,324,"WEST BROOKFIELD"]
[325,1,{"$f":"IF(dataout!C334=\"Y\",\"Y\",IF(dataout!C334=\"T\",\"T\",\"N\"))","v":"Y"},{"$f":"IF(AND(dataout!C334=\"Y\",dataout!D334=\"not in\"),2,0)","v":0},325,"WESTFIELD                    ","1Y0",null,325,"Y"," ",{"$f":"dataout!L334","v":5000},{"$f":"dataout!T334","v":5000},0,325,"WESTFIELD                    "]
[326,1,{"$f":"IF(dataout!C335=\"Y\",\"Y\",IF(dataout!C335=\"T\",\"T\",\"N\"))","v":"Y"},{"$f":"IF(AND(dataout!C335=\"Y\",dataout!D335=\"not in\"),2,0)","v":0},326,"WESTFORD                     ","1Y0",null,326,"Y"," ",{"$f":"dataout!L335","v":5000},{"$f":"dataout!T335","v":" "},0,326,"WESTFORD                     "]
[327,1,{"$f":"IF(dataout!C336=\"Y\",\"Y\",IF(dataout!C336=\"T\",\"T\",\"N\"))","v":"Y"},{"$f":"IF(AND(dataout!C336=\"Y\",dataout!D336=\"not in\"),2,0)","v":0},327,"WESTHAMPTON                  ","1Y0",null,327,"Y"," ",{"$f":"dataout!L336","v":5000},{"$f":"dataout!T336","v":" "},0,327,"WESTHAMPTON                  "]
[328,0,{"$f":"IF(dataout!C337=\"Y\",\"Y\",IF(dataout!C337=\"T\",\"T\",\"N\"))","v":"N"},{"$f":"IF(AND(dataout!C337=\"Y\",dataout!D337=\"not in\"),2,0)","v":0},328,"WESTMINSTER                  ","0N0","You have chosen a non-operating school district",328,"N"," ",{"$f":"dataout!L337","v":0},{"$f":"dataout!T337","v":0},0,328,"WESTMINSTER"]
[329,0,{"$f":"IF(dataout!C338=\"Y\",\"Y\",IF(dataout!C338=\"T\",\"T\",\"N\"))","v":"N"},{"$f":"IF(AND(dataout!C338=\"Y\",dataout!D338=\"not in\"),2,0)","v":0},329,"WEST NEWBURY                 ","0N0","You have chosen a non-operating school district",329,"N"," ",{"$f":"dataout!L338","v":0},{"$f":"dataout!T338","v":0},0,329,"WEST NEWBURY"]
[330,1,{"$f":"IF(dataout!C339=\"Y\",\"Y\",IF(dataout!C339=\"T\",\"T\",\"N\"))","v":"N"},{"$f":"IF(AND(dataout!C339=\"Y\",dataout!D339=\"not in\"),2,0)","v":0},330,"WESTON                       ","1N0","You have chosen a district that does not enroll school choice pupils in FY16",330,"N"," ",{"$f":"dataout!L339","v":0},{"$f":"dataout!T339","v":0},0,330,"WESTON"]
[331,1,{"$f":"IF(dataout!C340=\"Y\",\"Y\",IF(dataout!C340=\"T\",\"T\",\"N\"))","v":"N"},{"$f":"IF(AND(dataout!C340=\"Y\",dataout!D340=\"not in\"),2,0)","v":0},331,"WESTPORT                     ","1N0","You have chosen a district that does not enroll school choice pupils in FY16",331,"N"," ",{"$f":"dataout!L340","v":0},{"$f":"dataout!T340","v":0},0,331,"WESTPORT                     "]
[332,1,{"$f":"IF(dataout!C341=\"Y\",\"Y\",IF(dataout!C341=\"T\",\"T\",\"N\"))","v":"Y"},{"$f":"IF(AND(dataout!C341=\"Y\",dataout!D341=\"not in\"),2,0)","v":0},332,"WEST SPRINGFIELD             ","1Y0",null,332,"Y"," ",{"$f":"dataout!L341","v":5000},{"$f":"dataout!T341","v":1565},0,332,"WEST SPRINGFIELD             "]
[333,0,{"$f":"IF(dataout!C342=\"Y\",\"Y\",IF(dataout!C342=\"T\",\"T\",\"N\"))","v":"N"},{"$f":"IF(AND(dataout!C342=\"Y\",dataout!D342=\"not in\"),2,0)","v":0},333,"WEST STOCKBRIDGE             ","0N0","You have chosen a non-operating school district",333,"N"," ",{"$f":"dataout!L342","v":0},{"$f":"dataout!T342","v":0},0,333,"WEST STOCKBRIDGE"]
[334,0,{"$f":"IF(dataout!C343=\"Y\",\"Y\",IF(dataout!C343=\"T\",\"T\",\"N\"))","v":"N"},{"$f":"IF(AND(dataout!C343=\"Y\",dataout!D343=\"not in\"),2,0)","v":0},334,"WEST TISBURY                 ","0N0","You have chosen a non-operating school district",334,"N"," ",{"$f":"dataout!L343","v":0},{"$f":"dataout!T343","v":0},0,334,"WEST TISBURY"]
[335,1,{"$f":"IF(dataout!C344=\"Y\",\"Y\",IF(dataout!C344=\"T\",\"T\",\"N\"))","v":"N"},{"$f":"IF(AND(dataout!C344=\"Y\",dataout!D344=\"not in\"),2,0)","v":0},335,"WESTWOOD                     ","1N0","You have chosen a district that does not enroll school choice pupils in FY16",335,"N"," ",{"$f":"dataout!L344","v":0},{"$f":"dataout!T344","v":0},0,335,"WESTWOOD"]
[{"$f":"VALUE(E345)","v":336},1,{"$f":"IF(dataout!C345=\"Y\",\"Y\",IF(dataout!C345=\"T\",\"T\",\"N\"))","v":"N"},{"$f":"IF(AND(dataout!C345=\"Y\",dataout!D345=\"not in\"),2,0)","v":0},336,"WEYMOUTH                     ","1N0","You have chosen a district that does not enroll school choice pupils in FY16",336,"N"," ",{"$f":"dataout!L345","v":0},{"$f":"dataout!T345","v":0},0,336,"WEYMOUTH"]
[337,1,{"$f":"IF(dataout!C346=\"Y\",\"Y\",IF(dataout!C346=\"T\",\"T\",\"N\"))","v":"Y"},{"$f":"IF(AND(dataout!C346=\"Y\",dataout!D346=\"not in\"),2,0)","v":0},337,"WHATELY                      ","1Y0",null,337,"Y"," ",{"$f":"dataout!L346","v":5000},{"$f":"dataout!T346","v":" "},0,337,"WHATELY                      "]
[338,0,{"$f":"IF(dataout!C347=\"Y\",\"Y\",IF(dataout!C347=\"T\",\"T\",\"N\"))","v":"N"},{"$f":"IF(AND(dataout!C347=\"Y\",dataout!D347=\"not in\"),2,0)","v":0},338,"WHITMAN                      ","0N0","You have chosen a non-operating school district",338,"N"," ",{"$f":"dataout!L347","v":0},{"$f":"dataout!T347","v":0},0,338,"WHITMAN"]
[339,0,{"$f":"IF(dataout!C348=\"Y\",\"Y\",IF(dataout!C348=\"T\",\"T\",\"N\"))","v":"N"},{"$f":"IF(AND(dataout!C348=\"Y\",dataout!D348=\"not in\"),2,0)","v":0},339,"WILBRAHAM                    ","0N0","You have chosen a non-operating school district",339,"N"," ",{"$f":"dataout!L348","v":0},{"$f":"dataout!T348","v":0},0,339,"WILBRAHAM"]
[340,1,{"$f":"IF(dataout!C349=\"Y\",\"Y\",IF(dataout!C349=\"T\",\"T\",\"N\"))","v":"Y"},{"$f":"IF(AND(dataout!C349=\"Y\",dataout!D349=\"not in\"),2,0)","v":0},340,"WILLIAMSBURG                 ","1Y0",null,340,"Y"," ",{"$f":"dataout!L349","v":5000},{"$f":"dataout!T349","v":" "},0,340,"WILLIAMSBURG                 "]
[341,1,{"$f":"IF(dataout!C350=\"Y\",\"Y\",IF(dataout!C350=\"T\",\"T\",\"N\"))","v":"Y"},{"$f":"IF(AND(dataout!C350=\"Y\",dataout!D350=\"not in\"),2,0)","v":0},341,"WILLIAMSTOWN                 ","1Y0",null,341,"Y"," ",{"$f":"dataout!L350","v":5000},{"$f":"dataout!T350","v":" "},0,341,"WILLIAMSTOWN                 "]
[342,1,{"$f":"IF(dataout!C351=\"Y\",\"Y\",IF(dataout!C351=\"T\",\"T\",\"N\"))","v":"N"},{"$f":"IF(AND(dataout!C351=\"Y\",dataout!D351=\"not in\"),2,0)","v":0},342,"WILMINGTON                   ","1N0","You have chosen a district that does not enroll school choice pupils in FY16",342,"N"," ",{"$f":"dataout!L351","v":0},{"$f":"dataout!T351","v":0},0,342,"WILMINGTON"]
[343,1,{"$f":"IF(dataout!C352=\"Y\",\"Y\",IF(dataout!C352=\"T\",\"T\",\"N\"))","v":"Y"},{"$f":"IF(AND(dataout!C352=\"Y\",dataout!D352=\"not in\"),2,0)","v":0},343,"WINCHENDON                   ","1Y0",null,343,"Y"," ",{"$f":"dataout!L352","v":5000},{"$f":"dataout!T352","v":" "},0,343,"WINCHENDON                   "]
[344,1,{"$f":"IF(dataout!C353=\"Y\",\"Y\",IF(dataout!C353=\"T\",\"T\",\"N\"))","v":"N"},{"$f":"IF(AND(dataout!C353=\"Y\",dataout!D353=\"not in\"),2,0)","v":0},344,"WINCHESTER                   ","1N0","You have chosen a district that does not enroll school choice pupils in FY16",344,"N"," ",{"$f":"dataout!L353","v":0},{"$f":"dataout!T353","v":0},0,344,"WINCHESTER"]
[345,0,{"$f":"IF(dataout!C354=\"Y\",\"Y\",IF(dataout!C354=\"T\",\"T\",\"N\"))","v":"N"},{"$f":"IF(AND(dataout!C354=\"Y\",dataout!D354=\"not in\"),2,0)","v":0},345,"WINDSOR                      ","0N0","You have chosen a non-operating school district",345,"N"," ",{"$f":"dataout!L354","v":0},{"$f":"dataout!T354","v":0},0,345,"WINDSOR"]
[346,1,{"$f":"IF(dataout!C355=\"Y\",\"Y\",IF(dataout!C355=\"T\",\"T\",\"N\"))","v":"Y"},{"$f":"IF(AND(dataout!C355=\"Y\",dataout!D355=\"not in\"),2,0)","v":0},346,"WINTHROP                     ","1Y0",null,346,"Y"," ",{"$f":"dataout!L355","v":5000},{"$f":"dataout!T355","v":" "},0,346,"WINTHROP                     "]
[347,1,{"$f":"IF(dataout!C356=\"Y\",\"Y\",IF(dataout!C356=\"T\",\"T\",\"N\"))","v":"N"},{"$f":"IF(AND(dataout!C356=\"Y\",dataout!D356=\"not in\"),2,0)","v":0},347,"WOBURN","1N0","You have chosen a district that does not enroll school choice pupils in FY16",347,"N"," ",{"$f":"dataout!L356","v":0},{"$f":"dataout!T356","v":0},0,347,"WOBURN"]
[348,1,{"$f":"IF(dataout!C357=\"Y\",\"Y\",IF(dataout!C357=\"T\",\"T\",\"N\"))","v":"Y"},{"$f":"IF(AND(dataout!C357=\"Y\",dataout!D357=\"not in\"),2,0)","v":0},348,"WORCESTER                    ","1Y0",null,348,"Y"," ",{"$f":"dataout!L357","v":5000},{"$f":"dataout!T357","v":5000},0,348,"WORCESTER                    "]
[349,1,{"$f":"IF(dataout!C358=\"Y\",\"Y\",IF(dataout!C358=\"T\",\"T\",\"N\"))","v":"Y"},{"$f":"IF(AND(dataout!C358=\"Y\",dataout!D358=\"not in\"),2,0)","v":0},349,"WORTHINGTON                  ","1Y0",null,349,"Y"," ",{"$f":"dataout!L358","v":0},{"$f":"dataout!T358","v":" "},0,349,"WORTHINGTON"]
[350,1,{"$f":"IF(dataout!C359=\"Y\",\"Y\",IF(dataout!C359=\"T\",\"T\",\"N\"))","v":"N"},{"$f":"IF(AND(dataout!C359=\"Y\",dataout!D359=\"not in\"),2,0)","v":0},350,"WRENTHAM                     ","1N0","You have chosen a district that does not enroll school choice pupils in FY16",350,"N"," ",{"$f":"dataout!L359","v":0},{"$f":"dataout!T359","v":0},0,350,"WRENTHAM"]
[351,0,{"$f":"IF(dataout!C360=\"Y\",\"Y\",IF(dataout!C360=\"T\",\"T\",\"N\"))","v":"N"},{"$f":"IF(AND(dataout!C360=\"Y\",dataout!D360=\"not in\"),2,0)","v":0},351,"YARMOUTH                     ","0N0","You have chosen a non-operating school district",351,"N"," ",{"$f":"dataout!L360","v":0},{"$f":"dataout!T360","v":0},0,351,"YARMOUTH"]
[406,1,{"$f":"IF(dataout!C361=\"Y\",\"Y\",IF(dataout!C361=\"T\",\"T\",\"N\"))","v":"N"},{"$f":"IF(AND(dataout!C361=\"Y\",dataout!D361=\"not in\"),2,0)","v":0},406,"NORTHAMPTON SMITH            ","1N0","You have chosen a district that does not enroll school choice pupils in FY16",406,"N"," ",{"$f":"dataout!L361","v":0},{"$f":"dataout!T361","v":0},0,406,"NORTHAMPTON SMITH"]
[600,1,{"$f":"IF(dataout!C362=\"Y\",\"Y\",IF(dataout!C362=\"T\",\"T\",\"N\"))","v":"Y"},{"$f":"IF(AND(dataout!C362=\"Y\",dataout!D362=\"not in\"),2,0)","v":0},600,"ACTON BOXBOROUGH             ","1Y0",null,600,"Y"," ",{"$f":"dataout!L362","v":5000},{"$f":"dataout!T362","v":" "},0,600,"ACTON BOXBOROUGH             "]
[603,1,{"$f":"IF(dataout!C363=\"Y\",\"Y\",IF(dataout!C363=\"T\",\"T\",\"N\"))","v":"Y"},{"$f":"IF(AND(dataout!C363=\"Y\",dataout!D363=\"not in\"),2,0)","v":0},603,"ADAMS CHESHIRE               ","1Y0",null,603,"Y"," ",{"$f":"dataout!L363","v":5000},{"$f":"dataout!T363","v":" "},0,603,"ADAMS CHESHIRE               "]
[605,1,{"$f":"IF(dataout!C364=\"Y\",\"Y\",IF(dataout!C364=\"T\",\"T\",\"N\"))","v":"Y"},{"$f":"IF(AND(dataout!C364=\"Y\",dataout!D364=\"not in\"),2,0)","v":0},605,"AMHERST PELHAM               ","1Y0",null,605,"Y"," ",{"$f":"dataout!L364","v":5000},{"$f":"dataout!T364","v":" "},0,605,"AMHERST PELHAM               "]
[610,1,{"$f":"IF(dataout!C365=\"Y\",\"Y\",IF(dataout!C365=\"T\",\"T\",\"N\"))","v":"Y"},{"$f":"IF(AND(dataout!C365=\"Y\",dataout!D365=\"not in\"),2,0)","v":0},610,"ASHBURNHAM WESTMINSTER       ","1Y0",null,610,"Y"," ",{"$f":"dataout!L365","v":5000},{"$f":"dataout!T365","v":" "},0,610,"ASHBURNHAM WESTMINSTER       "]
[615,1,{"$f":"IF(dataout!C366=\"Y\",\"Y\",IF(dataout!C366=\"T\",\"T\",\"N\"))","v":"Y"},{"$f":"IF(AND(dataout!C366=\"Y\",dataout!D366=\"not in\"),2,0)","v":0},615,"ATHOL ROYALSTON              ","1Y0",null,615,"Y"," ",{"$f":"dataout!L366","v":5000},{"$f":"dataout!T366","v":" "},0,615,"ATHOL ROYALSTON              "]
[616,1,{"$f":"IF(dataout!C367=\"Y\",\"Y\",IF(dataout!C367=\"T\",\"T\",\"N\"))","v":"Y"},{"$f":"IF(AND(dataout!C367=\"Y\",dataout!D367=\"not in\"),2,0)","v":0},"616","AYER SHIRLEY","1Y0",null,616,"Y"," ",{"$f":"dataout!L367","v":5000},{"$f":"dataout!T367","v":" "},0,616,"AYER SHIRLEY"]
[{"$f":"VALUE(E368)","v":618},1,{"$f":"IF(dataout!C368=\"Y\",\"Y\",IF(dataout!C368=\"T\",\"T\",\"N\"))","v":"Y"},{"$f":"IF(AND(dataout!C368=\"Y\",dataout!D368=\"not in\"),2,0)","v":0},618,"BERKSHIRE HILLS              ",{"$f":"B368&C368&D368","v":"1Y0"},null,618,"Y"," ",{"$f":"dataout!L368","v":5000},{"$f":"dataout!T368","v":5000},0,618,"BERKSHIRE HILLS              "]
[620,1,{"$f":"IF(dataout!C369=\"Y\",\"Y\",IF(dataout!C369=\"T\",\"T\",\"N\"))","v":"Y"},{"$f":"IF(AND(dataout!C369=\"Y\",dataout!D369=\"not in\"),2,0)","v":0},620,"BERLIN BOYLSTON              ","1Y0",null,620,"Y"," ",{"$f":"dataout!L369","v":5000},{"$f":"dataout!T369","v":" "},0,620,"BERLIN BOYLSTON              "]
[622,1,{"$f":"IF(dataout!C370=\"Y\",\"Y\",IF(dataout!C370=\"T\",\"T\",\"N\"))","v":"Y"},{"$f":"IF(AND(dataout!C370=\"Y\",dataout!D370=\"not in\"),2,0)","v":0},622,"BLACKSTONE MILLVILLE         ","1Y0",null,622,"Y"," ",{"$f":"dataout!L370","v":5000},{"$f":"dataout!T370","v":" "},0,622,"BLACKSTONE MILLVILLE         "]
[625,1,{"$f":"IF(dataout!C371=\"Y\",\"Y\",IF(dataout!C371=\"T\",\"T\",\"N\"))","v":"Y"},{"$f":"IF(AND(dataout!C371=\"Y\",dataout!D371=\"not in\"),2,0)","v":0},625,"BRIDGEWATER RAYNHAM          ","1Y0",null,625,"Y"," ",{"$f":"dataout!L371","v":5000},{"$f":"dataout!T371","v":" "},0,625,"BRIDGEWATER RAYNHAM          "]
[632,1,{"$f":"IF(dataout!C372=\"Y\",\"Y\",IF(dataout!C372=\"T\",\"T\",\"N\"))","v":"Y"},{"$f":"IF(AND(dataout!C372=\"Y\",dataout!D372=\"not in\"),2,0)","v":0},632,"CHESTERFIELD GOSHEN","1Y0",null,632,"Y"," ",{"$f":"dataout!L372","v":5000},{"$f":"dataout!T372","v":" "},0,632,"CHESTERFIELD GOSHEN"]
[635,1,{"$f":"IF(dataout!C373=\"Y\",\"Y\",IF(dataout!C373=\"T\",\"T\",\"N\"))","v":"Y"},{"$f":"IF(AND(dataout!C373=\"Y\",dataout!D373=\"not in\"),2,0)","v":0},635,"CENTRAL BERKSHIRE            ","1Y0",null,635,"Y"," ",{"$f":"dataout!L373","v":5000},{"$f":"dataout!T373","v":" "},0,635,"CENTRAL BERKSHIRE            "]
[640,1,{"$f":"IF(dataout!C374=\"Y\",\"Y\",IF(dataout!C374=\"T\",\"T\",\"N\"))","v":"N"},{"$f":"IF(AND(dataout!C374=\"Y\",dataout!D374=\"not in\"),2,0)","v":0},640,"CONCORD CARLISLE             ","1N0","You have chosen a district that does not enroll school choice pupils in FY16",640,"N"," ",{"$f":"dataout!L374","v":0},{"$f":"dataout!T374","v":0},0,640,"CONCORD CARLISLE"]
[645,1,{"$f":"IF(dataout!C375=\"Y\",\"Y\",IF(dataout!C375=\"T\",\"T\",\"N\"))","v":"Y"},{"$f":"IF(AND(dataout!C375=\"Y\",dataout!D375=\"not in\"),2,0)","v":0},645,"DENNIS YARMOUTH              ","1Y0",null,645,"Y"," ",{"$f":"dataout!L375","v":5000},{"$f":"dataout!T375","v":" "},0,645,"DENNIS YARMOUTH              "]
[650,1,{"$f":"IF(dataout!C376=\"Y\",\"Y\",IF(dataout!C376=\"T\",\"T\",\"N\"))","v":"Y"},{"$f":"IF(AND(dataout!C376=\"Y\",dataout!D376=\"not in\"),2,0)","v":0},650,"DIGHTON REHOBOTH             ","1Y0",null,650,"Y"," ",{"$f":"dataout!L376","v":5000},{"$f":"dataout!T376","v":4913},0,650,"DIGHTON REHOBOTH"]
[655,1,{"$f":"IF(dataout!C377=\"Y\",\"Y\",IF(dataout!C377=\"T\",\"T\",\"N\"))","v":"N"},{"$f":"IF(AND(dataout!C377=\"Y\",dataout!D377=\"not in\"),2,0)","v":0},655,"DOVER SHERBORN               ","1N0","You have chosen a district that does not enroll school choice pupils in FY16",655,"N"," ",{"$f":"dataout!L377","v":0},{"$f":"dataout!T377","v":0},0,655,"DOVER SHERBORN"]
[658,1,{"$f":"IF(dataout!C378=\"Y\",\"Y\",IF(dataout!C378=\"T\",\"T\",\"N\"))","v":"Y"},{"$f":"IF(AND(dataout!C378=\"Y\",dataout!D378=\"not in\"),2,0)","v":0},658,"DUDLEY CHARLTON              ","1Y0",null,658,"Y"," ",{"$f":"dataout!L378","v":5000},{"$f":"dataout!T378","v":" "},0,658,"DUDLEY CHARLTON              "]
[660,1,{"$f":"IF(dataout!C379=\"Y\",\"Y\",IF(dataout!C379=\"T\",\"T\",\"N\"))","v":"Y"},{"$f":"IF(AND(dataout!C379=\"Y\",dataout!D379=\"not in\"),2,0)","v":0},660,"NAUSET                       ","1Y0",null,660,"Y"," ",{"$f":"dataout!L379","v":5000},{"$f":"dataout!T379","v":" "},0,660,"NAUSET                       "]
[662,1,{"$f":"IF(dataout!C380=\"Y\",\"Y\",IF(dataout!C380=\"T\",\"T\",\"N\"))","v":"Y"},{"$f":"IF(AND(dataout!C380=\"Y\",dataout!D380=\"not in\"),2,0)","v":0},662,"FARMINGTON RIVER","1Y0",null,662,"Y"," ",{"$f":"dataout!L380","v":5000},{"$f":"dataout!T380","v":" "},0,662,"FARMINGTON RIVER"]
[665,1,{"$f":"IF(dataout!C381=\"Y\",\"Y\",IF(dataout!C381=\"T\",\"T\",\"N\"))","v":"Y"},{"$f":"IF(AND(dataout!C381=\"Y\",dataout!D381=\"not in\"),2,0)","v":0},665,"FREETOWN LAKEVILLE           ","1Y0",null,665,"Y"," ",{"$f":"dataout!L381","v":5000},{"$f":"dataout!T381","v":" "},0,665,"FREETOWN LAKEVILLE"]
[670,1,{"$f":"IF(dataout!C382=\"Y\",\"Y\",IF(dataout!C382=\"T\",\"T\",\"N\"))","v":"Y"},{"$f":"IF(AND(dataout!C382=\"Y\",dataout!D382=\"not in\"),2,0)","v":0},670,"FRONTIER                     ","1Y0",null,670,"Y"," ",{"$f":"dataout!L382","v":5000},{"$f":"dataout!T382","v":" "},0,670,"FRONTIER                     "]
[672,1,{"$f":"IF(dataout!C383=\"Y\",\"Y\",IF(dataout!C383=\"T\",\"T\",\"N\"))","v":"Y"},{"$f":"IF(AND(dataout!C383=\"Y\",dataout!D383=\"not in\"),2,0)","v":0},672,"GATEWAY                      ","1Y0",null,672,"Y"," ",{"$f":"dataout!L383","v":5000},{"$f":"dataout!T383","v":2344},0,672,"GATEWAY                      "]
[673,1,{"$f":"IF(dataout!C384=\"Y\",\"Y\",IF(dataout!C384=\"T\",\"T\",\"N\"))","v":"Y"},{"$f":"IF(AND(dataout!C384=\"Y\",dataout!D384=\"not in\"),2,0)","v":0},673,"GROTON DUNSTABLE             ","1Y0",null,673,"Y"," ",{"$f":"dataout!L384","v":5000},{"$f":"dataout!T384","v":" "},0,673,"GROTON DUNSTABLE             "]
[674,1,{"$f":"IF(dataout!C385=\"Y\",\"Y\",IF(dataout!C385=\"T\",\"T\",\"N\"))","v":"Y"},{"$f":"IF(AND(dataout!C385=\"Y\",dataout!D385=\"not in\"),2,0)","v":0},674,"GILL MONTAGUE                ","1Y0",null,674,"Y"," ",{"$f":"dataout!L385","v":5000},{"$f":"dataout!T385","v":" "},0,674,"GILL MONTAGUE                "]
[675,1,{"$f":"IF(dataout!C386=\"Y\",\"Y\",IF(dataout!C386=\"T\",\"T\",\"N\"))","v":"Y"},{"$f":"IF(AND(dataout!C386=\"Y\",dataout!D386=\"not in\"),2,0)","v":0},675,"HAMILTON WENHAM              ","1Y0",null,675,"Y"," ",{"$f":"dataout!L386","v":5000},{"$f":"dataout!T386","v":" "},0,675,"HAMILTON WENHAM              "]
[680,1,{"$f":"IF(dataout!C387=\"Y\",\"Y\",IF(dataout!C387=\"T\",\"T\",\"N\"))","v":"Y"},{"$f":"IF(AND(dataout!C387=\"Y\",dataout!D387=\"not in\"),2,0)","v":0},680,"HAMPDEN WILBRAHAM            ","1Y0",null,680,"Y"," ",{"$f":"dataout!L387","v":5000},{"$f":"dataout!T387","v":825},0,680,"HAMPDEN WILBRAHAM            "]
[683,1,{"$f":"IF(dataout!C388=\"Y\",\"Y\",IF(dataout!C388=\"T\",\"T\",\"N\"))","v":"Y"},{"$f":"IF(AND(dataout!C388=\"Y\",dataout!D388=\"not in\"),2,0)","v":0},683,"HAMPSHIRE                    ","1Y0",null,683,"Y"," ",{"$f":"dataout!L388","v":5000},{"$f":"dataout!T388","v":" "},0,683,"HAMPSHIRE                    "]
[685,1,{"$f":"IF(dataout!C389=\"Y\",\"Y\",IF(dataout!C389=\"T\",\"T\",\"N\"))","v":"Y"},{"$f":"IF(AND(dataout!C389=\"Y\",dataout!D389=\"not in\"),2,0)","v":0},685,"HAWLEMONT                    ","1Y0",null,685,"Y"," ",{"$f":"dataout!L389","v":5000},{"$f":"dataout!T389","v":" "},0,685,"HAWLEMONT                    "]
[690,1,{"$f":"IF(dataout!C390=\"Y\",\"Y\",IF(dataout!C390=\"T\",\"T\",\"N\"))","v":"N"},{"$f":"IF(AND(dataout!C390=\"Y\",dataout!D390=\"not in\"),2,0)","v":0},690,"KING PHILIP                  ","1N0","You have chosen a district that does not enroll school choice pupils in FY16",690,"N"," ",{"$f":"dataout!L390","v":0},{"$f":"dataout!T390","v":0},0,690,"KING PHILIP"]
[695,1,{"$f":"IF(dataout!C391=\"Y\",\"Y\",IF(dataout!C391=\"T\",\"T\",\"N\"))","v":"N"},{"$f":"IF(AND(dataout!C391=\"Y\",dataout!D391=\"not in\"),2,0)","v":0},695,"LINCOLN SUDBURY              ","1N0","You have chosen a district that does not enroll school choice pupils in FY16",695,"N"," ",{"$f":"dataout!L391","v":0},{"$f":"dataout!T391","v":0},0,695,"LINCOLN SUDBURY"]
[698,1,{"$f":"IF(dataout!C392=\"Y\",\"Y\",IF(dataout!C392=\"T\",\"T\",\"N\"))","v":"Y"},{"$f":"IF(AND(dataout!C392=\"Y\",dataout!D392=\"not in\"),2,0)","v":0},698,"MANCHESTER ESSEX","1Y0",null,698,"Y"," ",{"$f":"dataout!L392","v":5000},{"$f":"dataout!T392","v":" "},0,698,"MANCHESTER ESSEX"]
[700,1,{"$f":"IF(dataout!C393=\"Y\",\"Y\",IF(dataout!C393=\"T\",\"T\",\"N\"))","v":"N"},{"$f":"IF(AND(dataout!C393=\"Y\",dataout!D393=\"not in\"),2,0)","v":0},700,"MARTHAS VINEYARD             ","1N0","You have chosen a district that does not enroll school choice pupils in FY16",700,"N"," ",{"$f":"dataout!L393","v":0},{"$f":"dataout!T393","v":0},0,700,"MARTHAS VINEYARD"]
[705,1,{"$f":"IF(dataout!C394=\"Y\",\"Y\",IF(dataout!C394=\"T\",\"T\",\"N\"))","v":"N"},{"$f":"IF(AND(dataout!C394=\"Y\",dataout!D394=\"not in\"),2,0)","v":0},705,"MASCONOMET                   ","1N0","You have chosen a district that does not enroll school choice pupils in FY16",705,"N"," ",{"$f":"dataout!L394","v":0},{"$f":"dataout!T394","v":0},0,705,"MASCONOMET"]
[710,1,{"$f":"IF(dataout!C395=\"Y\",\"Y\",IF(dataout!C395=\"T\",\"T\",\"N\"))","v":"Y"},{"$f":"IF(AND(dataout!C395=\"Y\",dataout!D395=\"not in\"),2,0)","v":0},710,"MENDON UPTON                 ","1Y0",null,{"$f":"A395","v":710},{"$f":"C395","v":"Y"},{"$f":"IF(G395=\"1Y2\",\"bad\",\" \")","v":" "},{"$f":"dataout!L395","v":5000},{"$f":"dataout!T395","v":" "},{"$f":"O395-A395","v":0},710,"MENDON UPTON                 "]
[712,1,{"$f":"IF(dataout!C396=\"Y\",\"Y\",IF(dataout!C396=\"T\",\"T\",\"N\"))","v":"Y"},{"$f":"IF(AND(dataout!C396=\"Y\",dataout!D396=\"not in\"),2,0)","v":0},"712","MONOMOY","1Y0",null,712,"Y"," ",{"$f":"dataout!L396","v":5000},{"$f":"dataout!T396","v":" "},0,712,"MONOMOY"]
[{"$f":"VALUE(E397)","v":715},1,{"$f":"IF(dataout!C397=\"Y\",\"Y\",IF(dataout!C397=\"T\",\"T\",\"N\"))","v":"Y"},{"$f":"IF(AND(dataout!C397=\"Y\",dataout!D397=\"not in\"),2,0)","v":0},715,"MOUNT GREYLOCK               ","1Y0",null,715,"Y"," ",{"$f":"dataout!L397","v":5000},{"$f":"dataout!T397","v":" "},0,715,"MOUNT GREYLOCK               "]
[717,1,{"$f":"IF(dataout!C398=\"Y\",\"Y\",IF(dataout!C398=\"T\",\"T\",\"N\"))","v":"Y"},{"$f":"IF(AND(dataout!C398=\"Y\",dataout!D398=\"not in\"),2,0)","v":0},717,"MOHAWK TRAIL                 ","1Y0",null,717,"Y"," ",{"$f":"dataout!L398","v":5000},{"$f":"dataout!T398","v":" "},0,717,"MOHAWK TRAIL                 "]
[720,1,{"$f":"IF(dataout!C399=\"Y\",\"Y\",IF(dataout!C399=\"T\",\"T\",\"N\"))","v":"Y"},{"$f":"IF(AND(dataout!C399=\"Y\",dataout!D399=\"not in\"),2,0)","v":0},720,"NARRAGANSETT                 ","1Y0",null,720,"Y"," ",{"$f":"dataout!L399","v":5000},{"$f":"dataout!T399","v":1065},0,720,"NARRAGANSETT                 "]
[725,1,{"$f":"IF(dataout!C400=\"Y\",\"Y\",IF(dataout!C400=\"T\",\"T\",\"N\"))","v":"Y"},{"$f":"IF(AND(dataout!C400=\"Y\",dataout!D400=\"not in\"),2,0)","v":0},725,"NASHOBA                      ","1Y0",null,725,"Y"," ",{"$f":"dataout!L400","v":5000},{"$f":"dataout!T400","v":" "},0,725,"NASHOBA                      "]
[728,1,{"$f":"IF(dataout!C401=\"Y\",\"Y\",IF(dataout!C401=\"T\",\"T\",\"N\"))","v":"Y"},{"$f":"IF(AND(dataout!C401=\"Y\",dataout!D401=\"not in\"),2,0)","v":0},728,"NEW SALEM WENDELL            ","1Y0",null,728,"Y"," ",{"$f":"dataout!L401","v":5000},{"$f":"dataout!T401","v":" "},0,728,"NEW SALEM WENDELL            "]
[730,1,{"$f":"IF(dataout!C402=\"Y\",\"Y\",IF(dataout!C402=\"T\",\"T\",\"N\"))","v":"N"},{"$f":"IF(AND(dataout!C402=\"Y\",dataout!D402=\"not in\"),2,0)","v":0},730,"NORTHBORO SOUTHBORO          ","1N0","You have chosen a district that does not enroll school choice pupils in FY16",730,"N"," ",{"$f":"dataout!L402","v":0},{"$f":"dataout!T402","v":0},0,730,"NORTHBORO SOUTHBORO"]
[735,1,{"$f":"IF(dataout!C403=\"Y\",\"Y\",IF(dataout!C403=\"T\",\"T\",\"N\"))","v":"Y"},{"$f":"IF(AND(dataout!C403=\"Y\",dataout!D403=\"not in\"),2,0)","v":0},735,"NORTH MIDDLESEX              ","1Y0",null,735,"Y"," ",{"$f":"dataout!L403","v":5000},{"$f":"dataout!T403","v":" "},0,735,"NORTH MIDDLESEX              "]
[740,1,{"$f":"IF(dataout!C404=\"Y\",\"Y\",IF(dataout!C404=\"T\",\"T\",\"N\"))","v":"Y"},{"$f":"IF(AND(dataout!C404=\"Y\",dataout!D404=\"not in\"),2,0)","v":0},740,"OLD ROCHESTER                ","1Y0",null,740,"Y"," ",{"$f":"dataout!L404","v":5000},{"$f":"dataout!T404","v":" "},0,740,"OLD ROCHESTER"]
[745,1,{"$f":"IF(dataout!C405=\"Y\",\"Y\",IF(dataout!C405=\"T\",\"T\",\"N\"))","v":"Y"},{"$f":"IF(AND(dataout!C405=\"Y\",dataout!D405=\"not in\"),2,0)","v":0},745,"PENTUCKET                    ","1Y0",null,745,"Y"," ",{"$f":"dataout!L405","v":5000},{"$f":"dataout!T405","v":" "},0,745,"PENTUCKET                    "]
[750,1,{"$f":"IF(dataout!C406=\"Y\",\"Y\",IF(dataout!C406=\"T\",\"T\",\"N\"))","v":"Y"},{"$f":"IF(AND(dataout!C406=\"Y\",dataout!D406=\"not in\"),2,0)","v":0},750,"PIONEER                      ","1Y0",null,750,"Y"," ",{"$f":"dataout!L406","v":5000},{"$f":"dataout!T406","v":" "},0,750,"PIONEER                      "]
[753,1,{"$f":"IF(dataout!C407=\"Y\",\"Y\",IF(dataout!C407=\"T\",\"T\",\"N\"))","v":"Y"},{"$f":"IF(AND(dataout!C407=\"Y\",dataout!D407=\"not in\"),2,0)","v":0},753,"QUABBIN                      ","1Y0",null,753,"Y"," ",{"$f":"dataout!L407","v":5000},{"$f":"dataout!T407","v":" "},0,753,"QUABBIN                      "]
[755,1,{"$f":"IF(dataout!C408=\"Y\",\"Y\",IF(dataout!C408=\"T\",\"T\",\"N\"))","v":"Y"},{"$f":"IF(AND(dataout!C408=\"Y\",dataout!D408=\"not in\"),2,0)","v":0},755,"RALPH C MAHAR                ","1Y0",null,755,"Y"," ",{"$f":"dataout!L408","v":5000},{"$f":"dataout!T408","v":" "},0,755,"RALPH C MAHAR                "]
[760,1,{"$f":"IF(dataout!C409=\"Y\",\"Y\",IF(dataout!C409=\"T\",\"T\",\"N\"))","v":"N"},{"$f":"IF(AND(dataout!C409=\"Y\",dataout!D409=\"not in\"),2,0)","v":0},760,"SILVER LAKE                  ","1N0","You have chosen a district that does not enroll school choice pupils in FY16",760,"N"," ",{"$f":"dataout!L409","v":0},{"$f":"dataout!T409","v":0},0,760,"SILVER LAKE"]
[763,1,{"$f":"IF(dataout!C410=\"Y\",\"Y\",IF(dataout!C410=\"T\",\"T\",\"N\"))","v":"Y"},{"$f":"IF(AND(dataout!C410=\"Y\",dataout!D410=\"not in\"),2,0)","v":0},763,"SOMERSET BERKLEY","1Y0",null,763,"Y"," ",{"$f":"dataout!L410","v":5000},{"$f":"dataout!T410","v":1153},0,763,"SOMERSET BERKLEY"]
[{"$f":"VALUE(E411)","v":765},1,{"$f":"IF(dataout!C411=\"Y\",\"Y\",IF(dataout!C411=\"T\",\"T\",\"N\"))","v":"Y"},{"$f":"IF(AND(dataout!C411=\"Y\",dataout!D411=\"not in\"),2,0)","v":0},765,"SOUTHERN BERKSHIRE           ","1Y0",null,765,"Y"," ",{"$f":"dataout!L411","v":5000},{"$f":"dataout!T411","v":" "},0,765,"SOUTHERN BERKSHIRE           "]
[766,1,{"$f":"IF(dataout!C412=\"Y\",\"Y\",IF(dataout!C412=\"T\",\"T\",\"N\"))","v":"Y"},{"$f":"IF(AND(dataout!C412=\"Y\",dataout!D412=\"not in\"),2,0)","v":0},766,"SOUTHWICK TOLLAND","1Y0",null,766,"Y"," ",{"$f":"dataout!L412","v":5000},{"$f":"dataout!T412","v":908},0,766,"SOUTHWICK TOLLAND"]
[767,1,{"$f":"IF(dataout!C413=\"Y\",\"Y\",IF(dataout!C413=\"T\",\"T\",\"N\"))","v":"Y"},{"$f":"IF(AND(dataout!C413=\"Y\",dataout!D413=\"not in\"),2,0)","v":0},767,"SPENCER EAST BROOKFIELD      ","1Y0",null,767,"Y"," ",{"$f":"dataout!L413","v":5000},{"$f":"dataout!T413","v":980},0,767,"SPENCER EAST BROOKFIELD      "]
[770,1,{"$f":"IF(dataout!C414=\"Y\",\"Y\",IF(dataout!C414=\"T\",\"T\",\"N\"))","v":"Y"},{"$f":"IF(AND(dataout!C414=\"Y\",dataout!D414=\"not in\"),2,0)","v":0},770,"TANTASQUA                    ","1Y0",null,770,"Y"," ",{"$f":"dataout!L414","v":5000},{"$f":"dataout!T414","v":5000},0,770,"TANTASQUA                    "]
[773,1,{"$f":"IF(dataout!C415=\"Y\",\"Y\",IF(dataout!C415=\"T\",\"T\",\"N\"))","v":"Y"},{"$f":"IF(AND(dataout!C415=\"Y\",dataout!D415=\"not in\"),2,0)","v":0},773,"TRITON                       ","1Y0",null,773,"Y"," ",{"$f":"dataout!L415","v":5000},{"$f":"dataout!T415","v":" "},0,773,"TRITON                       "]
[774,1,{"$f":"IF(dataout!C416=\"Y\",\"Y\",IF(dataout!C416=\"T\",\"T\",\"N\"))","v":"Y"},{"$f":"IF(AND(dataout!C416=\"Y\",dataout!D416=\"not in\"),2,0)","v":0},774,"UPISLAND","1Y0",null,774,"Y"," ",{"$f":"dataout!L416","v":5000},{"$f":"dataout!T416","v":" "},0,774,"UPISLAND"]
[775,1,{"$f":"IF(dataout!C417=\"Y\",\"Y\",IF(dataout!C417=\"T\",\"T\",\"N\"))","v":"Y"},{"$f":"IF(AND(dataout!C417=\"Y\",dataout!D417=\"not in\"),2,0)","v":0},775,"WACHUSETT                    ","1Y0",null,775,"Y"," ",{"$f":"dataout!L417","v":5000},{"$f":"dataout!T417","v":" "},0,775,"WACHUSETT                    "]
[778,1,{"$f":"IF(dataout!C418=\"Y\",\"Y\",IF(dataout!C418=\"T\",\"T\",\"N\"))","v":"Y"},{"$f":"IF(AND(dataout!C418=\"Y\",dataout!D418=\"not in\"),2,0)","v":0},778,"QUABOAG","1Y0",null,778,"Y"," ",{"$f":"dataout!L418","v":5000},{"$f":"dataout!T418","v":" "},0,778,"QUABOAG"]
[780,1,{"$f":"IF(dataout!C419=\"Y\",\"Y\",IF(dataout!C419=\"T\",\"T\",\"N\"))","v":"Y"},{"$f":"IF(AND(dataout!C419=\"Y\",dataout!D419=\"not in\"),2,0)","v":0},780,"WHITMAN HANSON               ","1Y0",null,780,"Y"," ",{"$f":"dataout!L419","v":5000},{"$f":"dataout!T419","v":" "},0,780,"WHITMAN HANSON"]
[801,1,{"$f":"IF(dataout!C420=\"Y\",\"Y\",IF(dataout!C420=\"T\",\"T\",\"N\"))","v":"N"},{"$f":"IF(AND(dataout!C420=\"Y\",dataout!D420=\"not in\"),2,0)","v":0},801,"ASSABET VALLEY               ","1N0","You have chosen a district that does not enroll school choice pupils in FY16",801,"N"," ",{"$f":"dataout!L420","v":0},{"$f":"dataout!T420","v":0},0,801,"ASSABET VALLEY"]
[805,1,{"$f":"IF(dataout!C421=\"Y\",\"Y\",IF(dataout!C421=\"T\",\"T\",\"N\"))","v":"N"},{"$f":"IF(AND(dataout!C421=\"Y\",dataout!D421=\"not in\"),2,0)","v":0},805,"BLACKSTONE VALLEY            ","1N0","You have chosen a district that does not enroll school choice pupils in FY16",805,"N"," ",{"$f":"dataout!L421","v":0},{"$f":"dataout!T421","v":0},0,805,"BLACKSTONE VALLEY"]
[806,1,{"$f":"IF(dataout!C422=\"Y\",\"Y\",IF(dataout!C422=\"T\",\"T\",\"N\"))","v":"N"},{"$f":"IF(AND(dataout!C422=\"Y\",dataout!D422=\"not in\"),2,0)","v":0},806,"BLUE HILLS                   ","1N0","You have chosen a district that does not enroll school choice pupils in FY16",806,"N"," ",{"$f":"dataout!L422","v":0},{"$f":"dataout!T422","v":0},0,806,"BLUE HILLS"]
[810,1,{"$f":"IF(dataout!C423=\"Y\",\"Y\",IF(dataout!C423=\"T\",\"T\",\"N\"))","v":"N"},{"$f":"IF(AND(dataout!C423=\"Y\",dataout!D423=\"not in\"),2,0)","v":0},810,"BRISTOL PLYMOUTH             ","1N0","You have chosen a district that does not enroll school choice pupils in FY16",810,"N"," ",{"$f":"dataout!L423","v":0},{"$f":"dataout!T423","v":0},0,810,"BRISTOL PLYMOUTH"]
[815,1,{"$f":"IF(dataout!C424=\"Y\",\"Y\",IF(dataout!C424=\"T\",\"T\",\"N\"))","v":"N"},{"$f":"IF(AND(dataout!C424=\"Y\",dataout!D424=\"not in\"),2,0)","v":0},815,"CAPE COD                     ","1N0","You have chosen a district that does not enroll school choice pupils in FY16",815,"N"," ",{"$f":"dataout!L424","v":0},{"$f":"dataout!T424","v":0},0,815,"CAPE COD"]
[817,1,{"$f":"IF(dataout!C425=\"Y\",\"Y\",IF(dataout!C425=\"T\",\"T\",\"N\"))","v":"Y"},{"$f":"IF(AND(dataout!C425=\"Y\",dataout!D425=\"not in\"),2,0)","v":0},"817","ESSEX NORTH SHORE","1Y0",null,{"$f":"A425","v":817},{"$f":"C425","v":"Y"},{"$f":"IF(G425=\"1Y2\",\"bad\",\" \")","v":" "},{"$f":"dataout!L425","v":0},{"$f":"dataout!T425","v":5000}]
[818,1,{"$f":"IF(dataout!C426=\"Y\",\"Y\",IF(dataout!C426=\"T\",\"T\",\"N\"))","v":"N"},{"$f":"IF(AND(dataout!C426=\"Y\",dataout!D426=\"not in\"),2,0)","v":0},818,"FRANKLIN COUNTY              ","1N0","You have chosen a district that does not enroll school choice pupils in FY16",818,"N"," ",{"$f":"dataout!L426","v":0},{"$f":"dataout!T426","v":0},0,818,"FRANKLIN COUNTY"]
[821,1,{"$f":"IF(dataout!C427=\"Y\",\"Y\",IF(dataout!C427=\"T\",\"T\",\"N\"))","v":"N"},{"$f":"IF(AND(dataout!C427=\"Y\",dataout!D427=\"not in\"),2,0)","v":0},821,"GREATER FALL RIVER           ","1N0","You have chosen a district that does not enroll school choice pupils in FY16",821,"N"," ",{"$f":"dataout!L427","v":0},{"$f":"dataout!T427","v":0},0,821,"GREATER FALL RIVER"]
[823,1,{"$f":"IF(dataout!C428=\"Y\",\"Y\",IF(dataout!C428=\"T\",\"T\",\"N\"))","v":"Y"},{"$f":"IF(AND(dataout!C428=\"Y\",dataout!D428=\"not in\"),2,0)","v":0},823,"GREATER LAWRENCE             ","1Y0",null,823,"Y"," ",{"$f":"dataout!L428","v":5000},{"$f":"dataout!T428","v":5000},0,823,"GREATER LAWRENCE             "]
[825,1,{"$f":"IF(dataout!C429=\"Y\",\"Y\",IF(dataout!C429=\"T\",\"T\",\"N\"))","v":"N"},{"$f":"IF(AND(dataout!C429=\"Y\",dataout!D429=\"not in\"),2,0)","v":0},825,"GREATER NEW BEDFORD          ","1N0","You have chosen a district that does not enroll school choice pupils in FY16",825,"N"," ",{"$f":"dataout!L429","v":0},{"$f":"dataout!T429","v":0},0,825,"GREATER NEW BEDFORD"]
[828,1,{"$f":"IF(dataout!C430=\"Y\",\"Y\",IF(dataout!C430=\"T\",\"T\",\"N\"))","v":"Y"},{"$f":"IF(AND(dataout!C430=\"Y\",dataout!D430=\"not in\"),2,0)","v":0},828,"GREATER LOWELL               ","1Y0",null,828,"Y"," ",{"$f":"dataout!L430","v":5000},{"$f":"dataout!T430","v":5000},0,828,"GREATER LOWELL               "]
[829,1,{"$f":"IF(dataout!C431=\"Y\",\"Y\",IF(dataout!C431=\"T\",\"T\",\"N\"))","v":"N"},{"$f":"IF(AND(dataout!C431=\"Y\",dataout!D431=\"not in\"),2,0)","v":0},829,"SOUTH MIDDLESEX              ","1N0","You have chosen a district that does not enroll school choice pupils in FY16",829,"N"," ",{"$f":"dataout!L431","v":0},{"$f":"dataout!T431","v":0},0,829,"SOUTH MIDDLESEX"]
[830,1,{"$f":"IF(dataout!C432=\"Y\",\"Y\",IF(dataout!C432=\"T\",\"T\",\"N\"))","v":"N"},{"$f":"IF(AND(dataout!C432=\"Y\",dataout!D432=\"not in\"),2,0)","v":0},830,"MINUTEMAN                    ","1N0","You have chosen a district that does not enroll school choice pupils in FY16",830,"N"," ",{"$f":"dataout!L432","v":0},{"$f":"dataout!T432","v":0},0,830,"MINUTEMAN"]
[832,1,{"$f":"IF(dataout!C433=\"Y\",\"Y\",IF(dataout!C433=\"T\",\"T\",\"N\"))","v":"Y"},{"$f":"IF(AND(dataout!C433=\"Y\",dataout!D433=\"not in\"),2,0)","v":0},832,"MONTACHUSETT                 ",{"$f":"B433&C433&D433","v":"1Y0"},null,832,"Y"," ",{"$f":"dataout!L433","v":0},{"$f":"dataout!T433","v":5000},0,832,"MONTACHUSETT                 "]
[851,1,{"$f":"IF(dataout!C434=\"Y\",\"Y\",IF(dataout!C434=\"T\",\"T\",\"N\"))","v":"N"},{"$f":"IF(AND(dataout!C434=\"Y\",dataout!D434=\"not in\"),2,0)","v":0},851,"NORTHERN BERKSHIRE           ","1N0","You have chosen a district that does not enroll school choice pupils in FY16",851,"N"," ",{"$f":"dataout!L434","v":0},{"$f":"dataout!T434","v":0},0,851,"NORTHERN BERKSHIRE"]
[852,1,{"$f":"IF(dataout!C435=\"Y\",\"Y\",IF(dataout!C435=\"T\",\"T\",\"N\"))","v":"Y"},{"$f":"IF(AND(dataout!C435=\"Y\",dataout!D435=\"not in\"),2,0)","v":0},852,"NASHOBA VALLEY               ","1Y0",null,852,"Y"," ",{"$f":"dataout!L435","v":0},{"$f":"dataout!T435","v":5000},0,852,"NASHOBA VALLEY               "]
[853,1,{"$f":"IF(dataout!C436=\"Y\",\"Y\",IF(dataout!C436=\"T\",\"T\",\"N\"))","v":"Y"},{"$f":"IF(AND(dataout!C436=\"Y\",dataout!D436=\"not in\"),2,0)","v":0},853,"NORTHEAST METROPOLITAN       ","1Y0",null,853,"Y"," ",{"$f":"dataout!L436","v":0},{"$f":"dataout!T436","v":5000},0,853,"NORTHEAST METROPOLITAN       "]
[855,1,{"$f":"IF(dataout!C437=\"Y\",\"Y\",IF(dataout!C437=\"T\",\"T\",\"N\"))","v":"N"},{"$f":"IF(AND(dataout!C437=\"Y\",dataout!D437=\"not in\"),2,0)","v":0},855,"OLD COLONY                   ","1N0","You have chosen a district that does not enroll school choice pupils in FY16",855,"N"," ",{"$f":"dataout!L437","v":0},{"$f":"dataout!T437","v":0},0,855,"OLD COLONY"]
[860,1,{"$f":"IF(dataout!C438=\"Y\",\"Y\",IF(dataout!C438=\"T\",\"T\",\"N\"))","v":"Y"},{"$f":"IF(AND(dataout!C438=\"Y\",dataout!D438=\"not in\"),2,0)","v":0},860,"PATHFINDER                   ","1Y0",null,860,"Y"," ",{"$f":"dataout!L438","v":0},{"$f":"dataout!T438","v":5000},0,860,"PATHFINDER                   "]
[871,1,{"$f":"IF(dataout!C439=\"Y\",\"Y\",IF(dataout!C439=\"T\",\"T\",\"N\"))","v":"N"},{"$f":"IF(AND(dataout!C439=\"Y\",dataout!D439=\"not in\"),2,0)","v":0},871,"SHAWSHEEN VALLEY             ","1N0","You have chosen a district that does not enroll school choice pupils in FY16",871,"N"," ",{"$f":"dataout!L439","v":0},{"$f":"dataout!T439","v":0},0,871,"SHAWSHEEN VALLEY"]
[872,1,{"$f":"IF(dataout!C440=\"Y\",\"Y\",IF(dataout!C440=\"T\",\"T\",\"N\"))","v":"N"},{"$f":"IF(AND(dataout!C440=\"Y\",dataout!D440=\"not in\"),2,0)","v":0},872,"SOUTHEASTERN                 ","1N0","You have chosen a district that does not enroll school choice pupils in FY16",872,"N"," ",{"$f":"dataout!L440","v":0},{"$f":"dataout!T440","v":0},0,872,"SOUTHEASTERN"]
[873,1,{"$f":"IF(dataout!C441=\"Y\",\"Y\",IF(dataout!C441=\"T\",\"T\",\"N\"))","v":"N"},{"$f":"IF(AND(dataout!C441=\"Y\",dataout!D441=\"not in\"),2,0)","v":0},873,"SOUTH SHORE                  ","1N0","You have chosen a district that does not enroll school choice pupils in FY16",873,"N"," ",{"$f":"dataout!L441","v":0},{"$f":"dataout!T441","v":0},0,873,"SOUTH SHORE"]
[876,1,{"$f":"IF(dataout!C442=\"Y\",\"Y\",IF(dataout!C442=\"T\",\"T\",\"N\"))","v":"N"},{"$f":"IF(AND(dataout!C442=\"Y\",dataout!D442=\"not in\"),2,0)","v":0},876,"SOUTHERN WORCESTER           ","1N0","You have chosen a district that does not enroll school choice pupils in FY16",876,"N"," ",{"$f":"dataout!L442","v":0},{"$f":"dataout!T442","v":0},0,876,"SOUTHERN WORCESTER"]
[878,1,{"$f":"IF(dataout!C443=\"Y\",\"Y\",IF(dataout!C443=\"T\",\"T\",\"N\"))","v":"N"},{"$f":"IF(AND(dataout!C443=\"Y\",dataout!D443=\"not in\"),2,0)","v":0},878,"TRI COUNTY                   ","1N0","You have chosen a district that does not enroll school choice pupils in FY16",878,"N"," ",{"$f":"dataout!L443","v":0},{"$f":"dataout!T443","v":0},0,878,"TRI COUNTY"]
[879,1,{"$f":"IF(dataout!C444=\"Y\",\"Y\",IF(dataout!C444=\"T\",\"T\",\"N\"))","v":"N"},{"$f":"IF(AND(dataout!C444=\"Y\",dataout!D444=\"not in\"),2,0)","v":0},879,"UPPER CAPE COD               ","1N0","You have chosen a district that does not enroll school choice pupils in FY16",879,"N"," ",{"$f":"dataout!L444","v":0},{"$f":"dataout!T444","v":0},0,879,"UPPER CAPE COD"]
[885,1,{"$f":"IF(dataout!C445=\"Y\",\"Y\",IF(dataout!C445=\"T\",\"T\",\"N\"))","v":"Y"},{"$f":"IF(AND(dataout!C445=\"Y\",dataout!D445=\"not in\"),2,0)","v":0},885,"WHITTIER                     ","1Y0",null,885,"Y"," ",{"$f":"dataout!L445","v":0},{"$f":"dataout!T445","v":5000},0,885,"WHITTIER                     "]
[910,1,{"$f":"IF(dataout!C446=\"Y\",\"Y\",IF(dataout!C446=\"T\",\"T\",\"N\"))","v":"N"},{"$f":"IF(AND(dataout!C446=\"Y\",dataout!D446=\"not in\"),2,0)","v":0},910,"BRISTOL COUNTY               ","1N0","You have chosen a district that does not enroll school choice pupils in FY16",910,"N"," ",{"$f":"dataout!L446","v":0},{"$f":"dataout!T446","v":0},0,910,"BRISTOL COUNTY"]
[915,1,{"$f":"IF(dataout!C447=\"Y\",\"Y\",IF(dataout!C447=\"T\",\"T\",\"N\"))","v":"N"},{"$f":"IF(AND(dataout!C447=\"Y\",dataout!D447=\"not in\"),2,0)","v":0},915,"NORFOLK COUNTY               ","1N0","You have chosen a district that does not enroll school choice pupils in FY16",915,"N"," ",{"$f":"dataout!L447","v":0},{"$f":"dataout!T447","v":0},0,915,"NORFOLK COUNTY"]