{"text_format":"1","workbook":"xlsx","n_sheets":7,"sheets":["Prompt","Instruction","Assurances","Group A - FY18 Budget & Updates","Group B - FY18 Framework","District List","DataRecord"],"not_rendered":{"charts":0,"images":1,"macros":1,"external_links":0,"defined_names":2,"comments":1,"pivot_tables":0},"unopened":[],"bounds":{"document_bytes":16777216,"sheet_cells":100000,"rows_first":2000,"rows_last":500,"rows_between":2000,"halvings":0,"cell_chars":16384,"cell_head_chars":4096},"cells_cut":0,"cells_raw":0,"read":"whole","date_system":"1900"}

{"sheet":"Prompt","index":0,"n_rows":0,"n_cols":0,"rows_kept":0,"cut":false,"hidden":false,"merged":[]}

{"sheet":"Instruction","index":1,"n_rows":49,"n_cols":3,"rows_kept":49,"cut":false,"hidden":true,"merged":[[48,1,48,10],[5,1,5,10],[38,2,38,10],[39,1,39,10],[47,1,47,10],[40,2,40,10],[41,2,41,10],[42,1,42,10],[43,2,43,10],[46,1,46,10],[44,2,44,10],[21,2,21,10],[31,2,31,10],[33,2,33,10],[34,1,34,10],[35,1,35,10],[36,1,36,10],[37,2,37,10],[32,2,32,10],[29,2,29,10],[30,2,30,10],[26,2,26,10],[15,2,15,10],[16,2,16,10],[2,1,2,10],[4,1,4,10],[20,1,20,10],[22,2,22,10],[23,1,23,10],[9,2,9,10],[1,1,1,9],[27,1,27,10],[28,1,28,10],[24,1,24,10],[3,1,3,2],[25,1,25,10],[18,2,18,10],[19,1,19,10],[6,1,6,10],[14,2,14,10],[7,1,7,10],[13,2,13,10],[17,2,17,10],[8,1,8,10],[11,1,11,10],[12,2,12,10]]}
[]
[null,"Massachusetts Department of Elementary and Secondary Education\nFund Code:240 – FY18 Making Money Matter (M3) Planning"]
[null,"SmartForm Instructions"]
[null,"Overview"]
[null,"Districts with 2015 or 2016 special education determination levels of Needs Technical Assistance (NTA), Needs Intervention (NI), and Needs Substantial Intervention (NSI) are required to participate in Making Money Matter (M3). This Excel workbook contains forms that an identified M3 school district must submit to the Massachusetts Department of Elementary and Secondary Education (ESE) when applying for the Fund Code 240 grant opportunity. The forms are on two separate worksheets within this workbook and requirements are differentiated by M3 identification year. \n\n\n"]
[null,"For additional information regarding special education determination of district need for technical assistance or intervention please review the 2016 Determination of Need for Special Education Technical Assistance or Intervention on the ESE Accountability."]
[null,"Saving the M3 SmartForm\nOnce the file is open, select ‘Save As’ and indicate where you want to save the file on your computer. The file is currently named 'FY18_M3_District Name_leacode’. Edit the current file name by replacing the words ‘leacode’ with your 4-digit LEA code. \n\nFor additional assistance please contact your local district IT support personnel.\n"]
[null,"Assurances"]
[null,"Part I – General Information"]
[null,"1. ","District Information: Select the district name from the drop-down menu. Once the district is selected, the address and M3 identification year will auto-populate."]
[]
[null,"Part II – Re-direction of Funds"]
[null,"2. ","District’s FY18 Fund Code 240 Allocation Amount: This funding amount will auto-populate once the district name is selected in Part I."]
[null,"3. ","Percentage of funds to be re-directed for the district’s M3 project: Enter any percentage between 2% - 4%. "]
[null,"4. ","Total amount of funds for the district’s M3 project: This funding amount will auto-calculate once step 3 is complete."]
{"$rows_left_out":35}
{"sheet":"Assurances","index":2,"n_rows":60,"n_cols":11,"rows_kept":60,"cut":false,"hidden":true,"merged":[[51,2,51,10],[59,4,59,5],[55,6,55,10],[56,6,56,10],[57,6,57,10],[58,6,58,10],[59,6,59,10],[55,4,55,5],[58,4,58,5],[10,4,10,5],[9,4,9,7],[20,1,20,9],[23,1,23,9],[55,1,59,3],[32,2,32,10],[24,1,24,9],[28,1,28,10],[29,1,29,10],[57,4,57,5],[34,2,34,10],[56,4,56,5],[36,2,36,10],[37,2,37,10],[48,1,48,10],[39,2,39,10],[18,1,18,9],[0,1,0,7],[8,1,8,3],[31,2,31,10],[30,2,30,10],[9,1,10,3],[11,1,12,3],[11,4,12,10],[26,1,26,10],[14,1,14,10],[15,1,15,10],[16,1,16,9],[17,1,17,9],[2,1,2,10],[4,1,4,10],[6,1,6,10],[53,2,53,10],[54,1,54,10],[25,1,25,9],[52,2,52,10],[44,2,44,10],[45,2,45,10],[49,2,49,10],[35,2,35,10],[38,1,38,10],[33,2,33,10],[42,2,42,10],[43,2,43,10],[41,2,41,10],[46,2,46,10],[40,2,40,10],[50,2,50,10]]}
[null,"Making Money Matter (M3) – Statement of Assurance Regarding Directed Funds to Improve Outcomes for Students with Individualized Education Programs (IEPs)"]
[]
[null,"PART I – GENERAL INFORMATION"]
[]
[null,"Districts with FY15 or FY16 special education determination levels of Needs Technical Assistance (NTA), Needs Intervention (NI), and Needs Substantial Intervention (NSI) must complete this form."]
[]
[]
[]
["1.","School District Name",null,null,1]
[null,"School District Address: (Street, City/Town, Zip Code)",null,null,{"$f":"VLOOKUP(Assurances!$E$9,'District List'!A1:K81,7,FALSE)","v":"ADDRESS LINE 1"}]
[null,null,null,null,{"$f":"VLOOKUP(Assurances!$E$9,'District List'!A1:K81,9,FALSE)","v":"CITY/TOWN"},null,null,null,{"$f":"VLOOKUP(Assurances!$E$9,'District List'!A1:K81,11,FALSE)","v":"ZIP CODE"}]
[null,"M3 Identification Year:",null,null,{"$f":"VLOOKUP(Assurances!$E$9,'District List'!A1:S81,19,FALSE)","v":"M3 Identification Year"}]
[]
[]
[null,"PART II – RE-DIRECTION OF FUNDS"]
{"$rows_left_out":46}
{"sheet":"Group A - FY18 Budget & Updates","index":3,"n_rows":29,"n_cols":8,"rows_kept":29,"cut":false,"hidden":true,"merged":[[25,1,25,4],[26,1,26,4],[27,1,27,13],[28,1,28,13],[1,1,1,13],[2,1,2,13],[3,1,3,13],[5,2,5,13],[21,7,21,13],[6,2,6,13],[8,1,8,13],[10,2,10,13],[18,7,18,13],[19,7,19,13],[12,1,12,4],[12,7,12,13],[13,1,13,4],[23,1,23,4],[14,1,14,4],[15,1,15,4],[17,1,17,4],[13,7,13,13],[14,7,14,13],[15,7,15,13],[17,7,17,13],[16,1,16,4],[16,7,16,13],[22,7,22,13],[20,7,20,13],[23,7,23,13],[18,1,18,4],[19,1,19,4],[20,1,20,4],[21,1,21,4],[22,1,22,4]]}
[]
[null,"Making Money Matter (M3) – Updates and Spending Plan to \nImprove Outcomes for Students with Individualized Education Programs (IEPs)"]
[null,"The directed fund use is to support the following program improvement activities in FY18:\n 1.       implementing the district M3 action plan (developed through FY17 240 funds) and making data-based midcourse corrections, and \n 2.       maintaining the M3 multi-year strategic plan (developed through FY17 240 funds) and updating it as needed, in consultation with ESE."]
[null,"PART IV – M3 FY18 Updates"]
[]
[null,"1.","If the district has made a substantive change(s) to the FY18 Action Plan or Multi-year Strategic Plan since the FY17 M3 End of the Year Report, include a short description (2-4 sentences) of the change(s). \nIf the district has not made a substantive change(s) to either plan, enter “N/A.” "]
[]
[]
[null,"PART V – M3 FY18 Spending Plan"]
[]
[null,null,"This is your projected M3 FY18 Spending Plan not a grant budget workbook. While the M3 spending plan must align with the Fund Code 240 budget entry in Ed Grants, it will not be identical to and cannot be substituted for the Ed Grants budget entry formlet. ESE anticipates that as your district makes data-based midcourse corrections to the FY18 Action Plan, changes in district spending will also occur. For this reason, this spending plan is considered a non-binding estimate."]
[]
[null,"M3 FY18 - Spending Category                                                 ",null,null,null,"2. M3 FY18 - Amount of Funds for the  M3 project ","3. M3 FY18 - Percent of M3 Funds by Spending Category","4. M3 FY18 - Spending Category Narrative Description and Rationale\nIn the spaces below, describe the M3 spending category expenditures, providing, for example, information that clearly identifies the individual or group providing a service and/or the rationale for proposing a purchase."]
[null,"ADMINISTRATORS",null,null,null,0,{"$f":"IF(ISERROR(F14/Assurances!$K$19), \"\",IF(F14/Assurances!$K$19 = 0, \"\",F14/Assurances!$K$19))","v":""}]
[null,"INSTRUCTIONAL/PROF. STAFF",null,null,null,0,{"$f":"IF(ISERROR(F15/Assurances!$K$19), \"\",IF(F15/Assurances!$K$19 = 0, \"\",F15/Assurances!$K$19))","v":""}]
{"$rows_left_out":15}
{"sheet":"Group B - FY18 Framework","index":4,"n_rows":54,"n_cols":3,"rows_kept":54,"cut":false,"hidden":true,"merged":[[53,1,53,9],[10,1,10,10],[45,2,45,9],[46,2,46,9],[47,2,47,9],[49,2,49,9],[50,2,50,9],[41,2,41,9],[11,1,11,10],[51,2,51,9],[52,2,52,9],[37,2,37,9],[38,2,38,9],[39,2,39,9],[40,2,40,9],[48,2,48,9],[43,2,43,9],[44,2,44,9],[42,2,42,9],[28,2,28,10],[29,1,29,9],[36,1,36,10],[0,1,0,10],[2,1,2,10],[3,1,3,10],[5,1,5,10],[7,1,7,10],[30,1,30,10],[16,1,16,10],[20,2,20,10],[21,2,21,10],[23,2,23,10],[8,1,8,10],[4,1,4,10],[6,1,6,10],[13,1,13,10],[9,1,9,10],[31,1,31,10],[32,1,32,10],[33,1,33,10],[34,1,34,10],[35,1,35,10],[19,2,19,10],[27,2,27,10],[22,2,22,10],[12,1,12,10],[14,1,14,10],[15,1,15,10],[24,2,24,10],[25,2,25,10],[26,2,26,10],[18,2,18,10],[17,2,17,10]]}
[null,"Making Money Matter (M3) – What Special Education \n& General Education Administrators Need to Know"]
[]
[null,"PART IV – General Information"]
[null,"This project, called Making Money Matter (M3), is part of the Massachusetts Results Driven Accountability (RDA) initiative, and promotes targeted use of federal special education funds in ways that are designed to lead to improved outcomes for students with Individualized Education Programs (IEPs)."]
[null,"This year, your district’s M3 redirection of FY18 240 funds and corresponding work will focus on the process of creating both a multi-year Strategic Plan for improving the outcomes of students with IEPs and an FY19 Action Plan for implemention. "]
[null,"While your district's participation in M3 was triggered by its 2016 special education determination level and is strongly correlated to students’ academic achievement on MCAS, your district is required to engage in self-assessment and planning "]
[null,"processes that are broad in scope including multiple indicators of successful outcomes for students with IEPs. For this reason, ESE recommends immediately reviewing results from your district’s most recent Coordinated Program Review or Mid-Cycle Review, and reviewing district performance in relation to the indicators specified in the Massachusetts State Performance Plan and Annual Performance Report (SPP/APR)."]
[null,"Because outcomes for students with IEPs are dependent upon student access to the Massachusetts Curriculum Frameworks and participation in the Least Restrictive Environment (LRE), your district’s M3 planning process and work should prioritize: leveraging your district's general education and special education systems' strengths, and collaboration between your district's general education and special education administrators and educators. "]
[null,"Your district’s M3 planning process and work should mirror and align with improvement planning that is currently occurring in your district for all students; however, the M3 work must target the outcomes of students with IEPs, the effectiveness of local special education programs and services, and improving the application of the district standards and indicators to special education systems. "]
[]
[null,"PART V – M3 Process Framework and \nEarly Planning Benchmarks "]
[null,"FY18 is intended to be a planning year. Your district's early planning for M3 should focus on the improvement process itself and the steps that are necessary to identify: a student outcome area(s) that is most urgently in need of improvement in your district, systems-level barriers and/or gaps that impact your district's capacity to improve the target student outcome area(s), and evidence-based strategies that will make the most impact on improving the target student outcome area(s). "]
[null,"Identification and use of a research-based planning framework that includes process benchmarks is required. When selecting a planning framework your district should consider a planning framework that includes tools and resources to support your district's planning process and will result in effectively determining the who, what, when, where, why, and how of the M3 work in your district. "]
[null,"ESE strongly encourages districts to use the Planning for Success framework located on the ESE website as the FY18 M3 mid-year and end of year reports are based on this framework and its corresponding tools and resources. (Reporting requirements are described in Part VI below.) "]
[null,"For districts that choose to use the Planning for Success framework, tools, and resources: The list of suggested process benchmarks below are aligned with the Planning for Success framework. These benchmarks should be used as an FY18 early planning aid in order to set timelines by which each process benchmark listed below will begin and/or be completed. Districts will not be asked to submit these dates to ESE; however, thoughtful timeline setting and use of the Planning for Success tools and resources will naturally generate the information required to successfully meet M3 mid-year and end of year report requirements. \n"]
{"$rows_left_out":40}
{"sheet":"District List","index":5,"n_rows":81,"n_cols":19,"rows_kept":81,"cut":false,"hidden":true,"merged":[]}
[1,"FUNCTION","FIRST NAME","LAST NAME","ORGANIZATION NAME","ORGANIZATION CODE","ADDRESS LINE 1","ADDRESS LINE 2","CITY/TOWN","STATE","ZIP CODE","PHONE","FAX","EMAIL","FY18 240 Entitlement","FY18 274 Final Allocation","15% of FY18 274","FY18 M3 Grouping","M3 Identification Year"]
[2,"Superintendent","Peter","Schafer","Abington","00010000","171 Adams St",null,"Abington","MA","02351","781-982-2150","781-982-2157","peterschafer@abingtonps.org",501846,10587,1588,"A","FY17 - 2015 special education determination levels of NTA, NI, or NSI"]
[3,"Charter School Leader","Susan","Thompson","Academy Of the Pacific Rim Charter Public (District)","04120000","1 Westinghouse Plaza",null,"Hyde Park","MA","02136","617-361-0050","617-361-0045","ccollins@pacrim.org",103167,3006,451,"B","FY18 - 2016 special education determination levels of NTA, NI, or NSI"]
[4,"Superintendent","Alfred","Skrocki","Adams-Cheshire","06030000","191 Church St",null,"Cheshire","MA","01225","508-597-2400","508-597-2499","m.demello@amsacs.org",394904,7506,1126,"A","FY17 - 2015 special education determination levels of NTA, NI, or NSI"]
[5,"Superintendent","Maria","Geryk","Amherst-Pelham","06050000","170 Chestnut Street",null,"Amherst","MA","01002","413-362-1810","413-549-6108","gerykm@arps.org",415606,7803,1170,"B","FY18 - 2016 special education determination levels of NTA, NI, or NSI"]
[6,"Superintendent","Anthony","Polito","Athol-Royalston","06150000","1062 Pleasant Street",null,"Athol","MA","01331","508-672-2181","508-672-2474","robert.beatty@atlantiscs.org",453259,6197,930,"A","FY17 - 2015 special education determination levels of NTA, NI, or NSI"]
[7,"Superintendent","Edward","Fleury","Bellingham","00250000","60 Harpin Street",null,"Bellingham","MA","02019","617-993-5401","617-993-5409","jphelan@belmont.k12.ma.us",646503,12206,1831,"A","FY17 - 2015 special education determination levels of NTA, NI, or NSI"]
[8,"Superintendent","Timothy","Piwowar","Billerica","00310000","365 Boston Rd",null,"Billerica","MA","01821","508-883-4400","508-883-9892","ahimmelberger@bmrsd.net",1238005,27006,4051,"A","FY17 - 2015 special education determination levels of NTA, NI, or NSI"]
[9,"Superintendent","Carol","Johnson","Boston","00350000","26 Court Street",null,"Boston","MA","02108","617-635-6789","617-635-6380","bzapater@boston.k12.ma.us",17602911,120332.163168,18050,"A","FY17 - 2015 special education determination levels of NTA, NI, or NSI"]
[10,"Charter School Leader","Beatriz","McConnie","Boston Day and Evening Academy Charter (District)","04240000","20 Kearsarge Ave",null,"Roxbury","MA","02119","617-333-6688","617-333-6689","sliszanckie@bostonprep.org",83551,2706,406,"A","FY17 - 2015 special education determination levels of NTA, NI, or NSI"]
[11,"Charter School Leader","Jeff","Liberty","Boston Green Academy Horace Mann Charter School (District)","04110000","95 G Street",null,"South Boston","MA","02127","617-357-0900","617-357-0949","rharris@bostonrenaissance.org",172681,2706,406,"A","FY17 - 2015 special education determination levels of NTA, NI, or NSI"]
[12,"Superintendent","Jacqueline","Forbes","Bridgewater-Raynham","06250000","166 Mt. Prospect Street",null,"Bridgewater","MA","02324","508-669-6744","508-669-6747","dempsey@bcahs.com",1270970,27006,4051,"B","FY18 - 2016 special education determination levels of NTA, NI, or NSI"]
[13,"Superintendent","Matthew","Malone","Brockton","00440000","43 Crescent Street",null,"Brockton","MA","02301","617-268-1006","617-474-4612","ksteadman@ebrooke.org",4448960,88209,13231,"A","FY17 - 2015 special education determination levels of NTA, NI, or NSI"]
[14,"Superintendent","William","Bourque","Chelsea","00570000","500 Broadway Street","c/o City Hall Room 216","Chelsea","MA","02150","617-445-1515","617-445-9153","ebrown@cityonahill.org",1513024,32006,4801,"A","FY17 - 2015 special education determination levels of NTA, NI, or NSI"]
[15,null,null,"Rege","Chicopee","00610000","180 Broadway Street",null,"Chicopee","MA","01020","774-473-9566","--","kwall@cityonahill.org",2327912,40164,6025,"A","FY17 - 2015 special education determination levels of NTA, NI, or NSI"]
{"$rows_left_out":67}
{"sheet":"DataRecord","index":6,"n_rows":3,"n_cols":53,"rows_kept":3,"cut":false,"hidden":true,"merged":[[0,18,0,29],[0,30,0,41],[0,42,0,52],[0,0,0,14]]}
["Accurances",null,null,null,null,null,null,null,null,null,null,null,null,null,null,null,null,null,"2. M3 FY18 - Amount of Funds for the  M3 project ",null,null,null,null,null,null,null,null,null,null,null,"3. M3 FY18 - Percent of M3 Funds by Spending Category",null,null,null,null,null,null,null,null,null,null,null,"4. M3 FY18 - Spending Category Narrative Description and Rationale\n"]
["School District Name","School Street","City/Town","Zip Code","M3 Identification Year","District’s FY18 Fund Code 240 Allocation Amount","Percentage of funds to be re-directed for the district’s M3 project","Total amount of funds for the district’s M3 project ","Allowable FY18 Fund Code 274 Amount","Projected amount of Fund Code 240 for M3 project","Projected amount Fund Code 274 for M3 project ","Total amount of funds for the district’s M3 project ","School District Name:","Name:","Title:","Phone Number:","E-mail Address:","Short description of the change(s)","ADMINISTRATORS","INSTRUCTIONAL/PROF. STAFF","SUPPORT STAFF","STIPENDS","FRINGE BENEFITS","CONTRACTUAL SERVICES","SUPPLIES AND MATERIALS","TRAVEL","OTHER COSTS","INDIRECT COSTS","EQUIPMENT","M3 FY18 - Total Amount of Funds for the M3 project * ","ADMINISTRATORS","INSTRUCTIONAL/PROF. STAFF","SUPPORT STAFF","STIPENDS","FRINGE BENEFITS","CONTRACTUAL SERVICES","SUPPLIES AND MATERIALS","TRAVEL","OTHER COSTS","INDIRECT COSTS","EQUIPMENT","6. M3 FY18 - Percentage of  240 Entitlement Funds for the M3 project** ","ADMINISTRATORS","INSTRUCTIONAL/PROF. STAFF","SUPPORT STAFF","STIPENDS","FRINGE BENEFITS","CONTRACTUAL SERVICES","SUPPLIES AND MATERIALS","TRAVEL","OTHER COSTS","INDIRECT COSTS","EQUIPMENT"]
[{"$f":"VLOOKUP(Assurances!$E$9,'District List'!A1:K81,5,FALSE)","v":"ORGANIZATION NAME"},{"$f":"Assurances!E10","v":"ADDRESS LINE 1"},{"$f":"Assurances!E11","v":"CITY/TOWN"},{"$f":"Assurances!I11","v":"ZIP CODE"},{"$f":"Assurances!E12","v":"M3 Identification Year"},{"$f":"Assurances!K17","v":{"$error":"#N/A"}},{"$f":"Assurances!K18","v":0},{"$f":"Assurances!K19","v":{"$error":"#N/A"}},{"$f":"Assurances!K21","v":{"$error":"#N/A"}},{"$f":"Assurances!K24","v":0},{"$f":"Assurances!K25","v":0},{"$f":"Assurances!K26","v":0},{"$f":"Assurances!G56","v":0},{"$f":"Assurances!G57","v":0},{"$f":"Assurances!G58","v":0},{"$f":"Assurances!G59","v":0},{"$f":"Assurances!G60","v":0},{"$f":"'Group A - FY18 Budget & Updates'!C7","v":0},{"$f":"'Group A - FY18 Budget & Updates'!F14","v":0},{"$f":"'Group A - FY18 Budget & Updates'!F15","v":0},{"$f":"'Group A - FY18 Budget & Updates'!F16","v":0},{"$f":"'Group A - FY18 Budget & Updates'!F17","v":0},{"$f":"'Group A - FY18 Budget & Updates'!F18","v":0},{"$f":"'Group A - FY18 Budget & Updates'!F19","v":0},{"$f":"'Group A - FY18 Budget & Updates'!F20","v":0},{"$f":"'Group A - FY18 Budget & Updates'!F21","v":0},{"$f":"'Group A - FY18 Budget & Updates'!F22","v":0},{"$f":"'Group A - FY18 Budget & Updates'!F23","v":0},{"$f":"'Group A - FY18 Budget & Updates'!F24","v":0},{"$f":"'Group A - FY18 Budget & Updates'!F26","v":0},{"$f":"'Group A - FY18 Budget & Updates'!G14","v":""},{"$f":"'Group A - FY18 Budget & Updates'!G15","v":""},{"$f":"'Group A - FY18 Budget & Updates'!G16","v":""},{"$f":"'Group A - FY18 Budget & Updates'!G17","v":""},{"$f":"'Group A - FY18 Budget & Updates'!G18","v":""},{"$f":"'Group A - FY18 Budget & Updates'!$G19","v":""},{"$f":"'Group A - FY18 Budget & Updates'!$G20","v":""},{"$f":"'Group A - FY18 Budget & Updates'!G21","v":""},{"$f":"'Group A - FY18 Budget & Updates'!G22","v":""},{"$f":"'Group A - FY18 Budget & Updates'!G23","v":""},{"$f":"'Group A - FY18 Budget & Updates'!G24","v":""},{"$f":"'Group A - FY18 Budget & Updates'!G27","v":""},{"$f":"'Group A - FY18 Budget & Updates'!H14","v":0},{"$f":"'Group A - FY18 Budget & Updates'!H15","v":0},{"$f":"'Group A - FY18 Budget & Updates'!H16","v":0},{"$f":"'Group A - FY18 Budget & Updates'!H17","v":0},{"$f":"'Group A - FY18 Budget & Updates'!H18","v":0},{"$f":"'Group A - FY18 Budget & Updates'!H19","v":0},{"$f":"'Group A - FY18 Budget & Updates'!H20","v":0},{"$f":"'Group A - FY18 Budget & Updates'!H21","v":0},{"$f":"'Group A - FY18 Budget & Updates'!H22","v":0},{"$f":"'Group A - FY18 Budget & Updates'!H23","v":0},{"$f":"'Group A - FY18 Budget & Updates'!H24","v":0}]