{"text_format":"1","workbook":"xlsx","n_sheets":6,"sheets":["Prompt","Instruction","Assurances","Update & FY19 Spending Plan","District List","DataRecord"],"not_rendered":{"charts":0,"images":1,"macros":1,"external_links":0,"defined_names":2,"comments":1,"pivot_tables":0},"unopened":[],"bounds":{"document_bytes":16777216,"sheet_cells":100000,"rows_first":2000,"rows_last":500,"rows_between":2000,"halvings":0,"cell_chars":16384,"cell_head_chars":4096},"cells_cut":0,"cells_raw":0,"read":"whole","date_system":"1900"}

{"sheet":"Prompt","index":0,"n_rows":0,"n_cols":0,"rows_kept":0,"cut":false,"hidden":false,"merged":[]}

{"sheet":"Instruction","index":1,"n_rows":32,"n_cols":3,"rows_kept":32,"cut":false,"hidden":true,"merged":[[31,1,31,10],[8,1,8,10],[11,1,11,10],[12,2,12,10],[30,1,30,10],[29,1,29,10],[17,2,17,10],[24,2,24,10],[27,2,27,10],[18,1,18,10],[26,2,26,10],[23,2,23,10],[1,1,1,9],[21,1,21,10],[22,1,22,10],[3,1,3,2],[19,1,19,10],[5,1,5,10],[16,1,16,10],[7,1,7,10],[13,2,13,10],[6,1,6,10],[14,2,14,10],[9,2,9,10],[2,1,2,10],[4,1,4,10],[25,2,25,10],[20,2,20,10],[15,2,15,10]]}
[]
[null,"Massachusetts Department of Elementary and Secondary Education\nFund Code:240 – FY19 Making Money Matter (M3) Planning"]
[null,"SmartForm Instructions"]
[null,"Overview"]
[null,"In FY19, districts required to participate in Making Money Matter (M3) are those with:\n1. a 2017 special education determination level of Needs Technical Assistance (NTA), Needs Intervention (NI), or Needs Substantial Intervention (NSI); AND\n2. one or more schools serving grades 3-8 with 2017 MCAS English language arts (ELA) and/or mathematics achievement percentiles 1-10, and/or one or more high schools serving grades 9-12 only with 2017 accountability percentiles 1-10. \nThis Excel workbook contains forms that an identified M3 school district must submit to the Massachusetts Department of Elementary and Secondary Education (ESE) when applying for the Fund Code 240 grant opportunity. "]
[null,"For additional information regarding special education determination of district need for technical assistance or intervention please review the 2017 Determination of Need for Special Education Technical Assistance or Intervention on the ESE District and School Accountability webpage."]
[null,"Saving the M3 SmartForm\nOnce the file is open, select ‘Save As’ and indicate where you want to save the file on your computer. The file is currently named 'FY19_M3_District Name_leacode’. Edit the current file name by replacing the words 'District Name' with your district's name and the words ‘leacode’ with your 4-digit LEA code. \n\nFor additional assistance please contact your local district IT support personnel.\n"]
[null,"Assurances"]
[null,"Part I – General Information"]
[null,"1. ","District Information: Select the district name from the drop-down menu. Once the district is selected, the address and M3 identification year will auto-populate."]
[]
[null,"Part II – Re-direction of Funds"]
[null,"2. ","District’s FY19 Fund Code 240 Allocation Amount: This funding amount will auto-populate once the district name is selected in Part I."]
[null,"3. ","Percentage of funds to be re-directed for the district’s M3 project: Enter a percentage between 2% - 4%, or more if determined by the district. "]
[null,"4. ","Total amount of funds for the district’s M3 project: This funding amount will auto-calculate once step 3 is complete."]
[null,null,"Important Note: The optional use of some funds available through discretionary grant Fund Code 274 for M3 activities to offset the use of Fund Code 240 funds that was available in prior years is not available for FY19. All funds must be identified from the districts’ Fund Code 240 allocation. "]
[null,"Part III – Assurances Statement"]
[null,"5. ","The school district staff member who is responsible for programmatic oversight of the 240 grant should: review the M3 Assurance Statement and enter their name, title, and contact information indicating that they have read and understand the obligations of the district and the purpose and principles of the M3 project, as outlined."]
[null,"M3FY19 Update and Spending Plan"]
[null,"Part IV – M3 Updates"]
{"$rows_left_out":13}
{"sheet":"Assurances","index":2,"n_rows":53,"n_cols":11,"rows_kept":53,"cut":false,"hidden":true,"merged":[[41,1,41,10],[32,2,32,10],[51,6,51,10],[52,6,52,10],[48,4,48,5],[51,4,51,5],[48,1,52,3],[46,2,46,10],[47,1,47,10],[52,4,52,5],[48,6,48,10],[26,2,26,10],[35,2,35,10],[36,2,36,10],[34,2,34,10],[21,1,21,10],[22,1,22,10],[27,2,27,10],[29,2,29,10],[30,2,30,10],[25,2,25,10],[45,2,45,10],[42,2,42,10],[43,2,43,10],[44,2,44,10],[50,6,50,10],[50,4,50,5],[49,4,49,5],[49,6,49,10],[0,1,0,7],[8,1,8,3],[24,2,24,10],[23,2,23,10],[9,1,10,3],[11,1,12,3],[11,4,12,10],[14,1,14,10],[15,1,15,10],[16,1,16,9],[18,1,18,9],[17,1,17,9],[2,1,2,10],[4,1,4,10],[6,1,6,10],[10,4,10,5],[9,4,9,7],[39,2,39,10],[33,2,33,10],[37,2,37,10],[38,2,38,10],[28,2,28,10],[31,1,31,10]]}
[null,"Making Money Matter (M3) – Statement of Assurance Regarding Directed Funds "]
[]
[null,"PART I – GENERAL INFORMATION"]
[]
[null,"In FY19, districts required to participate in Making Money Matter (M3) are those with:\n1. a 2017 special educationdetermination level of Needs Technical Assistance (NTA), Needs Intervention (NI), or Needs Substantial Intervention (NSI); AND\n2. one or more schools serving grades 3-8 with 2017 MCAS English language arts (ELA) and/or mathematics achievement percentiles 1-10, and/or one or more high schools serving grades 9-12 only with 2017 accountability percentiles 1-10. \n"]
[]
[]
[]
["1.","School District Name",null,null,1]
[null,"School District Address: (Street, City/Town, Zip Code)",null,null,{"$f":"VLOOKUP(Assurances!$E$9,'District List'!A1:K36,7,FALSE)","v":"ADDRESS LINE 1"}]
[null,null,null,null,{"$f":"VLOOKUP(Assurances!$E$9,'District List'!A1:K36,9,FALSE)","v":"CITY/TOWN"},null,null,null,{"$f":"VLOOKUP(Assurances!$E$9,'District List'!A1:K36,11,FALSE)","v":"ZIP CODE"}]
[null,"M3 Identification Year:",null,null,{"$f":"VLOOKUP(Assurances!$E$9,'District List'!A1:S36,19,FALSE)","v":"M3 Identification Year"}]
[]
[]
[null,"PART II – RE-DIRECTION OF FUNDS"]
[null,"Identified districts are required to re-direct for targeted use a minimum of 2% to 4% of the total special education entitlement allocation for FY19. Within this range, districts may choose the percentage of funds to re-direct toward appropriate activities selected to create meaningful and sustainable change and accelerate improvement in student outcomes."]
["2.","District’s FY19 Fund Code 240 Allocation Amount",null,null,null,null,null,null,null,null,{"$f":"VLOOKUP(Assurances!$E$9,'District List'!A2:P36,15,FALSE)","v":{"$error":"#N/A"}}]
["3.","Percentage of funds to be re-directed for the district’s M3 project"]
["4.","Total amount of funds for the district’s M3 project ",null,null,null,null,null,null,null,null,{"$f":"ROUND((K17*K18),0)","v":{"$error":"#N/A"}}]
[]
{"$rows_left_out":34}
{"sheet":"Update & FY19 Spending Plan","index":3,"n_rows":29,"n_cols":14,"rows_kept":29,"cut":false,"hidden":true,"merged":[[17,6,17,12],[18,1,18,4],[1,1,1,13],[2,1,2,13],[3,1,3,13],[5,2,5,13],[6,2,6,13],[17,1,17,4],[23,1,23,4],[18,6,18,12],[19,6,19,12],[28,1,28,13],[19,1,19,4],[20,1,20,4],[21,1,21,4],[22,1,22,4],[21,6,21,12],[22,6,22,12],[20,6,20,12],[26,1,26,4],[27,1,27,13],[23,6,23,12],[25,1,25,4],[8,1,8,13],[10,2,10,13],[12,1,12,4],[16,1,16,4],[13,1,13,4],[14,1,14,4],[15,1,15,4],[12,6,12,12],[13,6,13,12],[14,6,14,12],[15,6,15,12],[16,6,16,12]]}
[]
[null,"Making Money Matter (M3) – Updates and Spending Plan \n"]
[null,"The directed fund use is to support the following program improvement activities in FY19:\n 1.       implementing the district M3 action plan (developed through previous 240 funds) and making data-based midcourse corrections, and \n 2.       maintaining the M3 multi-year strategic plan (developed through previous 240 funds) and updating it as needed, in consultation with ESE."]
[null,"PART IV – M3 FY19 Updates"]
[]
[null,"1.","If the district has made a substantive change(s) to the FY19 Action Plan or Multi-year Strategic Plan since the FY18 M3 End of the Year Report, include a short description (2-4 sentences) of the change(s). If the district has not made a substantive change(s) to either plan, enter “N/A.” "]
[]
[]
[null,"PART V – M3 FY19 Spending Plan"]
[]
[null,null,"This is your district's projected M3 FY19 Spending Plan, not a grant budget workbook. The spending plan must align with the Fund Code 240 budget entry in Ed Grants. However, because the spending plan represents only a portion of your district’s current FY19 Fund Code 240 allocation, the spending plan cannot be substituted for the Ed Grants budget entry formlet. ESE anticipates that as districts make data-based midcourse corrections to the FY19 Action Plan, changes in district spending will also occur. For this reason, this spending plan is considered a non-binding estimate."]
[]
[null,"M3 FY19 - Spending Category                                                 ",null,null,null,"2.  M3 FY19 - Amount of Funds for the  M3 project ","3.  M3 FY19 - Spending Category Narrative Description and Rationale\nRequired: In the spaces below, describe the M3 spending category expenditures, providing, for example, information that clearly identifies the individual or group providing a service and/or the rationale for proposing a purchase.",null,null,null,null,null,null,"4.  M3 FY19 - Percent of M3 Funds by Spending Category"]
[null,"ADMINISTRATOR SALARIES",null,null,null,0,null,null,null,null,null,null,null,{"$f":"IF(ISERROR(F14/Assurances!$K$19), \"\",IF(F14/Assurances!$K$19 = 0, \"\",F14/Assurances!$K$19))","v":""}]
[null,"INSTRUCTIONAL/PROF. STAFF SALARIES",null,null,null,0,null,null,null,null,null,null,null,{"$f":"IF(ISERROR(F15/Assurances!$K$19), \"\",IF(F15/Assurances!$K$19 = 0, \"\",F15/Assurances!$K$19))","v":""}]
[null,"SUPPORT STAFF SALARIES",null,null,null,0,null,null,null,null,null,null,null,{"$f":"IF(ISERROR(F16/Assurances!$K$19), \"\",IF(F16/Assurances!$K$19 = 0, \"\",F16/Assurances!$K$19))","v":""}]
[null,"STIPENDS",null,null,null,0,null,null,null,null,null,null,null,{"$f":"IF(ISERROR(F17/Assurances!$K$19), \"\",IF(F17/Assurances!$K$19 = 0, \"\",F17/Assurances!$K$19))","v":""}]
[null,"FRINGE BENEFITS",null,null,null,0,null,null,null,null,null,null,null,{"$f":"IF(ISERROR(F18/Assurances!$K$19), \"\",IF(F18/Assurances!$K$19 = 0, \"\",F18/Assurances!$K$19))","v":""}]
[null,"CONTRACTUAL SERVICES",null,null,null,0,null,null,null,null,null,null,null,{"$f":"IF(ISERROR(F19/Assurances!$K$19), \"\",IF(F19/Assurances!$K$19 = 0, \"\",F19/Assurances!$K$19))","v":""}]
[null,"SUPPLIES AND MATERIALS",null,null,null,0,null,null,null,null,null,null,null,{"$f":"IF(ISERROR(F20/Assurances!$K$19), \"\",IF(F20/Assurances!$K$19 = 0, \"\",F20/Assurances!$K$19))","v":""}]
{"$rows_left_out":10}
{"sheet":"District List","index":4,"n_rows":45,"n_cols":21,"rows_kept":45,"cut":false,"hidden":true,"merged":[]}
[1,"FUNCTION","FIRST NAME","LAST NAME","ORGANIZATION NAME","ORGANIZATION CODE","ADDRESS LINE 1","ADDRESS LINE 2","CITY/TOWN","STATE","ZIP CODE","PHONE","FAX","EMAIL","FY18 240 Entitlement","FY18 274 Final Allocation","15% of FY18 274","FY18 M3 Grouping","M3 Identification Year","Org Type","Grade"]
[2,"Superintendent","Darcy","Fernandes","Athol-Royalston","06150000","1062 Pleasant Street",null,"Athol","MA","01331","978-249-2400","978-249-2402",null,460471,null,null,"A","FY17 - 2015 special education determination levels of NTA, NI, or NSI","Public School District","PK,K,01,02,03,04,05,06,07,08,09,10,11,12"]
[3,"Superintendent","Laura","Perille","Boston","00350000","2300 Washington Street",null,"Roxbury","MA","02119","617-635-9050","617-635-9059",null,17562190,null,null,"A","FY17 - 2015 special education determination levels of NTA, NI, or NSI","Public School District","PK,K,01,02,03,04,05,06,07,08,09,10,11,12"]
[4,"Charter School Leader","Matthew","Holzer","Boston Green Academy Horace Mann Charter School (District)","04110000","20 Warren St.",null,"Brighton","MA","02135","617-635-9860","617-635-9858",null,152894,null,null,"A","FY17 - 2015 special education determination levels of NTA, NI, or NSI","Charter District","06,07,08,09,10,11,12"]
[5,"Superintendent","Kathleen","Smith","Brockton","00440000","43 Crescent Street",null,"Brockton","MA","02301","508-580-7000","508-580-7513",null,4436055,null,null,"A","FY17 - 2015 special education determination levels of NTA, NI, or NSI","Public School District","PK,K,01,02,03,04,05,06,07,08,09,10,11,12"]
[6,"Superintendent","Mary","Bourque","Chelsea","00570000","500 Broadway Street","c/o City Hall Room 216","Chelsea","MA","02150","617-466-4477","617-889-8361",null,1541287,null,null,"A","FY17 - 2015 special education determination levels of NTA, NI, or NSI","Public School District","PK,K,01,02,03,04,05,06,07,08,09,10,11,12"]
[7,"Superintendent","Richard","Rege","Chicopee","00610000","180 Broadway Street",null,"Chicopee","MA","01020","413-594-3410","413-594-3552",null,2350240,null,null,"A","FY17 - 2015 special education determination levels of NTA, NI, or NSI","Public School District","PK,K,01,02,03,04,05,06,07,08,09,10,11,12"]
[8,"Superintendent","Carol","Woodbury","Dennis-Yarmouth","06450000","296 Station Avenue",null,"South Yarmouth","MA","02664","508-398-7600","508-398-7622",null,852789,null,null,"A","FY17 - 2015 special education determination levels of NTA, NI, or NSI","Public School District","PK,K,01,02,03,04,05,06,07,08,09,10,11,12"]
[9,"Superintendent","Matthew","Malone","Fall River","00950000","417 Rock Street",null,"Fall River","MA","02720","508-675-8420","508-675-8462",null,3155890,null,null,"A","FY17 - 2015 special education determination levels of NTA, NI, or NSI","Public School District","PK,K,01,02,03,04,05,06,07,08,09,10,11,12"]
[10,"Superintendent","Andre","Ravenelle","Fitchburg","00970000","376 South Street",null,"Fitchburg","MA","01420","978-345-3200","978-348-2305",null,1560181,null,null,"A","FY17 - 2015 special education determination levels of NTA, NI, or NSI","Public School District","PK,K,01,02,03,04,05,06,07,08,09,10,11,12"]
[11,"Superintendent","Robert","Tremblay","Framingham","01000000","73 Mt. Wayte Avenue","Suite 5","Framingham","MA","01702","508-626-9118","508-877-4240",null,2324238,null,null,"A","FY17 - 2015 special education determination levels of NTA, NI, or NSI","Public School District","PK,K,01,02,03,04,05,06,07,08,09,10,11,12"]
[12,"Superintendent","Mark","Pellegrino","Gardner","01030000","70 Waterford Street",null,"Gardner","MA","01440","978-632-1000","978-632-1164",null,744718,null,null,"A","FY17 - 2015 special education determination levels of NTA, NI, or NSI","Public School District","PK,K,01,02,03,04,05,06,07,08,09,10,11,12"]
[13,"Superintendent","Michael","Sullivan","Gill-Montague","06740000","35 Crocker Avenue",null,"Turners Falls","MA","01376","413-863-9324","413-863-4560",null,364384,null,null,"A","FY17 - 2015 special education determination levels of NTA, NI, or NSI","Public School District","PK,K,01,02,03,04,05,06,07,08,09,10,11,12"]
[14,"Superintendent","Judith","Houle","Greenfield Commonwealth Virtual District","39010000","278 Main St.","Ste. 205","Greenfield","MA","01301","413-475-3879","413-475-3909",null,128768,null,null,"A","FY17 - 2015 special education determination levels of NTA, NI, or NSI","Public School District","K,01,02,03,04,05,06,07,08,09,10,11,12"]
[15,"Superintendent","Margaret","Marotta","Haverhill","01280000","4 Summer Street",null,"Haverhill","MA","01830","978-374-3405","978-373-1535",null,2345703,null,null,"A","FY17 - 2015 special education determination levels of NTA, NI, or NSI","Public School District","PK,K,01,02,03,04,05,06,07,08,09,10,11,12"]
[16,"Superintendent","Stephen","Zrike","Holyoke","01370000","57 Suffolk Street",null,"Holyoke","MA","01040","413-534-2005","413-534-2297",null,1885352,null,null,"A","FY17 - 2015 special education determination levels of NTA, NI, or NSI","Public School District","PK,K,01,02,03,04,05,06,07,08,09,10,11,12"]
[17,"Superintendent","Mary","Bergeron","Lawrence","01490000","237 Essex Street",null,"Lawrence","MA","01840","978-975-5905","978-722-8541",null,3713883,null,null,"A","FY17 - 2015 special education determination levels of NTA, NI, or NSI","Public School District","PK,K,01,02,03,04,05,06,07,08,09,10,11,12"]
[18,"Superintendent","Salah","Khelfaoui","Lowell","01600000","155 Merrimack Street",null,"Lowell","MA","01852","978-674-4320","978-937-7609",null,4124894,null,null,"A","FY17 - 2015 special education determination levels of NTA, NI, or NSI","Public School District","PK,K,01,02,03,04,05,06,07,08,09,10,11,12"]
[19,"Superintendent","Catherine","Latham","Lynn","01630000","100 Bennett St",null,"Lynn","MA","01905","781-593-1680","781-477-7487",null,4301029,null,null,"A","FY17 - 2015 special education determination levels of NTA, NI, or NSI","Public School District","PK,K,01,02,03,04,05,06,07,08,09,10,11,12"]
[20,"Superintendent","Roy","Belson","Medford","01760000","489 Winthrop Street",null,"Medford","MA","02155","781-393-2442","781-393-2322",null,1252818,null,null,"A","FY17 - 2015 special education determination levels of NTA, NI, or NSI","Public School District","PK,K,01,02,03,04,05,06,07,08,09,10,11,12"]
{"$rows_left_out":26}
{"sheet":"DataRecord","index":5,"n_rows":3,"n_cols":49,"rows_kept":3,"cut":false,"hidden":true,"merged":[[0,14,0,25],[0,26,0,36],[0,37,0,47],[0,0,0,10]]}
["Accurances",null,null,null,null,null,null,null,null,null,null,null,null,null,"2. M3 FY18 - Amount of Funds for the  M3 project ",null,null,null,null,null,null,null,null,null,null,null,"3. M3 FY18 - Spending Category Narrative Description and Rationale",null,null,null,null,null,null,null,null,null,null,"4. M3 FY18 - Percent of M3 Funds by Spending Category"]
["School District Name","School Street","City/Town","Zip Code","M3 Identification Year","District’s FY18 Fund Code 240 Allocation Amount","Percentage of funds to be re-directed for the district’s M3 project","Total amount of funds for the district’s M3 project ","School District Name:","Name:","Title:","Phone Number:","E-mail Address:","Short description of the change(s)","ADMINISTRATORS","INSTRUCTIONAL/PROF. STAFF","SUPPORT STAFF","STIPENDS","FRINGE BENEFITS","CONTRACTUAL SERVICES","SUPPLIES AND MATERIALS","TRAVEL","OTHER COSTS","INDIRECT COSTS","EQUIPMENT","5.  M3 FY18 - Total Amount of Funds for the M3 project * ","ADMINISTRATORS","INSTRUCTIONAL/PROF. STAFF","SUPPORT STAFF","STIPENDS","FRINGE BENEFITS","CONTRACTUAL SERVICES","SUPPLIES AND MATERIALS","TRAVEL","OTHER COSTS","INDIRECT COSTS","EQUIPMENT","ADMINISTRATORS","INSTRUCTIONAL/PROF. STAFF","SUPPORT STAFF","STIPENDS","FRINGE BENEFITS","CONTRACTUAL SERVICES","SUPPLIES AND MATERIALS","TRAVEL","OTHER COSTS","INDIRECT COSTS","EQUIPMENT","6.  M3 FY18 - Percentage of  240 Entitlement Funds for the M3 project** "]
[{"$f":"VLOOKUP(Assurances!$E$9,'District List'!A1:K36,5,FALSE)","v":"ORGANIZATION NAME"},{"$f":"Assurances!E10","v":"ADDRESS LINE 1"},{"$f":"Assurances!E11","v":"CITY/TOWN"},{"$f":"Assurances!I11","v":"ZIP CODE"},{"$f":"Assurances!E12","v":"M3 Identification Year"},{"$f":"Assurances!K17","v":{"$error":"#N/A"}},{"$f":"Assurances!K18","v":0},{"$f":"Assurances!K19","v":{"$error":"#N/A"}},{"$f":"Assurances!G49","v":0},{"$f":"Assurances!G50","v":0},{"$f":"Assurances!G51","v":0},{"$f":"Assurances!G52","v":0},{"$f":"Assurances!G53","v":0},{"$f":"'Update & FY19 Spending Plan'!C7","v":0},{"$f":"'Update & FY19 Spending Plan'!F14","v":0},{"$f":"'Update & FY19 Spending Plan'!F15","v":0},{"$f":"'Update & FY19 Spending Plan'!F16","v":0},{"$f":"'Update & FY19 Spending Plan'!F17","v":0},{"$f":"'Update & FY19 Spending Plan'!F18","v":0},{"$f":"'Update & FY19 Spending Plan'!F19","v":0},{"$f":"'Update & FY19 Spending Plan'!F20","v":0},{"$f":"'Update & FY19 Spending Plan'!F21","v":0},{"$f":"'Update & FY19 Spending Plan'!F22","v":0},{"$f":"'Update & FY19 Spending Plan'!F23","v":0},{"$f":"'Update & FY19 Spending Plan'!F24","v":0},{"$f":"'Update & FY19 Spending Plan'!F26","v":0},{"$f":"'Update & FY19 Spending Plan'!G14","v":0},{"$f":"'Update & FY19 Spending Plan'!G15","v":0},{"$f":"'Update & FY19 Spending Plan'!G16","v":0},{"$f":"'Update & FY19 Spending Plan'!G17","v":0},{"$f":"'Update & FY19 Spending Plan'!G18","v":0},{"$f":"'Update & FY19 Spending Plan'!$G19","v":0},{"$f":"'Update & FY19 Spending Plan'!$G20","v":0},{"$f":"'Update & FY19 Spending Plan'!G21","v":0},{"$f":"'Update & FY19 Spending Plan'!G22","v":0},{"$f":"'Update & FY19 Spending Plan'!G23","v":0},{"$f":"'Update & FY19 Spending Plan'!G24","v":0},{"$f":"'Update & FY19 Spending Plan'!N14","v":""},{"$f":"'Update & FY19 Spending Plan'!N15","v":""},{"$f":"'Update & FY19 Spending Plan'!N16","v":""},{"$f":"'Update & FY19 Spending Plan'!N17","v":""},{"$f":"'Update & FY19 Spending Plan'!N18","v":""},{"$f":"'Update & FY19 Spending Plan'!N19","v":""},{"$f":"'Update & FY19 Spending Plan'!N20","v":""},{"$f":"'Update & FY19 Spending Plan'!N21","v":""},{"$f":"'Update & FY19 Spending Plan'!N22","v":""},{"$f":"'Update & FY19 Spending Plan'!N23","v":""},{"$f":"'Update & FY19 Spending Plan'!N24","v":""},{"$f":"'Update & FY19 Spending Plan'!N27","v":""}]