{"text_format":"1","workbook":"xlsx","n_sheets":8,"sheets":["Prompt","PART I General","PART II Data","PART III Calculation","PART IV Consultation","PART V Expenditures","MASTER","District Lookup List"],"not_rendered":{"charts":0,"images":9,"macros":1,"external_links":2,"defined_names":30,"comments":0,"pivot_tables":0},"unopened":[],"bounds":{"document_bytes":16777216,"sheet_cells":100000,"rows_first":2000,"rows_last":500,"rows_between":2000,"halvings":0,"cell_chars":16384,"cell_head_chars":4096},"cells_cut":0,"cells_raw":0,"read":"whole","date_system":"1900"}

{"sheet":"Prompt","index":0,"n_rows":0,"n_cols":0,"rows_kept":0,"cut":false,"hidden":false,"merged":[]}

{"sheet":"PART I General","index":1,"n_rows":36,"n_cols":11,"rows_kept":36,"cut":false,"hidden":true,"merged":[[3,0,3,10],[45,1,45,8],[46,1,46,9],[44,1,44,10],[19,1,19,8],[20,1,20,8],[21,1,21,8],[32,1,33,10],[29,1,29,10],[22,1,22,8],[24,1,24,8],[23,1,23,8],[35,1,35,3],[35,5,35,7],[31,1,31,8],[4,6,4,7],[6,4,6,9],[34,1,34,3],[34,5,34,7],[25,1,25,8],[8,0,8,9],[9,0,9,10],[18,1,18,10],[17,1,17,10],[27,1,27,10],[28,1,28,10],[15,4,15,5],[15,6,15,10],[4,2,4,3],[1,0,1,10],[0,9,0,10],[14,4,14,5],[14,6,14,10],[10,0,11,3],[11,4,11,8],[10,4,10,8],[12,0,15,3],[12,4,12,5],[12,6,12,10],[13,4,13,5],[13,6,13,10],[2,2,2,8],[4,4,4,5],[6,1,6,3]]}
[null,null,null,null,null,null,null,null,null,"FY19 - Fund Code 240"]
[]
["PART I: "]
["Required Record-Keeping and Proportionate Share Calculation form for Parentally-Placed Children With Disabilities Enrolled by Their Parents in Private Schools   34 CFR §§300.130-300.144"]
[null,null,"District LEA Code:",null,{"$f":"VLOOKUP('PART I General'!$E$7,'District Lookup List'!A1:S450,6,FALSE)","v":"ORGANIZATION CODE"},null,"Date Submitted:"]
[null,null,null,null,".",null,null,null,"."]
[null,"School District Name:",null,null,1]
[]
["GENERAL INFORMATION"]
["This form documents the calculation of \"proportionate share\" and the use of Federal Special Education Entitlement funds (fund code 240) to serve one or more eligible parentally placed private school students and home school students. This report must be completed and provided to the Department annually. A copy should be kept at the district. The report is also designed to be used to provide information to private schools or parents on the calculation and spending of the proportionate share. The line items identified on this report (in Part V) must be aligned with line items submitted in the Fund Code 240 application."]
["School District Address:(Street, City/Town, Zip Code)",null,null,null,{"$f":"VLOOKUP('PART I General'!$E$7,'District Lookup List'!A1:S450,8,FALSE)","v":"ADDRESS LINE 1"}]
[null,null,null,null,{"$f":"VLOOKUP('PART I General'!$E$7,'District Lookup List'!A1:S450,10,FALSE)","v":"CITY/TOWN"},null,null,null,null,{"$f":"VLOOKUP('PART I General'!$E$7,'District Lookup List'!A1:S450,11,FALSE)","v":"STATE"},{"$f":"VLOOKUP('PART I General'!$E$7,'District Lookup List'!A1:S450,12,FALSE)","v":"ZIP CODE"}]
["Name of person to contact regarding this report: ",null,null,null,"Name:"]
[null,null,null,null,"Title:"]
[null,null,null,null,"Phone Number:"]
{"$rows_left_out":22}
{"sheet":"PART II Data","index":2,"n_rows":22,"n_cols":12,"rows_kept":22,"cut":false,"hidden":true,"merged":[[1,0,1,9],[2,0,2,9],[15,8,15,10],[3,1,3,12],[4,8,4,10],[4,11,4,12],[8,1,8,7],[8,11,8,12],[10,1,10,7],[11,1,11,7],[7,11,7,12],[5,8,5,10],[5,11,5,12],[16,11,16,12],[17,8,17,10],[17,11,17,12],[5,0,6,7],[7,1,7,7],[0,0,0,6],[27,1,27,10],[22,1,22,7],[19,1,19,7],[19,11,19,12],[20,1,20,7],[20,11,20,12],[21,1,21,7],[21,11,21,12],[18,11,18,12],[6,11,6,12],[15,0,15,7],[17,0,18,7],[6,8,6,10],[15,11,15,12],[16,8,16,10]]}
["PART II:"]
["Required Record-Keeping and Child Count"]
[" This data is necessary for the Department to maintain records of Eligible Private School Students over time."]
[]
[null,null,null,null,null,null,null,null,"Eligible Private School Students",null,null,"Eligible Private School Students"]
["(Section 1) Annual count of the number of parentally-placed private school children with disabilities (34 CFR § 300.133(c))",null,null,null,null,null,null,null,"who live in your town.",null,null,"who do not live in your town."]
[null,null,null,null,null,null,null,null,"(Resident)",null,null,"(Non-Resident)"]
[null," Child count is conducted on any date between October 1 and December 1, inclusive, of each year.",null,null,null,null,null,null,"A. Attending private school within your district (eligible for special education)","B. Home schooled within your district (eligible for special education)",null,"C. Attending private school within your district (eligible for special education)"]
["Line 1"," # of all currently eligible parentally-placed private school students ages 3-21 attending an elementary or secondary school or home schooled in your district. *Keeping in mind a student remains eligible for 3 years following identification. *Includes all students found eligible, regardless of  whether they receive(d) special education services."]
[]
["Line 2","Total # of all currently eligible parentally-placed private school students ages 3-21 attending an elementary or secondary school or home schooled in your district for proportionate share calculation.  (auto calculation from cells in Line 1 above)",null,null,null,null,null,null,{"$f":"IF(I9+J9+L9=0, \"0\", I9+J9+L9)","v":"0"}]
["Line 3","# of public school district students with IEPs (SWIEPs) ages 3-21. (SWIEPs for your public school district for the 2017-2018 school year)"]
[]
[]
[]
{"$rows_left_out":8}
{"sheet":"PART III Calculation","index":3,"n_rows":7,"n_cols":9,"rows_kept":7,"cut":false,"hidden":true,"merged":[[0,0,0,3],[28,1,28,10],[5,1,5,7],[6,1,6,7],[1,0,1,8],[2,1,2,7],[3,1,3,7],[4,1,4,7]]}
["PART III:"]
["Calculating Proportionate Amount  (34 CFR § 300.133)"]
["A.","Total # of all currently eligible parentally-placed private school students ages 3-21 attending an elementary or secondary school or home schooled in your district. (auto fill) ",null,null,null,null,null,null,{"$f":"'PART II Data'!I11","v":"0"}]
["B.","Total of all eligible students (Using  data from data Part II, Section 1 Child Count, Line 2 plus Line 3) (auto fill)  ",null,null,null,null,null,null,{"$f":"'PART II Data'!I11+'PART II Data'!I12","v":0}]
["C.","Number in A divided by the number in B is the proportion that private school students represent of all eligible students. The result will be expressed as a percentage. (auto fill)",null,null,null,null,null,null,{"$f":"I3/I4","v":{"$error":"#DIV/0!"}}]
["D.","District's special education IDEA entitlement for FY19 (Fund Code 240). ",null,null,null,null,null,null,{"$f":"VLOOKUP('PART I General'!$E$7,'District Lookup List'!A1:S450,17,FALSE)","v":"FY19 Entitlement Amount"}]
["E.","This is the proportionate share of federal funds that the district is required to spend on services to eligible students who attend private schools and/or home-schools located in your district during the next fiscal year. (Line C multiplied by Line D)",null,null,null,null,null,null,{"$f":"IF(ISERROR(I6*I5), \"\", (I6*I5))","v":""}]

{"sheet":"PART IV Consultation","index":4,"n_rows":27,"n_cols":9,"rows_kept":27,"cut":false,"hidden":true,"merged":[[0,0,0,3],[25,0,25,9],[22,0,22,7],[24,0,24,1],[26,0,26,9],[23,0,23,7],[10,0,13,9],[1,0,1,9],[15,0,15,9],[16,0,20,9],[2,0,2,9],[3,0,7,9],[9,0,9,9]]}
["PART IV:"]
["Consultation  (34 CFR § 300.134)"]
["1. Previous date(s) or planned upcoming dates of timely and meaningful consultation with private school representatives and representatives of parents of parentally-placed private school children with disabilities inclusive of home school representatives:\n\n"]
[]
[]
[]
[]
[]
[]
["2. List private school representatives and representatives of parents of parentally-placed private school children with disabilities inclusive of home school representatives participating in timely and meaningful consultation meetings:"]
[]
[]
[]
[]
[]
{"$rows_left_out":13}
{"sheet":"PART V Expenditures","index":5,"n_rows":27,"n_cols":5,"rows_kept":27,"cut":false,"hidden":true,"merged":[[26,1,26,9],[24,1,25,9],[21,2,21,3],[21,4,21,9],[22,2,22,3],[22,4,22,9],[23,0,23,9],[18,2,18,3],[18,4,18,9],[19,2,19,3],[19,4,19,9],[20,2,20,3],[20,4,20,9],[15,2,15,3],[15,4,15,9],[16,2,16,3],[16,4,16,9],[17,2,17,3],[17,4,17,9],[12,2,12,3],[12,4,12,9],[13,2,13,3],[13,4,13,9],[14,2,14,3],[14,4,14,9],[0,0,0,3],[11,0,11,1],[11,2,11,3],[11,4,11,9],[1,0,1,9],[7,1,7,9],[8,1,8,9],[9,1,9,9],[6,1,6,9],[5,1,5,9],[3,0,4,9],[10,1,10,9]]}
["PART V:"]
["Expenditures (34 CFR §300.133)"]
[]
["Planned expenditures for FY19 to meet the calculated proportionate share amount for parentally-placed private school and home school children ages 3-21  attending school in your district."]
[]
["â","Note: Do not list your entire 240 budget below, only include expenses directly related to meeting your proportionate share obligation from your federal IDEA funds."]
["â","The explanation section should provide sufficient detail to effectively document the proportionate share services (direct or indirect), but should not provide individual student detail; because this form is a public document and will be made available to private schools or parents upon request."]
["â","Child find activities and evaluation activities cannot be included and do not count towards meeting your proportionate share. 300.131(d) "]
["â","The line item amounts identified below indicate the type of service or materials provided and the type of line item is aligned with the budget application for IDEA funds (Fund Code 240).  Any identified amounts below must be equal to or less than the identified amount in the corresponding line item for the budget submitted by the school district in its application for funds under Fund Code 240 in this fiscal year."]
["â","Line items that may not be attributed to proportionate share services are shaded and no entries should be included in those line items for private school student proportionate share services."]
["â","For more information on expenditures refer to: Equitable services determined (34 CFR § 300.137 ); Equitable services provided (34 CFR § 300.138); Location of services and transportation (34 CFR § 300.139); Use of personnel (34 CFR § 300.142); Separate classes prohibited (34 CFR § 300.143); and Property, equipment, and supplies (34 CFR § 300.144). "]
["LINE ITEM",null,"AMOUNT -                      use whole numbers",null,"EXPLANATION"]
["1.","Administrators"]
["2.","Instructional/ Professional Staff"]
["3.","Support Staff"]
{"$rows_left_out":13}
{"sheet":"MASTER","index":6,"n_rows":2,"n_cols":63,"rows_kept":2,"cut":false,"hidden":true,"merged":[]}
["District LEA Code:","Date Submitted","School District Name:","ADDRESS LINE 1","CITY/TOWN","STATE","ZIP CODE","Name:","Title:","Phone Number:","E-mail Address:","NO, our district is a charter school, virtual school, or career/vocational technical school. A, B and C","YES, our district has private school(s) in our geographic boundaries.D.","YES, our district has approved home school students in our geographic boundaries. E.","NO, our district does not have private school(s) in our geographic boundaries. F.","NO, our district does not have approved home school students in our geographic boundaries. G."," # of all currently eligible parentally-placed private school students ages 3-21 attending an elementary or secondary school or home schooled in your district. *Keeping in mind a student remains eligible for 3 years following identification. *Includes all students found eligible, regardless of  whether they receive(d) special education services.\nA. Attending private school within your district (eligible for special education) \n(Resident)"," # of all currently eligible parentally-placed private school students ages 3-21 attending an elementary or secondary school or home schooled in your district. *Keeping in mind a student remains eligible for 3 years following identification. *Includes all students found eligible, regardless of  whether they receive(d) special education services.  \nB. Home schooled within your district (eligible for special education)\n(Resident)"," # of all currently eligible parentally-placed private school students ages 3-21 attending an elementary or secondary school or home schooled in your district. *Keeping in mind a student remains eligible for 3 years following identification. *Includes all students found eligible, regardless of  whether they receive(d) special education services. C. Attending private school within your district (eligible for special Education)\n(Non-Resisent)","Total # of all currently eligible parentally-placed private school students ages 3-21 attending an elementary or secondary school or home schooled in your district for proportionate share calculation. \nA. Attending private school within your district (eligible for special education) \n(Resident)","# of public school district students with IEPs (SWIEPs) ages 3-21. (SWIEPs for your public school district for the 2017-2018 school year)\nA. Attending private school within your district (eligible for special education) \n(Resident)","Total # of parentally-placed private school students ages 3-21 evaluated by your district during 2017-2018 school year  (34 CFR § 300.132(c)(1))\nA. Attending private school within your district\n(Resident)","Total # of parentally-placed private school students ages 3-21 evaluated by your district during 2017-2018 school year  (34 CFR § 300.132(c)(1))\nB. Home schooled within your district\n(Resident)","Total # of parentally-placed private school students ages 3-21 evaluated by your district during 2017-2018 school year  (34 CFR § 300.132(c)(1))\nC. Attending private school in another district\n(Resident)","Total # of parentally-placed private school students ages 3-21 evaluated by your district during 2017-2018 school year  (34 CFR § 300.132(c)(1))\nD. Attending private school within your district\n(Non-Resident)","Total # of parentally-placed private school students ages 3-21 found eligible during the school year 2017-2018 (may include evaluations you conducted, or, for non-residents, evaluations provided by the district of residence and accepted as evidence of eligibility.)  (34 CFR § 300.132(c)(2))   \nA. Attending private school within your district\n(Resident)","Total # of parentally-placed private school students ages 3-21 found eligible during the school year 2017-2018 (may include evaluations you conducted, or, for non-residents, evaluations provided by the district of residence and accepted as evidence of eligibility.)  (34 CFR § 300.132(c)(2))  \n B. Home schooled within your district\n(Resident)","Total # of parentally-placed private school students ages 3-21 found eligible during the school year 2017-2018 (may include evaluations you conducted, or, for non-residents, evaluations provided by the district of residence and accepted as evidence of eligibility.)  (34 CFR § 300.132(c)(2))   \nC. Attending private school in another district\n(Resident)","Total # of parentally-placed private school students ages 3-21 found eligible during the school year 2017-2018 (may include evaluations you conducted, or, for non-residents, evaluations provided by the district of residence and accepted as evidence of eligibility.)  (34 CFR § 300.132(c)(2))   \nD. Attending private school within your district \n(Non-Resident)","Total # eligible parentally-placed private school students ages 3-21 served by your district during the school year 2017-2018 (34 CFR § 300.132(c)(3))\nA. Attending private school within your district\n(Resident)","Total # eligible parentally-placed private school students ages 3-21 served by your district during the school year 2017-2018 (34 CFR § 300.132(c)(3))\nB. Home schooled within your district\n(Resident)","Total # eligible parentally-placed private school students ages 3-21 served by your district during the school year 2017-2018 (34 CFR § 300.132(c)(3))\nC. Attending private school in another district\n(Resident)","Total # eligible parentally-placed private school students ages 3-21 served by your district during the school year 2017-2018 (34 CFR § 300.132(c)(3))\nD. Attending private school within your district\n(Non-Resident) ","Total # of all currently eligible parentally-placed private school students ages 3-21 attending an elementary or secondary school or home schooled in your district. (auto fill) ","Total of all eligible students (Using  data from data Part II, Section 1 Child Count, Line 2 plus Line 3) (auto fill) ","Number in A divided by the number in B is the proportion that private school students represent of all eligible students. The result will be expressed as a percentage. (auto fill)","District's special education IDEA entitlement for FY19 (Fund Code 240).","This is the proportionate share of federal funds that the district is required to spend on services to eligible students who attend private schools and/or home-schools located in your district during the next fiscal year. (Line C multiplied by Line D)","1. Previous date(s) or planned upcoming dates of timely and meaningful consultation with private school representatives and representatives of parents of parentally-placed private school children with disabilities inclusive of home school representatives:","2. List private school representatives and representatives of parents of parentally-placed private school children with disabilities inclusive of home school representatives participating in timely and meaningful consultation meetings:","3. Consultation (34 CFR §300.134) must include a discussion of “child find” (34 CFR §300.134 (a)); the determination of proportionate share of funds (34 CFR §300.134 (b)); a discussion of consultation process (34 CFR §300.134 (c)), the provision of special education and related services (a discussion of possible services and how such services will be decided and delivered)  (34 CFR §§300.134 (d));  whether directly or through a contract. Following consultation, this space should briefly explain what services were decided upon and how such services will be provided.","4. Assurance:  For each timely and meaningful consultation during the year, our district will obtain signed written affirmations. Copies will be kept at the district for review by the DESE Public School Monitoring team. (34 CFR §300.135(a)) . \nYES","4. Assurance:  For each timely and meaningful consultation during the year, our district will obtain signed written affirmations. Copies will be kept at the district for review by the DESE Public School Monitoring team. (34 CFR §300.135(a)) .\nNO","Instructional/ Professional Staff\nAmount","Instructional/ Direct Service Staff \nDetails","Non-Instructional/ Support Staff Amount","Non-Instructional/ Support Staff Details","Fringe Benefits \nAmount","Fringe Benefits \nDetails","Contractual Services \nAmount","Contractual Services \nDetails","Supplies \nAmount","Supplies Details","Travel \nAmount","Travel \nDetails","Other \nAmount","Other Details","Equipment \nAmount","Equipment \nDetails","FY19 FUND CODE 240 PLANNED PROPORTIONATE SHARE EXPENDITURE","Full Name","Title","Date"]
[{"$f":"'PART I General'!E5","v":"ORGANIZATION CODE"},{"$f":"'PART I General'!I5","v":"00:00:00"},{"$f":"VLOOKUP('PART I General'!$E$7,'District Lookup List'!A1:K77,5,FALSE)","v":"ORGANIZATION NAME"},{"$f":"'PART I General'!E11","v":"ADDRESS LINE 1"},{"$f":"'PART I General'!E12","v":"CITY/TOWN"},{"$f":"'PART I General'!J12","v":"STATE"},{"$f":"'PART I General'!K12","v":"ZIP CODE"},{"$f":"'PART I General'!G13","v":0},{"$f":"'PART I General'!G14","v":0},{"$f":"'PART I General'!G15","v":0},{"$f":"'PART I General'!G16","v":0},null,null,null,null,null,{"$f":"'PART II Data'!I9","v":0},{"$f":"'PART II Data'!J9","v":0},{"$f":"'PART II Data'!L9","v":0},{"$f":"'PART II Data'!I11","v":"0"},{"$f":"'PART II Data'!I12","v":0},{"$f":"'PART II Data'!I20","v":0},{"$f":"'PART II Data'!J20","v":0},{"$f":"'PART II Data'!K20","v":0},{"$f":"'PART II Data'!L20","v":0},{"$f":"'PART II Data'!I21","v":0},{"$f":"'PART II Data'!J21","v":0},{"$f":"'PART II Data'!K21","v":0},{"$f":"'PART II Data'!L21","v":0},{"$f":"'PART II Data'!I22","v":0},{"$f":"'PART II Data'!J22","v":0},{"$f":"'PART II Data'!K22","v":0},{"$f":"'PART II Data'!L22","v":0},{"$f":"'PART III Calculation'!I3","v":"0"},{"$f":"'PART III Calculation'!I4","v":0},{"$f":"'PART III Calculation'!I5","v":{"$error":"#DIV/0!"}},{"$f":"'PART III Calculation'!I6","v":"FY19 Entitlement Amount"},{"$f":"'PART III Calculation'!I7","v":""},{"$f":"'PART IV Consultation'!A4","v":0},{"$f":"'PART IV Consultation'!A11","v":0},{"$f":"'PART IV Consultation'!A17","v":0},null,"NO",{"$f":"'PART V Expenditures'!C14","v":0},{"$f":"'PART V Expenditures'!E14","v":0},{"$f":"'PART V Expenditures'!C15","v":0},{"$f":"'PART V Expenditures'!E15","v":0},{"$f":"'PART V Expenditures'!C16","v":0},{"$f":"'PART V Expenditures'!E16","v":0},{"$f":"'PART V Expenditures'!C17","v":0},{"$f":"'PART V Expenditures'!E17","v":0},{"$f":"'PART V Expenditures'!C18","v":0},{"$f":"'PART V Expenditures'!E18","v":0},{"$f":"'PART V Expenditures'!C19","v":0},{"$f":"'PART V Expenditures'!E19","v":0},{"$f":"'PART V Expenditures'!C20","v":0},{"$f":"'PART V Expenditures'!E20","v":0},{"$f":"'PART V Expenditures'!C22","v":0},{"$f":"'PART V Expenditures'!E22","v":0},{"$f":"'PART V Expenditures'!C23","v":0},{"$f":"FullName","v":0},{"$f":"Title","v":0},{"$f":"SignDate","v":"00:00:00"}]

{"sheet":"District Lookup List","index":7,"n_rows":450,"n_cols":17,"rows_kept":450,"cut":false,"hidden":true,"merged":[]}
[1,"FUNCTION","FIRST NAME","LAST NAME","ORGANIZATION NAME","ORGANIZATION CODE","ORGGANIZATION TYPE","ADDRESS LINE 1","ADDRESS LINE 2","CITY/TOWN","STATE","ZIP CODE","PHONE","FAX","EMAIL","Grade","FY19 Entitlement Amount"]
[2,"Charter School Leader","Brian","Haas","Abby Kelley Foster Charter Public (District)","04450000","Charter District","10 New Bond Street",null,"Worcester","MA","01606","508-854-8400","508-854-8484",null,"K,01,02,03,04,05,06,07,08,09,10,11,12",303341]
[3,"Superintendent","Peter","Schafer","Abington","00010000","Public School District","1071 Washington St.",null,"Abington","MA","02351","781-982-2150","781-982-2157",null,"PK,K,01,02,03,04,05,06,07,08,09,10,11,12",529393]
[4,"Charter School Leader","Spencer","Blasdale","Academy Of the Pacific Rim Charter Public (District)","04120000","Charter District","1 Westinghouse Plaza",null,"Hyde Park","MA","02136","617-361-0050","617-361-0045",null,"05,06,07,08,09,10,11,12",106901]
[5,"Superintendent","Peter","Light","Acton-Boxborough","06000000","Public School District","16 Charter Rd",null,"Acton","MA","01720","978-264-4700","978-264-3340",null,"PK,K,01,02,03,04,05,06,07,08,09,10,11,12",1264626]
[6,"Superintendent","Paula","Bailey","Acushnet","00030000","Public School District","708 Middle Road","Suite 1","Acushnet","MA","02743","508-998-0260","508-998-0262",null,"PK,K,01,02,03,04,05,06,07,08",263848]
[7,"Superintendent","John","Vosburgh","Adams-Cheshire","06030000","Public School District","191 Church St",null,"Cheshire","MA","01225","413-743-2939","413-743-4135",null,"PK,K,01,02,03,04,05,06,07,08,09,10,11,12",386122]
[8,"Charter School Leader","Anders","Lewis","Advanced Math and Science Academy Charter (District)","04300000","Charter District","201 Forest Street",null,"Marlborough","MA","01752","508-597-2400","508-597-2499",null,"06,07,08,09,10,11,12",168439]
[9,"Superintendent","Steven","Lemanski","Agawam","00050000","Public School District","1305 Springfield St","Suite 1","Feeding Hills","MA","01030","413-821-0548","413-789-1835",null,"PK,K,01,02,03,04,05,06,07,08,09,10,11,12",1133536]
[10,"Charter School Leader","Will","Gardner","Alma del Mar Charter School (District)","04090000","Charter District","26 Madeira Avenue",null,"New Bedford","MA","02746","508-542-7153","877-719-8773",null,"K,01,02,03,04,05,06,07,08",105014]
[11,"Superintendent","Gary","Reese","Amesbury","00070000","Public School District","5 Highland Street",null,"Amesbury","MA","01913","978-388-0507","978-388-8315",null,"PK,K,01,02,03,04,05,06,07,08,09,10,11,12",606080]
[12,"Superintendent","Michael","Morris","Amherst","00080000","Public School District","170 Chestnut Street",null,"Amherst","MA","01002","413-362-1810","413-549-6108",null,"PK,K,01,02,03,04,05,06",370430]
[13,"Superintendent","Michael","Morris","Amherst-Pelham","06050000","Public School District","170 Chestnut Street",null,"Amherst","MA","01002","413-362-1810","413-549-6108",null,"07,08,09,10,11,12",421252]
[14,"Superintendent","Sheldon","Berman","Andover","00090000","Public School District","36 Bartlet Street",null,"Andover","MA","01810","978-623-8501","978-623-8505",null,"PK,K,01,02,03,04,05,06,07,08,09,10,11,12",1392638]
[15,"Charter School Leader","Kristen","Pavao","Argosy Collegiate Charter School (District)","35090000","Charter District","263 Hamlet Street",null,"Fall River","MA","02724","508-567-4725","774-365-4383",null,"06,07,08,09",115114]
{"$rows_left_out":435}