{"text_format":"1","workbook":"xlsx","n_sheets":24,"sheets":["READ ME 1ST","1. Signature Page","2. Contact Information ","3. Allocations and Flexing","4. Private School Services","5. Districtwide Strategies","data","ForImport","6. Title I, A & D Narrative","7. Title I, A Reservations","8. Title I, A School Funding","9. Title I, Part A Budget ","10. Title II, Part A Narrative","11. Title II, Part A Budget","12. Title III, Part A Narrative","13. Title III, Part A Budget","14. Title IV, Part A Narrative","15. Title IV, Part A Budget","16. Schedule A","Dropdowns","DataLookupValues","dataDistrictList","LiaisonList","dataSchoolInfo"],"not_rendered":{"charts":0,"images":9,"macros":1,"external_links":2,"defined_names":193,"comments":0,"pivot_tables":0},"unopened":[],"bounds":{"document_bytes":16777216,"sheet_cells":100000,"rows_first":2000,"rows_last":500,"rows_between":2000,"halvings":0,"cell_chars":16384,"cell_head_chars":4096},"cells_cut":0,"cells_raw":0,"read":"whole","date_system":"1900"}

{"sheet":"READ ME 1ST","index":0,"n_rows":31,"n_cols":2,"rows_kept":31,"cut":false,"hidden":false,"merged":[[14,1,14,12],[15,1,15,12],[3,1,3,12],[1,1,1,11],[2,1,2,11],[4,1,4,11],[5,1,13,12],[57,2,57,4],[40,1,40,4],[41,2,41,4],[43,2,43,4],[51,1,51,4],[47,2,47,4],[55,2,55,4],[56,2,56,4],[54,2,54,4],[17,1,24,12],[16,1,16,12],[52,2,52,4],[53,2,53,4],[27,1,27,12],[28,1,28,12],[30,1,30,12],[29,1,29,12],[31,1,31,11],[32,1,32,11],[26,1,26,12],[39,1,39,4],[35,2,35,4],[36,2,36,4],[37,2,37,4],[25,1,25,12]]}
[]
[null,"Massachusetts Department of Elementary & Secondary Education"]
[null,"FY19 Consolidated Federal ESEA Programs Application Workbook"]
[null,"Overview  "]
[null,"This Excel workbook contains the FY18 Title I grant application forms that a school district must submit to the Massachusetts Department of Elementary and Secondary Education. Information about the FY18 Title I grant can be found at http://www.doe.mass.edu/grants/."]
[null,"\n  The consolidated application allows LEAs (districts and other eligible entities, referred to in this application collectively as \n  districts) to apply for funding for any combination of the following federal programs of the Elementary and Secondary \n  Education Act (ESEA), as most recently reauthorized by the Every Student Succeeds Act (2015) (ESSA):\n\n                                                                             • Title I, Parts A & D (Fund Code 305)\n                                                                             • Title II, Part A  (Fund Code 140)\n                                                                             • Title III, Part A (Fund Code 180 only)\n                                                                             • Title IV, Part A (Fund Code 309)                                     \n\nYou may notice that some requirements of past applications have been omitted or are requested in a different way, which is permitted by ESSA to reduce burden to districts when applying for grants.  However, all districts are still required to meet all statutory requirements for any program for which they receive funds.  If you have questions about these requirements, please refer to our Federal Grant Programs web pages and/or contact the Federal Programs Specialist assigned to your district for guidance.\n\n"]
[]
[]
[]
[]
[]
[]
[]
[]
[null,"First Step:  Saving the File"]
[null,"Save this file to your computer (Important: ensure macros are enabled).  Rename the file by replacing the words 'leacode' in the file name with your 4-digit district code. For example, Abington (0001) would rename the file as 'FY19CA-0001.xlsm'. Do not change the filename except for your district's 4-digit code. Users of Macintosh computers must save as a macro-enabled file (with an .xlsm extension) for the workbook to function properly."]
[null,"Tips for Completing the Consolidated Application"]
[null,"  \n Workflow and printing:  \n    • Complete each tab that applies to your district in the order that they are numbered unless instructed otherwise.  If one of the \n      numbered tabs does not apply to  your district, skip to the next set of  numbered tab (for example, skip Tab 12. \"Title III, Part A\n      Narrative\" and Tab. 13. Title III, Part A Budget if your district does not receive an allocation for Title III and go on to Tab 14).  Pay\n      particular attention to completing Tab 5 (Districtwide Strategies) prior to working on any Title narrative tabs.  Those tabs will \n      automatically import information from Tab 5 to help you complete the narrative questions.\n\n    • Complete the steps on each tab in the order that they are numbered (for example, on Tab 7, begin with Step 7.1, then complete 7.2).\n      Note that some steps may not be required for your district and may be skipped.\n\n   •  Budget worksheets appearing after the tabs for each Title narrative must be completed for each grant.  They mirror the budget entry \n     page in EdGrants with the addition of checkboxes to indicate whether funds are used for private school services and for \n     Title II, Part A and Title IV, Part A, to indicate whether funds were flexed.  These budget worksheets are mandatory, in addition to \n     entering budget information in EdGrants. \n\n   •  This workbook is structured to be used in electronic format.  However, you can print a copy using Excel's print preview functions \n       to set the appearance and paper orientation to best fit your completed application.  \n   \n  Color-coding and cell features:\n   •  Those cells that appear light yellow require districts to input information.  Text may be pasted into these cells as long as\n       the source of the information has no excel formulas.  \n\n   •  Those cells that appear light gray will automatically populate based on information your district supplies on the application or from\n       preloaded data already reported to the Department of Elementary and Secondary Education (DESE) (for example, SIMS data).   \n       Do not cut and paste information from other pages or sources into gray cells!  \n\n   •  Those cells that appear in light orange offer a dropdown menu from which districts can choose a supplied response or \n       \"other,\" which requires districts to supply a brief description where indicated.   Do not cut and paste information from other pages \n       or sources into orange cells!  \n\n   •  Throughout the tabs of this application you will find instruction boxes (gray), tip boxes (pink) to help avoid common mistakes, \n       and resource boxes (tan) that include links to materials outside the application with more detailed, grant-related information.\n"]
[]
[]
[]
[]
[]
[]
[]
[null,"\n   •  If boxes/cells containing text in some parts of the application appear to be cut off, please enlarge the \"view\" of that page using your \n      Zoom feature (usually a slide bar appearing in the lower corner of your Excel screen), which should solve the problem.  100% is best \n      in most cases.\n\n Last Steps:\n   •  Signature Page (Tab 1) :  Once the application has been completed, print, sign, date (using date of submission), scan and upload \n      a signed copy of the signature page with each of the district's EdGrants submissions (once for each fund code).   We cannot approve\n      any grant without an uploaded, signed, and properly dated signature page!\n\n   •  All tabs related to programs for which a district has received an allocation must be complete and budgets submitted in \n      EdGrants for each of those fund codes in order for an application to be substantially approvable and ready for review.  No partial \n      submissions will be accepted.\n \n   •  A completed consolidated workbook should be submitted only once, as an attachment in EdGrants with each district's Title I\n      submission. It does not need to be submitted with any other ESSA entitlement grant EdGrants submission.  If your district does not \n      receive a Title I allocation, please contact your district liaison for submission instructions."]
[null,"Submit the FY19 Consolidated Application Workbook with Title I via EdGrants Front Office web page"]
[null,"\nEdGrants Submission Information:\nMost districts/applicants already have designated control users in EdGrants: Front Office, who have access to submit grant applications as well as to make payment requests.  Each district/applicant needs to ensure that it has an authorized control user prior to grant submission.  If a district waits until its grant submission is ready to submit before inquiring about a new user name/login, grant submissions may be delayed several business days waiting for control user set-up.  Please review the EdGrants Security Controls documents and/or contact DESE's Grants Management Office, 781-338-6595 or EdGrants@doe.mass.edu, regarding assigning your EdGrants: Front Office control users.  "]
[null,"The district/applicant control users will register each grant opportunity, create each grant project and enter contact information, budget, and required attachments in EdGrants. All districts' business offices have been contacted with information regarding training.  If you are unsure of who in your office is \na control user, please contact your business office.  The Consolidation Application Workbook must be uploaded with your Title I budget in EdGrants.  If you do not receive a Title I allocation, please contact the DESE liaison for your district for submission instructions."]
[null,"Applications are due by September 28, 2018. "]
[null,"NOTE ON SUBMISSION TIMELINE: \n    • Districts that submit near the due date should expect to wait a few weeks for review. Districts that submit early may see a shorter turnaround.   \n    • The start date for each grant is the date on which the district submits substantially approvable information and budget for that grant.  For example, \n       if the completed consolidated ESSA application is submitted on August 15 and all grant information but that for Title III, Part A is substantially \n       approvable, the start date for all grants but Title III, Part A will be August 15.  The start date for Title III, Part A will be the date on which any \n       deficiency for that grant has been cured and it becomes substantially approvable.  However, no grant funds for any ESSA grant will be issued \n       until all of the grants contained within this consolidated ESSA application have been approved.  \n    •  Districts that fail to file by September 28, 2018 will receive last priority for review.    \n    •  Expenses incurred prior to approval of a district's consolidated application and start date(s) are not payable with grant funds!\n    •  Responding quickly to requests for information can result in an earlier approval of your grant application.  \n    •  Grant payment notices will be available in EdGrants after the grant application has been approved and the initial payment is processed.\n"]

{"sheet":"1. Signature Page","index":1,"n_rows":41,"n_cols":18,"rows_kept":41,"cut":false,"hidden":false,"merged":[[40,2,40,20],[32,17,32,20],[29,17,29,20],[30,17,31,20],[1,2,1,9],[1,18,1,20],[2,2,3,20],[5,2,5,20],[6,2,6,20],[12,6,12,12],[11,6,11,12],[22,6,22,11],[22,13,22,14],[22,15,22,19],[18,2,19,20],[21,2,21,5],[21,6,21,11],[21,13,21,14],[21,15,21,19],[22,2,22,5],[26,2,28,4],[26,5,26,9],[26,10,26,16],[26,17,26,20],[27,5,28,9],[27,10,27,13],[27,14,27,16],[27,17,28,20],[28,10,28,13],[28,14,28,16],[29,2,31,4],[29,5,29,9],[29,10,29,16],[32,2,34,4],[33,14,33,16],[31,10,31,13],[31,14,31,16],[32,5,32,9],[32,10,32,16],[30,5,31,9],[30,10,30,13],[30,14,30,16],[33,17,34,20],[34,10,34,13],[34,14,34,16],[36,2,38,4],[36,5,36,9],[36,10,36,16],[36,17,36,20],[37,5,38,9],[37,10,37,13],[37,17,38,20],[38,10,38,13],[38,14,38,16],[37,14,37,16],[33,5,34,9],[33,10,33,13]]}
[]
[]
[null,null,"Massachusetts Department of Elementary and Secondary Education\nSTANDARD CONTRACT FORM AND APPLICATION FOR PROGRAM GRANTS"]
[]
[]
[null,null,"UPLOAD A SCANNED, SIGNED COPY OF THIS PAGE WITH THE DATE OF SUBMISSION TO EDGRANTS WITH THE BUDGET FOR EACH FUND CODE"]
[null,null,"District staff with the role of “control user” in EdGrants have been provided user log-in names and passwords and have been trained to submit a grant application via EdGrants. Provide all required application materials to your district control user with access to EdGrants to submit budgets and attachments  for each fund code for which the district is applying.                                                              \n                 Applications are due by September 28, 2018"]
[]
[]
[null,null,null,null,"District Name:",null,null,null,null,null,null,null,null,"Code:",null,{"$f":"valorg4code","v":"Org "}]
[]
[null,null,null,null,"Address: ",null,{"$f":"valAddr1","v":"Address 1"},null,null,null,null,null,null,"DESE Federal Grant Liaison",null,{"$f":"valname","v":"Liaison's Name"}]
[null,null,null,null,null,null,{"$f":"valCtyStZip","v":"Town, State Zip"},null,null,null,null,null,null,"Phone number:",null,{"$f":"valphonenum","v":"Liaison's Number"}]
[null,null,null,null,null,null,null,null,null,null,null,null,null,"Email:",null,{"$f":"valemail","v":"Liaison's Email"}]
[]
[]
[null,null,null,null,null,null,null,null,null,null,null,null,null,"`"]
[]
[null,null,"I CERTIFY THAT THE INFORMATION CONTAINED IN THIS APPLICATION IS CORRECT AND COMPLETE; THAT THE APPLICANT AGENCY HAS AUTHORIZED ME, AS ITS REPRESENTATIVE, TO FILE THIS APPLICATION; AND THAT I UNDERSTAND THAT FOR ANY FUNDS RECEIVED THROUGH THIS APPLICATION THE AGENCY AGREES TO COMPLY WITH ALL APPLICABLE STATE AND FEDERAL GRANT REQUIREMENTS COVERING BOTH THE PROGRAMMATIC AND FISCAL ADMINISTRATION OF GRANT FUNDS."]
[]
[]
[null,null,"AUTHORIZED SIGNATURE:",null,null,null,null,null,null,null,null,null,null,"TITLE:"]
[null,null,"PRINTED NAME:",null,null,null,null,null,null,null,null,null,null,"SUBMISSION DATE:"]
[]
[]
[]
[null,null,"FY2019 \nAllocation",null,null,"FEDERAL GRANT",null,null,null,null,"PROJECT DURATION",null,null,null,null,null,null,"TOTAL ALLOCATION"]
[null,null,null,null,null,"Title I, Part A\nFund Code 305",null,null,null,null,"FROM",null,null,null,"TO"]
[null,null,null,null,null,null,null,null,null,null,"UPON APPROVAL",null,null,null,"6/30/2019"]
[null,null,"FY2019 \nAllocation",null,null,"FEDERAL GRANT",null,null,null,null,"PROJECT DURATION",null,null,null,null,null,null,"TOTAL ALLOCATION"]
[null,null,null,null,null,"Title II, Part A\nFund Code 140",null,null,null,null,"FROM",null,null,null,"TO"]
[null,null,null,null,null,null,null,null,null,null,"UPON APPROVAL",null,null,null,"6/30/2019"]
[null,null,"FY2019 \nAllocation",null,null,"FEDERALGRANT",null,null,null,null,"PROJECT DURATION",null,null,null,null,null,null,"TOTAL ALLOCATION"]
[null,null,null,null,null,"Title III, Part A\nFund Code 180",null,null,null,null,"FROM",null,null,null,"TO"]
[null,null,null,null,null,null,null,null,null,null,"UPON APPROVAL",null,null,null,"6/30/2019"]
[]
[null,null,"FY2019 \nAllocation",null,null,"FEDERAL GRANT",null,null,null,null,"PROJECT DURATION",null,null,null,null,null,null,"TOTAL ALLOCATION"]
[null,null,null,null,null,"Title IV, Part A\nFund Code 309",null,null,null,null,"FROM",null,null,null,"TO"]
[null,null,null,null,null,null,null,null,null,null,"UPON APPROVAL",null,null,null,"6/30/2019"]
[]
[null,null,"UPLOAD A SCANNED, SIGNED COPY OF THIS PAGE WITH THE DATE OF SUBMISSION TO EDGRANTS WITH THE BUDGET FOR EACH FUND CODE\nBY SEPTEMBER 28, 2018 "]

{"sheet":"2. Contact Information ","index":2,"n_rows":32,"n_cols":5,"rows_kept":32,"cut":false,"hidden":false,"merged":[[14,1,14,3],[16,1,16,3],[17,1,17,2],[15,1,15,11],[20,4,20,11],[26,4,26,11],[27,1,27,11],[26,1,26,3],[20,1,20,3],[22,1,22,3],[23,1,23,2],[23,3,23,11],[24,2,24,11],[25,2,25,11],[31,2,31,11],[28,1,28,3],[29,1,29,2],[29,3,29,11],[30,2,30,11],[28,4,28,11],[1,1,1,3],[16,4,16,11],[22,4,22,11],[9,1,9,11],[21,1,21,11],[17,3,17,11],[18,2,18,11],[19,2,19,11],[11,1,11,2],[11,3,11,11],[12,2,12,11],[13,2,13,11],[10,4,10,11],[10,1,10,3],[8,4,8,11],[14,4,14,11],[2,13,4,17],[3,1,3,11],[2,1,2,11],[5,1,5,2],[8,1,8,3],[5,3,5,11],[6,2,6,11],[7,2,7,11],[4,1,4,3],[4,4,4,11]]}
[]
[null,{"$f":"valDistrName & \" (\"&valorg4code&\")\"","v":"Org Name (Org )"}]
[null,"District Contact Information by Program\nPlease provide information for primary district contact for each program"]
[null,"Title I, Part A, Improving Basic Programs & Part D, Programs for Neglected, Delinquent and At-Risk Students"]
[null,"Name of Primary Contact:"]
[null,"Title:"]
[null,"Phone:"]
[null,"Email:"]
[null,"New to this program?  (Y/N)",null,null,"Select One"]
[null,"Title II, Part A, Supporting Effective Instruction"]
[null,"Name of Primary Contact:"]
[null,"Title:"]
[null,"Phone:"]
[null,"Email:"]
[null,"New to this program?  (Y/N)",null,null,"Select One"]
[null,"Title III, Part A, Support for English Learners and Immigrant  Students"]
[null,"Name of Primary Contact:"]
[null,"Title:"]
[null,"Phone:"]
[null,"Email:"]
[null,"New to this program?  (Y/N)",null,null,"Select One"]
[null,"Title IV, Part A, Student Support and Academic Enrichment"]
[null,"Name of Primary Contact:"]
[null,"Title:"]
[null,"Phone:"]
[null,"Email:"]
[null,"New to this program?  (Y/N)",null,null,"Select One"]
[null,"EdGrants Control User (person responsible for uploading to EdGrants, if different person from above roles)"]
[null,"Name of Primary Contact:"]
[null,"Title:"]
[null,"Phone:"]
[null,"Email:"]

{"sheet":"3. Allocations and Flexing","index":3,"n_rows":32,"n_cols":9,"rows_kept":32,"cut":false,"hidden":false,"merged":[[1,1,1,2],[31,1,31,2],[15,1,15,2],[20,1,20,2],[21,1,21,2],[22,1,22,2],[17,1,17,2],[19,1,19,2],[16,1,16,2],[26,1,26,2],[30,1,30,2],[23,1,23,2],[27,1,27,2],[29,1,29,2],[28,1,28,2],[2,1,2,12],[5,8,21,12],[11,6,16,6],[25,1,25,2],[5,6,9,6],[11,1,11,2],[5,1,5,2],[6,1,6,2],[7,1,7,2],[8,1,8,2],[9,1,9,2],[12,1,12,2],[13,1,13,2],[14,1,14,2]]}
[]
[null,{"$f":"valDistrName & \" (\"&valorg4code&\")\"","v":"Org Name (Org )"}]
[null,"Program Allocations and Flexing"]
[null,null,null,null,null,null,null,null," \n\n"]
[]
[null,"Title I, Part A, Improving Basic Programs (Fund Code 305)",null,null,null,null,"TIP:  Report  all expenses for sums in blue, by line item, in EdGrants budget for original program, even if some or all funds are used for allowable expenses in a different program after flexing.",null,"Instructions:  Indicate for Title II, Part A and Title IV, Part A whether you would like to flex funds from these programs to another Title program by placing an amount to be flexed in the yellow boxes.  Note that flexing is not required.  Also, flexing from either Title I, Part A and Title III, Part A into another program is not allowed.\n\nAfter all flexing is completed, the amount in the green boxes will be the total used for allowable expenses under each Title program and will also be the total used for calculating private school services for each Title program.  \n\nThe original allocation for each Title program (top gray box) is the amount that must be reported in the original program's budget (and in EdGrants), regardless of whether funds are flexed. \n\nFor example, if a district flexed funds from Title IV, Part A to Title III, Part A and those funds were used to buy leveled readers for EL classrooms, funds for those readers would be budgeted and described in Title IV, Part A despite that the allowable use is governed by Title III, Part A.  See federal flexing guidance (transferability) for details."]
[null,"Total original Title I, Part A allocation",null,{"$f":"valAllocationT1","v":0}]
[null,"Funds flexed from Title II, Part A",null,{"$f":"D14","v":0}]
[null,"Funds flexed from Title IV, Part A",null,{"$f":"D28","v":0}]
[null,"Post-flexing funds for use per Title I, Part A:",null,{"$f":"SUM(D7:D9)","v":0}]
[]
[null,"Title II, Part A, Supporting Effective Instruction (Fund Code 140)",null,null,null,null,"TIP: Use sums in green boxes for activities and programs under this Title, including any spending caps or requirements (e.g., for administrative expenses) and for calculating private school services.  In this workbook, this sum will automatically populate tabs where it should be used."]
[null,"Total original Title II, Part A allocation",null,{"$f":"valAllocationT2","v":0}]
[null,"Title II, Part A funds flexed into Title I, Part A"]
[null,"Title II, Part A funds flexed into Title III, Part A"]
[null,"Title II, Part A funds flexed into Title IV, Part A"]
[null,"Funds flexed fromTitles IV, Part A*",null,{"$f":"D29","v":0}]
[null,"Post-flexing funds for use per Title II, Part A:",null,{"$f":"D13-(SUM(D14:D16))+D17","v":0}]
[]
[null,"Title III, Part A, Support for English Learners (Fund Code 180)"]
[null,"Total original Title III, Part A allocation",null,{"$f":"valAllocationT3","v":0}]
[null,"Funds flexed from Title II, Part A",null,{"$f":"D15","v":0}]
[null,"Funds flexed from Title IV, Part A",null,{"$f":"D30","v":0}]
[null,"Post-flexing funds for use per Title III, Part A:",null,{"$f":"SUM(D21:D23)","v":0}]
[]
[null,"Title IV, Part A, Student Support and Academic Enrichment (Fund Code 309)"]
[null,"Total original Title IV, Part A allocation",null,{"$f":"valAllocationT4","v":0}]
[null,"Title IV, Part A funds flexed into Title I, Part A"]
[null,"Title IV, Part A funds flexed into Title II, Part A"]
[null,"Title IVA funds flexed into Title III, Part A"]
[null,"Funds flexed from Titles II, Part A",null,{"$f":"D16","v":0}]
[null,"Post-flexing funds for use per Title IV, Part A:",null,{"$f":"(D27-(SUM(D28:D30))+D31)","v":0}]

{"sheet":"4. Private School Services","index":4,"n_rows":285,"n_cols":16,"rows_kept":285,"cut":false,"hidden":false,"merged":[[1,2,1,6],[142,2,142,11],[143,2,143,3],[24,2,24,7],[28,11,137,15],[141,2,141,3],[28,2,28,9],[31,10,116,10],[139,2,139,10],[9,6,9,7],[8,6,8,7],[9,2,9,4],[284,2,284,3],[284,4,284,11],[270,2,270,3],[270,4,270,11],[269,2,269,11],[271,2,271,11],[275,2,275,3],[276,2,276,3],[276,4,276,11],[279,2,279,11],[283,2,283,8],[282,2,282,11],[281,2,281,3],[281,4,281,11],[152,15,255,17],[2,2,2,11],[4,2,4,11],[17,2,17,7],[18,2,18,7],[12,2,12,4],[19,2,19,7],[141,4,141,11],[145,2,145,3],[145,4,145,11],[140,2,140,7],[26,2,26,7],[22,2,22,4],[148,2,148,4],[137,2,137,4],[7,6,7,7],[144,2,144,11],[143,4,143,11],[267,2,267,3],[267,4,267,11],[273,2,273,3],[273,4,273,11],[150,2,150,10],[265,2,265,10],[262,2,262,10],[260,2,260,9],[152,2,152,13],[264,2,264,3],[264,4,264,11],[258,2,258,4]]}
[]
[null,null,{"$f":"valDistrName & \" (\"&valorg4code&\")\"","v":"Org Name (Org )"}]
[null,null,"Non-Profit Private School Participation Worksheets"]
[]
[null,null,"ESSA requires the equitable participation of students and educators in private, non-profit schools for federally funded programs and services. The public school district is required to have \"timely and meaningful consultation\" with private school officials regarding the participation of private school students and educators in ESSA-funded programs and services. The public school district is responsible for providing equitable services and must retain control of the federal funds used to provide such services. Therefore, equitable services are provided by either an employee of the district or through a contract by the district with an individual, association, agency, or organization. Reimbursement to participating private schools is not allowable."]
[]
[null,null,"Resources:",null,null,null,null,null,"Title II, Part A","Title III, Part A","Title IV, Part A"]
[null,null,"Private School Equitable Services under ESSA",null,null,null,"Are you lead agent for a Schedule A Consortium?",null,"Select One","Select One","Select One"]
[null,null,"Consolidated Affirmation of Consultation",null,null,null,"Total Consortium Enrollment (Use March 2018 data)"]
[null,null,"DESE's ombudsman for equitable services for private schools is Russ Fleming, who can be reached at ESEAequitableservices@doe.mass.edu or 781-338-6259.",null,null,null,"Total Consortium EL Enrollment\n(Use March 2018 data)"]
[]
[]
[null,null,"Step 4.1\nFill in the amount that the district will reserve for administrative expenses for Titles II, Part A, III, Part A and/or Title IV, Part A.  The remainder of the grid will populate automatically once you have completed all steps of this worksheet."]
[]
[null,null,"District enrollment, March 2018",{"$f":"IFERROR(valDisEnr,\"\")","v":"March Enrolled Count"}]
[null,null,"District EL population, March 2018",{"$f":"IFERROR(valDisELenr,\"\")","v":"March EL Count (18c)"}]
[null,null,null,null,null,null,null,null,"Title I, Part A","Title II, Part A","Title III, Part A","Title IV, Part A"]
[null,null,"Provide total funding being used for district's direct administrative expenses ",null,null,null,null,null,"N/A"]
[null,null,"Total district funds per program after any flexing between programs and minus the amount reserved for program administration for Titles IIA III & IVA.",null,null,null,null,null,{"$f":"'3. Allocations and Flexing'!D10","v":0},{"$f":"'3. Allocations and Flexing'!D18-'4. Private School Services'!J18","v":0},{"$f":"'3. Allocations and Flexing'!D24-'4. Private School Services'!K18","v":0},{"$f":"'3. Allocations and Flexing'!D32-'4. Private School Services'!L18:M18","v":0}]
[null,null,"Total amount that must be reserved for equitable services.  See below for allocations for each private school.",null,null,null,null,null,{"$f":"J135","v":0},{"$f":"L256","v":0},{"$f":"M256","v":0},{"$f":"N256","v":0}]
[]
[]
[null,null,"Step 4.2 \nComplete worksheet in each section for individual private schools for each federal program."]
[]
[null,null,"Title I, Part A:  Improving Basic Services"]
[]
[null,null,"Do any district resident students attending private schools live in Title I school attendance areas?\nIf the answer is \"no,\" go on to Step 4.3",null,null,null,null,null,"Select One"]
[]
[null,null,"Title I, Part A:  Private Schools Serving Eligible Children Residing in District",null,null,null,null,null,null,null,null,"Instructions: First, respond to the question at beginning of Step 4.2 to indicate whether any eligible private school students reside in the district.\n\nList the private schools that have students who are eligible to participate in the district’s Title I program. Eligible students are children who reside in your district and would have attended a Title I-served school had they attended a district public school. The listing represents the private schools that have been contacted regarding interest in participation in the district’s Title I program. Indicate whether each listed school will participate or not by selecting from the drop-down menu.\n\nColumn A: Identify the span of grades offered at the listed school.\n\nColumn B: Indicate the number of children attending the school who reside in your district and who would have attended a Title I-served school had they attended the district public schools.\n\nColumn C: Indicate the number of eligible children (from column B) who are considered to be low-income. In most instances, the low-income count will be obtained with the assistance of private school officials. For eligible private schools that have declined to participate, it is likely that a low-income count will not be known and the column can be left blank.\n\nColumn D: Indicate the number of children (from column B) who will participate in the Title I program. Most likely, this number will be an estimate at the time of application for funding.\n\nNote: columns C and D will be blank if the eligible school has not chosen to participate in the Title I program. For schools that will participate, columns C and D should be populated.\n\nColumns E & F:  A per-pupil amount for equitable services will automatically calculate in column E based on the information in this chart and the information provided in Tab 8, with a total per school appearing in column F.   Because the figures are reported in whole dollars, you might notice some discrepancies between per-pupil amounts and total allocated per school due to rounding issues -- rely on the total allocation by school for funding private school services.\n\nResponses to questions 1-4 are required for only those districts that have eligible private schools that have chosen to participate in the Title I program."]
[null,null,"\n\nList private schools located within or outside district boundaries that have enrolled students who reside in a Title I-served school attendance area\n\n   ","Will this Private School Participate in Title I?\n(Yes or No)","Grades Served","Number of children who reside in Title I-served attendance area","Number of children (from column B) who are low-income using methodology described below","Estimated number of children (from Column B) who will participate in the Title I Program","Amount Per Low Income Student based on Title I Allocation","Allocation Per School for Services"," "]
[null,null,".",null,"A","B","C ","D","E","F"]
[null,null,null,"Select One",null,null,null,null,{"$f":"IF('8. Title I, A School Funding'!$M$164=0, \"0\", IF(G32>0, (valAllocationFlexT1)/($G$135+'8. Title I, A School Funding'!$M$164),0))","v":"0"},{"$f":"IF(D32=\"Yes\", G32*I32, 0)","v":0}]
[null,null,null,"Select One",null,null,null,null,{"$f":"IF('8. Title I, A School Funding'!$M$164=0, \"0\", IF(G33>0, (valAllocationFlexT1)/($G$135+'8. Title I, A School Funding'!$M$164),0))","v":"0"},{"$f":"IF(D33=\"Yes\", G33*I33, 0)","v":0}]
[null,null,null,"Select One",null,null,null,null,{"$f":"IF('8. Title I, A School Funding'!$M$164=0, \"0\", IF(G34>0, (valAllocationFlexT1)/($G$135+'8. Title I, A School Funding'!$M$164),0))","v":"0"},{"$f":"IF(D34=\"Yes\", G34*I34, 0)","v":0}]
[null,null,null,"Select One",null,null,null,null,{"$f":"IF('8. Title I, A School Funding'!$M$164=0, \"0\", IF(G35>0, (valAllocationFlexT1)/($G$135+'8. Title I, A School Funding'!$M$164),0))","v":"0"},0]
[null,null,null,"Select One",null,null,null,null,{"$f":"IF('8. Title I, A School Funding'!$M$164=0, \"0\", IF(G36>0, (valAllocationFlexT1)/($G$135+'8. Title I, A School Funding'!$M$164),0))","v":"0"},0]
[null,null,null,"Select One",null,null,null,null,{"$f":"IF('8. Title I, A School Funding'!$M$164=0, \"0\", IF(G37>0, (valAllocationFlexT1)/($G$135+'8. Title I, A School Funding'!$M$164),0))","v":"0"},0]
[null,null,null,"Select One",null,null,null,null,{"$f":"IF('8. Title I, A School Funding'!$M$164=0, \"0\", IF(G38>0, (valAllocationFlexT1)/($G$135+'8. Title I, A School Funding'!$M$164),0))","v":"0"},0]
[null,null,null,"Select One",null,null,null,null,{"$f":"IF('8. Title I, A School Funding'!$M$164=0, \"0\", IF(G39>0, (valAllocationFlexT1)/($G$135+'8. Title I, A School Funding'!$M$164),0))","v":"0"},0]
[null,null,null,"Select One",null,null,null,null,{"$f":"IF('8. Title I, A School Funding'!$M$164=0, \"0\", IF(G40>0, (valAllocationFlexT1)/($G$135+'8. Title I, A School Funding'!$M$164),0))","v":"0"},0]
[null,null,null,"Select One",null,null,null,null,{"$f":"IF('8. Title I, A School Funding'!$M$164=0, \"0\", IF(G41>0, (valAllocationFlexT1)/($G$135+'8. Title I, A School Funding'!$M$164),0))","v":"0"},0]
[null,null,null,"Select One",null,null,null,null,{"$f":"IF('8. Title I, A School Funding'!$M$164=0, \"0\", IF(G42>0, (valAllocationFlexT1)/($G$135+'8. Title I, A School Funding'!$M$164),0))","v":"0"},0]
[null,null,null,"Select One",null,null,null,null,{"$f":"IF('8. Title I, A School Funding'!$M$164=0, \"0\", IF(G43>0, (valAllocationFlexT1)/($G$135+'8. Title I, A School Funding'!$M$164),0))","v":"0"},0]
[null,null,null,"Select One",null,null,null,null,{"$f":"IF('8. Title I, A School Funding'!$M$164=0, \"0\", IF(G44>0, (valAllocationFlexT1)/($G$135+'8. Title I, A School Funding'!$M$164),0))","v":"0"},0]
[null,null,null,"Select One",null,null,null,null,{"$f":"IF('8. Title I, A School Funding'!$M$164=0, \"0\", IF(G45>0, (valAllocationFlexT1)/($G$135+'8. Title I, A School Funding'!$M$164),0))","v":"0"},0]
[null,null,null,"Select One",null,null,null,null,{"$f":"IF('8. Title I, A School Funding'!$M$164=0, \"0\", IF(G46>0, (valAllocationFlexT1)/($G$135+'8. Title I, A School Funding'!$M$164),0))","v":"0"},0]
[null,null,null,"Select One",null,null,null,null,{"$f":"IF('8. Title I, A School Funding'!$M$164=0, \"0\", IF(G47>0, (valAllocationFlexT1)/($G$135+'8. Title I, A School Funding'!$M$164),0))","v":"0"},0]
[null,null,null,"Select One",null,null,null,null,{"$f":"IF('8. Title I, A School Funding'!$M$164=0, \"0\", IF(G48>0, (valAllocationFlexT1)/($G$135+'8. Title I, A School Funding'!$M$164),0))","v":"0"},{"$f":"IF(D48=\"Yes\", G48*I48, 0)","v":0}]
[null,null,null,"Select One",null,null,null,null,{"$f":"IF('8. Title I, A School Funding'!$M$164=0, \"0\", IF(G49>0, (valAllocationFlexT1)/($G$135+'8. Title I, A School Funding'!$M$164),0))","v":"0"},0]
[null,null,null,"Select One",null,null,null,null,{"$f":"IF('8. Title I, A School Funding'!$M$164=0, \"0\", IF(G50>0, (valAllocationFlexT1)/($G$135+'8. Title I, A School Funding'!$M$164),0))","v":"0"},0]
[null,null,null,"Select One",null,null,null,null,{"$f":"IF('8. Title I, A School Funding'!$M$164=0, \"0\", IF(G51>0, (valAllocationFlexT1)/($G$135+'8. Title I, A School Funding'!$M$164),0))","v":"0"},0]
[null,null,null,"Select One",null,null,null,null,{"$f":"IF('8. Title I, A School Funding'!$M$164=0, \"0\", IF(G52>0, (valAllocationFlexT1)/($G$135+'8. Title I, A School Funding'!$M$164),0))","v":"0"},{"$f":"IF(D52=\"Yes\", G52*I52, 0)","v":0}]
[null,null,null,"Select One",null,null,null,null,{"$f":"IF('8. Title I, A School Funding'!$M$164=0, \"0\", IF(G53>0, (valAllocationFlexT1)/($G$135+'8. Title I, A School Funding'!$M$164),0))","v":"0"},{"$f":"IF(D53=\"Yes\", G53*I53, 0)","v":0}]
[null,null,null,"Select One",null,null,null,null,{"$f":"IF('8. Title I, A School Funding'!$M$164=0, \"0\", IF(G54>0, (valAllocationFlexT1)/($G$135+'8. Title I, A School Funding'!$M$164),0))","v":"0"},0]
[null,null,null,"Select One",null,null,null,null,{"$f":"IF('8. Title I, A School Funding'!$M$164=0, \"0\", IF(G55>0, (valAllocationFlexT1)/($G$135+'8. Title I, A School Funding'!$M$164),0))","v":"0"},0]
[null,null,null,"Select One",null,null,null,null,{"$f":"IF('8. Title I, A School Funding'!$M$164=0, \"0\", IF(G56>0, (valAllocationFlexT1)/($G$135+'8. Title I, A School Funding'!$M$164),0))","v":"0"},0]
[null,null,null,"Select One",null,null,null,null,{"$f":"IF('8. Title I, A School Funding'!$M$164=0, \"0\", IF(G57>0, (valAllocationFlexT1)/($G$135+'8. Title I, A School Funding'!$M$164),0))","v":"0"},0]
[null,null,null,"Select One",null,null,null,null,{"$f":"IF('8. Title I, A School Funding'!$M$164=0, \"0\", IF(G58>0, (valAllocationFlexT1)/($G$135+'8. Title I, A School Funding'!$M$164),0))","v":"0"},0]
[null,null,null,"Select One",null,null,null,null,{"$f":"IF('8. Title I, A School Funding'!$M$164=0, \"0\", IF(G59>0, (valAllocationFlexT1)/($G$135+'8. Title I, A School Funding'!$M$164),0))","v":"0"},0]
[null,null,null,"Select One",null,null,null,null,{"$f":"IF('8. Title I, A School Funding'!$M$164=0, \"0\", IF(G60>0, (valAllocationFlexT1)/($G$135+'8. Title I, A School Funding'!$M$164),0))","v":"0"},0]
[null,null,null,"Select One",null,null,null,null,{"$f":"IF('8. Title I, A School Funding'!$M$164=0, \"0\", IF(G61>0, (valAllocationFlexT1)/($G$135+'8. Title I, A School Funding'!$M$164),0))","v":"0"},0]
[null,null,null,"Select One",null,null,null,null,{"$f":"IF('8. Title I, A School Funding'!$M$164=0, \"0\", IF(G62>0, (valAllocationFlexT1)/($G$135+'8. Title I, A School Funding'!$M$164),0))","v":"0"},0]
[null,null,null,"Select One",null,null,null,null,{"$f":"IF('8. Title I, A School Funding'!$M$164=0, \"0\", IF(G63>0, (valAllocationFlexT1)/($G$135+'8. Title I, A School Funding'!$M$164),0))","v":"0"},0]
[null,null,null,"Select One",null,null,null,null,{"$f":"IF('8. Title I, A School Funding'!$M$164=0, \"0\", IF(G64>0, (valAllocationFlexT1)/($G$135+'8. Title I, A School Funding'!$M$164),0))","v":"0"},0]
[null,null,null,"Select One",null,null,null,null,{"$f":"IF('8. Title I, A School Funding'!$M$164=0, \"0\", IF(G65>0, (valAllocationFlexT1)/($G$135+'8. Title I, A School Funding'!$M$164),0))","v":"0"},0]
[null,null,null,"Select One",null,null,null,null,{"$f":"IF('8. Title I, A School Funding'!$M$164=0, \"0\", IF(G66>0, (valAllocationFlexT1)/($G$135+'8. Title I, A School Funding'!$M$164),0))","v":"0"},0]
[null,null,null,"Select One",null,null,null,null,{"$f":"IF('8. Title I, A School Funding'!$M$164=0, \"0\", IF(G67>0, (valAllocationFlexT1)/($G$135+'8. Title I, A School Funding'!$M$164),0))","v":"0"},0]
[null,null,null,"Select One",null,null,null,null,{"$f":"IF('8. Title I, A School Funding'!$M$164=0, \"0\", IF(G68>0, (valAllocationFlexT1)/($G$135+'8. Title I, A School Funding'!$M$164),0))","v":"0"},0]
[null,null,null,"Select One",null,null,null,null,{"$f":"IF('8. Title I, A School Funding'!$M$164=0, \"0\", IF(G69>0, (valAllocationFlexT1)/($G$135+'8. Title I, A School Funding'!$M$164),0))","v":"0"},0]
[null,null,null,"Select One",null,null,null,null,{"$f":"IF('8. Title I, A School Funding'!$M$164=0, \"0\", IF(G70>0, (valAllocationFlexT1)/($G$135+'8. Title I, A School Funding'!$M$164),0))","v":"0"},0]
[null,null,null,"Select One",null,null,null,null,{"$f":"IF('8. Title I, A School Funding'!$M$164=0, \"0\", IF(G71>0, (valAllocationFlexT1)/($G$135+'8. Title I, A School Funding'!$M$164),0))","v":"0"},0]
[null,null,null,"Select One",null,null,null,null,{"$f":"IF('8. Title I, A School Funding'!$M$164=0, \"0\", IF(G72>0, (valAllocationFlexT1)/($G$135+'8. Title I, A School Funding'!$M$164),0))","v":"0"},0]
[null,null,null,"Select One",null,null,null,null,{"$f":"IF('8. Title I, A School Funding'!$M$164=0, \"0\", IF(G73>0, (valAllocationFlexT1)/($G$135+'8. Title I, A School Funding'!$M$164),0))","v":"0"},0]
[null,null,null,"Select One",null,null,null,null,{"$f":"IF('8. Title I, A School Funding'!$M$164=0, \"0\", IF(G74>0, (valAllocationFlexT1)/($G$135+'8. Title I, A School Funding'!$M$164),0))","v":"0"},0]
[null,null,null,"Select One",null,null,null,null,{"$f":"IF('8. Title I, A School Funding'!$M$164=0, \"0\", IF(G75>0, (valAllocationFlexT1)/($G$135+'8. Title I, A School Funding'!$M$164),0))","v":"0"},0]
[null,null,null,"Select One",null,null,null,null,{"$f":"IF('8. Title I, A School Funding'!$M$164=0, \"0\", IF(G76>0, (valAllocationFlexT1)/($G$135+'8. Title I, A School Funding'!$M$164),0))","v":"0"},0]
[null,null,null,"Select One",null,null,null,null,{"$f":"IF('8. Title I, A School Funding'!$M$164=0, \"0\", IF(G77>0, (valAllocationFlexT1)/($G$135+'8. Title I, A School Funding'!$M$164),0))","v":"0"},0]
[null,null,null,"Select One",null,null,null,null,{"$f":"IF('8. Title I, A School Funding'!$M$164=0, \"0\", IF(G78>0, (valAllocationFlexT1)/($G$135+'8. Title I, A School Funding'!$M$164),0))","v":"0"},0]
[null,null,null,"Select One",null,null,null,null,{"$f":"IF('8. Title I, A School Funding'!$M$164=0, \"0\", IF(G79>0, (valAllocationFlexT1)/($G$135+'8. Title I, A School Funding'!$M$164),0))","v":"0"},0]
[null,null,null,"Select One",null,null,null,null,{"$f":"IF('8. Title I, A School Funding'!$M$164=0, \"0\", IF(G80>0, (valAllocationFlexT1)/($G$135+'8. Title I, A School Funding'!$M$164),0))","v":"0"},0]
[null,null,null,"Select One",null,null,null,null,{"$f":"IF('8. Title I, A School Funding'!$M$164=0, \"0\", IF(G81>0, (valAllocationFlexT1)/($G$135+'8. Title I, A School Funding'!$M$164),0))","v":"0"},0]
[null,null,null,"Select One",null,null,null,null,{"$f":"IF('8. Title I, A School Funding'!$M$164=0, \"0\", IF(G82>0, (valAllocationFlexT1)/($G$135+'8. Title I, A School Funding'!$M$164),0))","v":"0"},0]
[null,null,null,"Select One",null,null,null,null,{"$f":"IF('8. Title I, A School Funding'!$M$164=0, \"0\", IF(G83>0, (valAllocationFlexT1)/($G$135+'8. Title I, A School Funding'!$M$164),0))","v":"0"},0]
[null,null,null,"Select One",null,null,null,null,{"$f":"IF('8. Title I, A School Funding'!$M$164=0, \"0\", IF(G84>0, (valAllocationFlexT1)/($G$135+'8. Title I, A School Funding'!$M$164),0))","v":"0"},0]
[null,null,null,"Select One",null,null,null,null,{"$f":"IF('8. Title I, A School Funding'!$M$164=0, \"0\", IF(G85>0, (valAllocationFlexT1)/($G$135+'8. Title I, A School Funding'!$M$164),0))","v":"0"},0]
[null,null,null,"Select One",null,null,null,null,{"$f":"IF('8. Title I, A School Funding'!$M$164=0, \"0\", IF(G86>0, (valAllocationFlexT1)/($G$135+'8. Title I, A School Funding'!$M$164),0))","v":"0"},0]
[null,null,null,"Select One",null,null,null,null,{"$f":"IF('8. Title I, A School Funding'!$M$164=0, \"0\", IF(G87>0, (valAllocationFlexT1)/($G$135+'8. Title I, A School Funding'!$M$164),0))","v":"0"},0]
[null,null,null,"Select One",null,null,null,null,{"$f":"IF('8. Title I, A School Funding'!$M$164=0, \"0\", IF(G88>0, (valAllocationFlexT1)/($G$135+'8. Title I, A School Funding'!$M$164),0))","v":"0"},0]
[null,null,null,"Select One",null,null,null,null,{"$f":"IF('8. Title I, A School Funding'!$M$164=0, \"0\", IF(G89>0, (valAllocationFlexT1)/($G$135+'8. Title I, A School Funding'!$M$164),0))","v":"0"},0]
[null,null,null,"Select One",null,null,null,null,{"$f":"IF('8. Title I, A School Funding'!$M$164=0, \"0\", IF(G90>0, (valAllocationFlexT1)/($G$135+'8. Title I, A School Funding'!$M$164),0))","v":"0"},0]
[null,null,null,"Select One",null,null,null,null,{"$f":"IF('8. Title I, A School Funding'!$M$164=0, \"0\", IF(G91>0, (valAllocationFlexT1)/($G$135+'8. Title I, A School Funding'!$M$164),0))","v":"0"},0]
[null,null,null,"Select One",null,null,null,null,{"$f":"IF('8. Title I, A School Funding'!$M$164=0, \"0\", IF(G92>0, (valAllocationFlexT1)/($G$135+'8. Title I, A School Funding'!$M$164),0))","v":"0"},0]
[null,null,null,"Select One",null,null,null,null,{"$f":"IF('8. Title I, A School Funding'!$M$164=0, \"0\", IF(G93>0, (valAllocationFlexT1)/($G$135+'8. Title I, A School Funding'!$M$164),0))","v":"0"},0]
[null,null,null,"Select One",null,null,null,null,{"$f":"IF('8. Title I, A School Funding'!$M$164=0, \"0\", IF(G94>0, (valAllocationFlexT1)/($G$135+'8. Title I, A School Funding'!$M$164),0))","v":"0"},0]
[null,null,null,"Select One",null,null,null,null,{"$f":"IF('8. Title I, A School Funding'!$M$164=0, \"0\", IF(G95>0, (valAllocationFlexT1)/($G$135+'8. Title I, A School Funding'!$M$164),0))","v":"0"},0]
[null,null,null,"Select One",null,null,null,null,{"$f":"IF('8. Title I, A School Funding'!$M$164=0, \"0\", IF(G96>0, (valAllocationFlexT1)/($G$135+'8. Title I, A School Funding'!$M$164),0))","v":"0"},0]
[null,null,null,"Select One",null,null,null,null,{"$f":"IF('8. Title I, A School Funding'!$M$164=0, \"0\", IF(G97>0, (valAllocationFlexT1)/($G$135+'8. Title I, A School Funding'!$M$164),0))","v":"0"},0]
[null,null,null,"Select One",null,null,null,null,{"$f":"IF('8. Title I, A School Funding'!$M$164=0, \"0\", IF(G98>0, (valAllocationFlexT1)/($G$135+'8. Title I, A School Funding'!$M$164),0))","v":"0"},0]
[null,null,null,"Select One",null,null,null,null,{"$f":"IF('8. Title I, A School Funding'!$M$164=0, \"0\", IF(G99>0, (valAllocationFlexT1)/($G$135+'8. Title I, A School Funding'!$M$164),0))","v":"0"},0]
[null,null,null,"Select One",null,null,null,null,{"$f":"IF('8. Title I, A School Funding'!$M$164=0, \"0\", IF(G100>0, (valAllocationFlexT1)/($G$135+'8. Title I, A School Funding'!$M$164),0))","v":"0"},0]
[null,null,null,"Select One",null,null,null,null,{"$f":"IF('8. Title I, A School Funding'!$M$164=0, \"0\", IF(G101>0, (valAllocationFlexT1)/($G$135+'8. Title I, A School Funding'!$M$164),0))","v":"0"},0]
[null,null,null,"Select One",null,null,null,null,{"$f":"IF('8. Title I, A School Funding'!$M$164=0, \"0\", IF(G102>0, (valAllocationFlexT1)/($G$135+'8. Title I, A School Funding'!$M$164),0))","v":"0"},0]
[null,null,null,"Select One",null,null,null,null,{"$f":"IF('8. Title I, A School Funding'!$M$164=0, \"0\", IF(G103>0, (valAllocationFlexT1)/($G$135+'8. Title I, A School Funding'!$M$164),0))","v":"0"},0]
[null,null,null,"Select One",null,null,null,null,{"$f":"IF('8. Title I, A School Funding'!$M$164=0, \"0\", IF(G104>0, (valAllocationFlexT1)/($G$135+'8. Title I, A School Funding'!$M$164),0))","v":"0"},0]
[null,null,null,"Select One",null,null,null,null,{"$f":"IF('8. Title I, A School Funding'!$M$164=0, \"0\", IF(G105>0, (valAllocationFlexT1)/($G$135+'8. Title I, A School Funding'!$M$164),0))","v":"0"},0]
[null,null,null,"Select One",null,null,null,null,{"$f":"IF('8. Title I, A School Funding'!$M$164=0, \"0\", IF(G106>0, (valAllocationFlexT1)/($G$135+'8. Title I, A School Funding'!$M$164),0))","v":"0"},0]
[null,null,null,"Select One",null,null,null,null,{"$f":"IF('8. Title I, A School Funding'!$M$164=0, \"0\", IF(G107>0, (valAllocationFlexT1)/($G$135+'8. Title I, A School Funding'!$M$164),0))","v":"0"},0]
[null,null,null,"Select One",null,null,null,null,{"$f":"IF('8. Title I, A School Funding'!$M$164=0, \"0\", IF(G108>0, (valAllocationFlexT1)/($G$135+'8. Title I, A School Funding'!$M$164),0))","v":"0"},0]
[null,null,null,"Select One",null,null,null,null,{"$f":"IF('8. Title I, A School Funding'!$M$164=0, \"0\", IF(G109>0, (valAllocationFlexT1)/($G$135+'8. Title I, A School Funding'!$M$164),0))","v":"0"},0]
[null,null,null,"Select One",null,null,null,null,{"$f":"IF('8. Title I, A School Funding'!$M$164=0, \"0\", IF(G110>0, (valAllocationFlexT1)/($G$135+'8. Title I, A School Funding'!$M$164),0))","v":"0"},0]
[null,null,null,"Select One",null,null,null,null,{"$f":"IF('8. Title I, A School Funding'!$M$164=0, \"0\", IF(G111>0, (valAllocationFlexT1)/($G$135+'8. Title I, A School Funding'!$M$164),0))","v":"0"},0]
[null,null,null,"Select One",null,null,null,null,{"$f":"IF('8. Title I, A School Funding'!$M$164=0, \"0\", IF(G112>0, (valAllocationFlexT1)/($G$135+'8. Title I, A School Funding'!$M$164),0))","v":"0"},0]
[null,null,null,"Select One",null,null,null,null,{"$f":"IF('8. Title I, A School Funding'!$M$164=0, \"0\", IF(G113>0, (valAllocationFlexT1)/($G$135+'8. Title I, A School Funding'!$M$164),0))","v":"0"},0]
[null,null,null,"Select One",null,null,null,null,{"$f":"IF('8. Title I, A School Funding'!$M$164=0, \"0\", IF(G114>0, (valAllocationFlexT1)/($G$135+'8. Title I, A School Funding'!$M$164),0))","v":"0"},0]
[null,null,null,"Select One",null,null,null,null,{"$f":"IF('8. Title I, A School Funding'!$M$164=0, \"0\", IF(G115>0, (valAllocationFlexT1)/($G$135+'8. Title I, A School Funding'!$M$164),0))","v":"0"},0]
[null,null,null,"Select One",null,null,null,null,{"$f":"IF('8. Title I, A School Funding'!$M$164=0, \"0\", IF(G116>0, (valAllocationFlexT1)/($G$135+'8. Title I, A School Funding'!$M$164),0))","v":"0"},0]
[null,null,null,"Select One",null,null,null,null,{"$f":"IF('8. Title I, A School Funding'!$M$164=0, \"0\", IF(G117>0, (valAllocationFlexT1)/($G$135+'8. Title I, A School Funding'!$M$164),0))","v":"0"},0]
[null,null,null,"Select One",null,null,null,null,{"$f":"IF('8. Title I, A School Funding'!$M$164=0, \"0\", IF(G118>0, (valAllocationFlexT1)/($G$135+'8. Title I, A School Funding'!$M$164),0))","v":"0"},0]
[null,null,null,"Select One",null,null,null,null,{"$f":"IF('8. Title I, A School Funding'!$M$164=0, \"0\", IF(G119>0, (valAllocationFlexT1)/($G$135+'8. Title I, A School Funding'!$M$164),0))","v":"0"},0]
[null,null,null,"Select One",null,null,null,null,{"$f":"IF('8. Title I, A School Funding'!$M$164=0, \"0\", IF(G120>0, (valAllocationFlexT1)/($G$135+'8. Title I, A School Funding'!$M$164),0))","v":"0"},0]
[null,null,null,"Select One",null,null,null,null,{"$f":"IF('8. Title I, A School Funding'!$M$164=0, \"0\", IF(G121>0, (valAllocationFlexT1)/($G$135+'8. Title I, A School Funding'!$M$164),0))","v":"0"},0]
[null,null,null,"Select One",null,null,null,null,{"$f":"IF('8. Title I, A School Funding'!$M$164=0, \"0\", IF(G122>0, (valAllocationFlexT1)/($G$135+'8. Title I, A School Funding'!$M$164),0))","v":"0"},0]
[null,null,null,"Select One",null,null,null,null,{"$f":"IF('8. Title I, A School Funding'!$M$164=0, \"0\", IF(G123>0, (valAllocationFlexT1)/($G$135+'8. Title I, A School Funding'!$M$164),0))","v":"0"},0]
[null,null,null,"Select One",null,null,null,null,{"$f":"IF('8. Title I, A School Funding'!$M$164=0, \"0\", IF(G124>0, (valAllocationFlexT1)/($G$135+'8. Title I, A School Funding'!$M$164),0))","v":"0"},{"$f":"IF(D124=\"Yes\", G124*I124, 0)","v":0}]
[null,null,null,"Select One",null,null,null,null,{"$f":"IF('8. Title I, A School Funding'!$M$164=0, \"0\", IF(G125>0, (valAllocationFlexT1)/($G$135+'8. Title I, A School Funding'!$M$164),0))","v":"0"},0]
[null,null,null,"Select One",null,null,null,null,{"$f":"IF('8. Title I, A School Funding'!$M$164=0, \"0\", IF(G126>0, (valAllocationFlexT1)/($G$135+'8. Title I, A School Funding'!$M$164),0))","v":"0"},0]
[null,null,null,"Select One",null,null,null,null,{"$f":"IF('8. Title I, A School Funding'!$M$164=0, \"0\", IF(G127>0, (valAllocationFlexT1)/($G$135+'8. Title I, A School Funding'!$M$164),0))","v":"0"},0]
[null,null,null,"Select One",null,null,null,null,{"$f":"IF('8. Title I, A School Funding'!$M$164=0, \"0\", IF(G128>0, (valAllocationFlexT1)/($G$135+'8. Title I, A School Funding'!$M$164),0))","v":"0"},0]
[null,null,null,"Select One",null,null,null,null,{"$f":"IF('8. Title I, A School Funding'!$M$164=0, \"0\", IF(G129>0, (valAllocationFlexT1)/($G$135+'8. Title I, A School Funding'!$M$164),0))","v":"0"},0]
[null,null,null,"Select One",null,null,null,null,{"$f":"IF('8. Title I, A School Funding'!$M$164=0, \"0\", IF(G130>0, (valAllocationFlexT1)/($G$135+'8. Title I, A School Funding'!$M$164),0))","v":"0"},{"$f":"IF(D130=\"Yes\", G130*I130, 0)","v":0}]
[null,null,null,"Select One",null,null,null,null,{"$f":"IF('8. Title I, A School Funding'!$M$164=0, \"0\", IF(G131>0, (valAllocationFlexT1)/($G$135+'8. Title I, A School Funding'!$M$164),0))","v":"0"},{"$f":"IF(D131=\"Yes\", G131*I131, 0)","v":0}]
[null,null,null,"Select One",null,null,null,null,{"$f":"IF('8. Title I, A School Funding'!$M$164=0, \"0\", IF(G132>0, (valAllocationFlexT1)/($G$135+'8. Title I, A School Funding'!$M$164),0))","v":"0"},{"$f":"IF(D132=\"Yes\", G132*I132, 0)","v":0}]
[null,null,null,"Select One",null,null,null,null,{"$f":"IF('8. Title I, A School Funding'!$M$164=0, \"0\", IF(G133>0, (valAllocationFlexT1)/($G$135+'8. Title I, A School Funding'!$M$164),0))","v":"0"},{"$f":"IF(D133=\"Yes\", G133*I133, 0)","v":0}]
[null,null,null,"Select One",null,null,null,null,{"$f":"IF('8. Title I, A School Funding'!$M$164=0, \"0\", IF(G134>0, (valAllocationFlexT1)/($G$135+'8. Title I, A School Funding'!$M$164),0))","v":"0"},0]
[null,null,null,null,null,{"$f":"SUM(F32:F134)","v":0},{"$f":"SUM(G32:G134)","v":0},{"$f":"SUM(H32:H134)","v":0},null,{"$f":"SUM(J32:J134)","v":0}]
[]
[]
[null,null,"Step 4.3\nAnswer questions about Title I, Part A services for private schools"]
[]
[null,null,"1. Has the district contacted all private schools (located within or beyond district boundaries) that enroll Title I eligible students and has evidence of such outreach on file.  (select yes/no) ",null,null,null,null,null,null,null,null,"Select one"]
[null,null,"2. How was low income status determined for private school students?"]
[null,null,"Select One",null,"Other:"]
[null,null,"3. What Title I services will be provided to participating private school students, their teachers, and their parents? (Select primary service from dropdown menu; \n   list additional services in \"Other\")."]
[null,null,"Select One",null,"Other:"]
[null,null,"4. How will the district assess the impact of services it delivers to private schools? (Choose primary source from dropdowns, and describe additional sources under \"Other\")."]
[null,null,"Select One",null,"Other:"]
[]
[]
[null,null,"Step 4.4\nComplete for all private schools in district boundaries "]
[]
[null,null,"Titles II, Part A; III, Part A; & IV, Part A:  Supporting Effective Instruction, Support for English Learners and Student Support and Academic Enrichment"]
[]
[null,null,"Title II, Part A; Title III, Part A & Title IV, Part A:  Private Schools Serving Eligible Children Residing in District",null,null,null,null,null,null,null,null,null,null,null,null,"\nInstructions:\nList the private schools located in the district boundaries and the number of students enrolled in each. The listing represents the private schools that have been contacted regarding interest in participation in the district’s Title IIA, Title III and/or Title IVA programs. Indicate whether each listed school has chosen to participate by selecting from the drop-down menu.\n\nColumns A-C: Indicate whether the private school has elected to participate in the program identified in the column heading (yes or no)\n\nColumn D: Indicate the number of children attending the listed school.\n\nColumn E: Indicate the number of children attending the private school who are English learners.\n\nColumns F-H:  These columns will automatically populate based on your Title IIA, Title III and/or Title IVA funding after flexing and subtracting administrative expenses.\n\nColumns I-K:  These columns will automatically populate based on the number of eligible students for each program multiplied by the per pupil amount for each program.  Because the figures are reported in whole dollars, you might notice some discrepancies between per-pupil amounts and total allocated per school due to rounding issues -- rely on the total allocation by school for funding private school services.\n\nNote: For private schools that will participate in any or all Title II, Part A, Title III, Part A and Title IV, Part A, columns F through K will be populated according to the school's choice to participate, and, in the case of Title III, the number of eligible students.\n\nResponses to questions 1 and 2 for each Title II, Part A and Title IV, Part A and questions 1 through 3 for Title III, Part A are required, respectively, for only those districts that have eligible private schools that have chosen to participate in those programs."]
[null,null,"\n\nList private schools located within  district boundaries      ","Will this Private School Participate in Title II, Part A?\n(Yes or No)","Will this Private School Participate in Title III, Part A?\n(Yes or No)","Will this Private School Participate in Title IV, Part A?\n(Yes or No)","Total Number of Students Enrolled in Private School\n(not including preschool students)","Number of Eligible English Learners Enrolled in Private School","Title II, Part A: Amount Per Pupil","Title III, Part A: Amount Per Pupil","Title IV, Part A: Amount Per Pupil","Title II, Part A: Total Allocation for Private School Services, by School","Title III, Part A: Total Allocation for Private School Services, by School","Title IV, Part A: Total Allocation for Private School Services, by School"]
[null,null,".","A","B","C","D","E","F","G","H","I","J","K"]
[null,null,null,"Select One","Select One","Select One",null,null,{"$f":"IF(D156=\"Yes\",IFERROR($J$19/((IF($I$8 =\"Yes\", $I$9, $D$15))+$G$257), 0),0)","v":0},{"$f":"IF(E156=\"Yes\",IFERROR($K$19/((IF($J$8 =\"Yes\", $J$10, $D$16))+$H$257), 0),0)","v":0},{"$f":"IF(F156=\"Yes\",IFERROR($L$19/((IF($K$8 =\"Yes\", $K$9, $D$15))+$E$257), 0),0)","v":0},{"$f":"IFERROR(I156*G156, 0)","v":0},{"$f":"IFERROR(J156*H156, 0)","v":0},{"$f":"IFERROR(G156*K156,0)","v":0}]
[null,null,null,"Select One","Select One","Select One",null,null,{"$f":"IF(D157=\"Yes\",IFERROR($J$19/((IF($I$8 =\"Yes\", $I$9, $D$15))+$G$257), 0),0)","v":0},{"$f":"IF(E157=\"Yes\",IFERROR($K$19/((IF($J$8 =\"Yes\", $J$10, $D$16))+$H$257), 0),0)","v":0},0,{"$f":"IFERROR(I157*G157, 0)","v":0},{"$f":"IFERROR(J157*H157, 0)","v":0},{"$f":"IFERROR(G157*K157,0)","v":0}]
[null,null,null,"Select One","Select One","Select One",null,null,0,0,{"$f":"IF(F158=\"Yes\",IFERROR($L$19/((IF($K$8 =\"Yes\", $K$9, $D$15))+$E$257), 0),0)","v":0},0,0,0]
[null,null,null,"Select One","Select One","Select One",null,null,0,0,0,0,0,0]
[null,null,null,"Select One","Select One","Select One",null,null,0,0,0,0,0,0]
[null,null,null,"Select One","Select One","Select One",null,null,0,0,0,0,0,0]
[null,null,null,"Select One","Select One","Select One",null,null,0,0,0,0,0,0]
[null,null,null,"Select One","Select One","Select One",null,null,0,0,0,0,0,0]
[null,null,null,"Select One","Select One","Select One",null,null,0,0,0,0,0,0]
[null,null,null,"Select One","Select One","Select One",null,null,0,0,0,0,0,0]
[null,null,null,"Select One","Select One","Select One",null,null,0,0,0,0,0,0]
[null,null,null,"Select One","Select One","Select One",null,null,0,0,0,0,0,0]
[null,null,null,"Select One","Select One","Select One",null,null,0,0,0,0,0,0]
[null,null,null,"Select One","Select One","Select One",null,null,0,0,0,0,0,0]
[null,null,null,"Select One","Select One","Select One",null,null,0,0,0,0,0,0]
[null,null,null,"Select One","Select One","Select One",null,null,0,0,0,0,0,0]
[null,null,null,"Select One","Select One","Select One",null,null,0,0,0,0,0,0]
[null,null,null,"Select One","Select One","Select One",null,null,0,0,0,0,0,0]
[null,null,null,"Select One","Select One","Select One",null,null,0,0,0,0,0,0]
[null,null,null,"Select One","Select One","Select One",null,null,0,0,0,0,0,0]
[null,null,null,"Select One","Select One","Select One",null,null,0,0,0,0,0,0]
[null,null,null,"Select One","Select One","Select One",null,null,0,0,0,0,0,0]
[null,null,null,"Select One","Select One","Select One",null,null,0,0,0,0,0,0]
[null,null,null,"Select One","Select One","Select One",null,null,0,0,0,0,0,0]
[null,null,null,"Select One","Select One","Select One",null,null,0,0,0,0,0,0]
[null,null,null,"Select One","Select One","Select One",null,null,0,0,0,0,0,0]
[null,null,null,"Select One","Select One","Select One",null,null,0,0,0,0,0,0]
[null,null,null,"Select One","Select One","Select One",null,null,0,0,0,0,0,0]
[null,null,null,"Select One","Select One","Select One",null,null,0,0,0,0,0,0]
[null,null,null,"Select One","Select One","Select One",null,null,0,0,0,0,0,0]
[null,null,null,"Select One","Select One","Select One",null,null,0,0,0,0,0,0]
[null,null,null,"Select One","Select One","Select One",null,null,0,0,0,0,0,0]
[null,null,null,"Select One","Select One","Select One",null,null,0,0,0,0,0,0]
[null,null,null,"Select One","Select One","Select One",null,null,0,0,0,0,0,0]
[null,null,null,"Select One","Select One","Select One",null,null,0,0,0,0,0,0]
[null,null,null,"Select One","Select One","Select One",null,null,0,0,0,0,0,0]
[null,null,null,"Select One","Select One","Select One",null,null,0,0,0,0,0,0]
[null,null,null,"Select One","Select One","Select One",null,null,0,0,0,0,0,0]
[null,null,null,"Select One","Select One","Select One",null,null,0,0,0,0,0,0]
[null,null,null,"Select One","Select One","Select One",null,null,0,0,0,0,0,0]
[null,null,null,"Select One","Select One","Select One",null,null,0,0,0,{"$f":"IFERROR(I196*G196, 0)","v":0},{"$f":"IFERROR(J196*H196, 0)","v":0},{"$f":"IFERROR(G196*K196,0)","v":0}]
[null,null,null,"Select One","Select One","Select One",null,null,0,0,0,0,0,0]
[null,null,null,"Select One","Select One","Select One",null,null,0,0,0,0,0,0]
[null,null,null,"Select One","Select One","Select One",null,null,0,0,0,0,0,0]
[null,null,null,"Select One","Select One","Select One",null,null,0,0,0,0,0,0]
[null,null,null,"Select One","Select One","Select One",null,null,0,0,0,0,0,0]
[null,null,null,"Select One","Select One","Select One",null,null,0,0,0,0,0,0]
[null,null,null,"Select One","Select One","Select One",null,null,0,0,0,0,0,0]
[null,null,null,"Select One","Select One","Select One",null,null,0,0,0,0,0,0]
[null,null,null,"Select One","Select One","Select One",null,null,0,0,0,0,0,0]
[null,null,null,"Select One","Select One","Select One",null,null,0,0,0,0,0,0]
[null,null,null,"Select One","Select One","Select One",null,null,0,0,0,0,0,0]
[null,null,null,"Select One","Select One","Select One",null,null,0,0,0,0,0,0]
[null,null,null,"Select One","Select One","Select One",null,null,0,0,0,0,0,0]
[null,null,null,"Select One","Select One","Select One",null,null,0,0,0,0,0,0]
[null,null,null,"Select One","Select One","Select One",null,null,0,0,0,0,0,0]
[null,null,null,"Select One","Select One","Select One",null,null,0,0,0,0,0,0]
[null,null,null,"Select One","Select One","Select One",null,null,0,0,0,0,0,0]
[null,null,null,"Select One","Select One","Select One",null,null,0,0,0,0,0,0]
[null,null,null,"Select One","Select One","Select One",null,null,0,0,0,0,0,0]
[null,null,null,"Select One","Select One","Select One",null,null,0,0,0,{"$f":"IFERROR(I216*G216, 0)","v":0},{"$f":"IFERROR(J216*H216, 0)","v":0},{"$f":"IFERROR(G216*K216,0)","v":0}]
[null,null,null,"Select One","Select One","Select One",null,null,0,0,0,0,0,0]
[null,null,null,"Select One","Select One","Select One",null,null,0,0,0,0,0,0]
[null,null,null,"Select One","Select One","Select One",null,null,0,0,0,0,0,0]
[null,null,null,"Select One","Select One","Select One",null,null,0,0,{"$f":"IF(F220=\"Yes\",IFERROR($L$19/((IF($K$8 =\"Yes\", $K$9, $D$15))+$E$257), 0),0)","v":0},0,0,0]
[null,null,null,"Select One","Select One","Select One",null,null,{"$f":"IF(D221=\"Yes\",IFERROR($J$19/((IF($I$8 =\"Yes\", $I$9, $D$15))+$G$257), 0),0)","v":0},{"$f":"IF(E221=\"Yes\",IFERROR($K$19/((IF($J$8 =\"Yes\", $J$10, $D$16))+$H$257), 0),0)","v":0},0,0,0,0]
[null,null,null,"Select One","Select One","Select One",null,null,0,0,0,0,0,0]
[null,null,null,"Select One","Select One","Select One",null,null,0,0,0,0,0,0]
[null,null,null,"Select One","Select One","Select One",null,null,0,0,0,0,0,0]
[null,null,null,"Select One","Select One","Select One",null,null,0,0,0,0,0,0]
[null,null,null,"Select One","Select One","Select One",null,null,0,0,0,0,0,0]
[null,null,null,"Select One","Select One","Select One",null,null,0,0,0,0,0,0]
[null,null,null,"Select One","Select One","Select One",null,null,0,0,0,0,0,0]
[null,null,null,"Select One","Select One","Select One",null,null,0,0,0,0,0,0]
[null,null,null,"Select One","Select One","Select One",null,null,0,0,0,0,0,0]
[null,null,null,"Select One","Select One","Select One",null,null,0,0,0,0,0,0]
[null,null,null,"Select One","Select One","Select One",null,null,0,0,0,0,0,0]
[null,null,null,"Select One","Select One","Select One",null,null,0,0,0,0,0,0]
[null,null,null,"Select One","Select One","Select One",null,null,0,0,0,0,0,0]
[null,null,null,"Select One","Select One","Select One",null,null,0,0,0,0,0,0]
[null,null,null,"Select One","Select One","Select One",null,null,0,0,0,0,0,0]
[null,null,null,"Select One","Select One","Select One",null,null,0,0,0,0,0,0]
[null,null,null,"Select One","Select One","Select One",null,null,0,0,0,0,0,0]
[null,null,null,"Select One","Select One","Select One",null,null,0,0,0,0,0,0]
[null,null,null,"Select One","Select One","Select One",null,null,0,0,0,0,0,0]
[null,null,null,"Select One","Select One","Select One",null,null,0,0,0,{"$f":"IFERROR(I241*G241, 0)","v":0},{"$f":"IFERROR(J241*H241, 0)","v":0},{"$f":"IFERROR(G241*K241,0)","v":0}]
[null,null,null,"Select One","Select One","Select One",null,null,0,0,0,0,0,0]
[null,null,null,"Select One","Select One","Select One",null,null,0,0,0,0,0,0]
[null,null,null,"Select One","Select One","Select One",null,null,0,0,0,0,0,0]
[null,null,null,"Select One","Select One","Select One",null,null,0,0,0,0,0,0]
[null,null,null,"Select One","Select One","Select One",null,null,0,0,0,{"$f":"IFERROR(I246*G246, 0)","v":0},{"$f":"IFERROR(J246*H246, 0)","v":0},{"$f":"IFERROR(G246*K246,0)","v":0}]
[null,null,null,"Select One","Select One","Select One",null,null,0,0,0,0,0,0]
[null,null,null,"Select One","Select One","Select One",null,null,0,0,0,0,0,0]
[null,null,null,"Select One","Select One","Select One",null,null,0,0,0,0,0,0]
[null,null,null,"Select One","Select One","Select One",null,null,0,0,0,0,0,0]
[null,null,null,"Select One","Select One","Select One",null,null,0,0,0,0,0,0]
[null,null,null,"Select One","Select One","Select One",null,null,0,0,0,0,0,0]
[null,null,null,"Select One","Select One","Select One",null,null,0,0,0,{"$f":"IFERROR(I253*G253, 0)","v":0},{"$f":"IFERROR(J253*H253, 0)","v":0},{"$f":"IFERROR(G253*K253,0)","v":0}]
[null,null,null,"Select One","Select One","Select One",null,null,0,0,0,{"$f":"IFERROR(I254*G254, 0)","v":0},{"$f":"IFERROR(J254*H254, 0)","v":0},{"$f":"IFERROR(G254*K254,0)","v":0}]
[null,null,null,"Select One","Select One","Select One",null,null,0,0,0,{"$f":"IFERROR(I255*G255, 0)","v":0},{"$f":"IFERROR(J255*H255, 0)","v":0},{"$f":"IFERROR(G255*K255,0)","v":0}]
[null,null,null,null,null,null,null,null,null,null,null,{"$f":"SUM(L156:L255)","v":0},{"$f":"SUM(M156:M255)","v":0},{"$f":"SUM(N156:N255)","v":0}]
[null,null,null,"Title IVA TotalPrivate School Participation",{"$f":"SUMIF(F156:F255, \"Yes\", G156:G255)","v":0},"Title IIA Total Private School Participation",{"$f":"SUMIF(D156:D255, \"Yes\", G156:G255)","v":0},{"$f":"SUMIF(E156:E255, \"Yes\", H156:H255)","v":0}]
[]
[null,null,"Step 4.5\nAnswer questions about Title II, Part A; Title III, Part A,  and/or Title IV,Part A services for private schools"]
[null,null,null,null,null,null,null,null,null,null,"Title II, Part A","Title III, Part A","Title IV, Part A"]
[null,null,"  Has the district contacted all private schools located within district boundaries to inquire about their participation in Title II, Part A, \n  Title III, Part A, and/or Title IV, Part A services with evidence of such outreach on file?  (select yes/no) ",null,null,null,null,null,null,null,"Select One","Select One","Select One"]
[]
[null,null,"1. What Title II, Part A services will be provided to participating private schools? (Select primary service from dropdown menu; list additional services in \"Other\")."]
[]
[null,null,"Select One"]
[null,null,"2. How will the district assess the impact of Title IIA services on participating private school students?  (Choose primary source from dropdowns, and describe\n    additional sources under \"Other\")."]
[]
[null,null,"Select One"]
[]
[null,null,"1. What Title III, Part A services will be provided to participating private schools? (Select primary service from dropdown menu; list additional services in \"Other\")."]
[null,null,"Select One"]
[null,null,"2. How will the district assess the impact of Title III, Part A services on participating private school students? (Select primary source from dropdown menu; list additional sources in \"Other\")."]
[]
[null,null,"Select One"]
[null,null,"3.  How were private school English Learners identified? (Select primary means of identification from dropdown menu; list additional means in \"Other\")."]
[]
[null,null,"Select One"]
[]
[]
[null,null,"1. What Title IV, Part A services will be provided to participating private schools?  (Select primary service from dropdown menu; list additional services in \"Other\")."]
[]
[null,null,"Select One"]
[null,null,"2. How will the district assess the impact of Title IV, Part A services on participating private school students? (Choose primary source from dropdowns, and describe additional sources under \"Other\")."]
[]
[null,null,"Select One"]

{"sheet":"5. Districtwide Strategies","index":5,"n_rows":52,"n_cols":23,"rows_kept":52,"cut":false,"hidden":false,"merged":[[1,1,1,6],[6,1,6,8],[20,10,22,18],[26,1,26,9],[27,1,27,9],[3,1,3,21],[19,1,19,4],[25,1,25,4],[8,10,16,18],[5,1,5,4],[6,9,6,13],[25,18,26,26],[29,1,29,12],[28,1,28,9],[32,16,32,21],[33,16,33,21],[32,1,32,7],[32,8,32,9],[33,8,33,9],[32,13,32,15],[33,13,33,15],[32,10,32,12],[33,10,33,12],[41,1,41,2],[48,3,48,10],[49,3,49,10],[36,1,36,4],[40,1,40,2],[39,1,39,2],[37,1,38,10],[42,1,42,2],[38,16,39,16],[37,12,37,22],[31,8,31,21],[17,13,17,19],[28,10,28,19],[23,13,23,19],[39,3,39,10],[38,21,39,21],[38,18,39,18],[38,19,39,19],[38,20,39,20],[38,12,39,12],[30,1,30,4],[31,1,31,4],[20,1,22,9],[33,1,33,7],[50,3,50,10],[51,3,51,10],[38,22,39,22],[47,3,47,10],[46,3,46,10],[45,3,45,10],[44,3,44,10],[43,3,43,10],[42,3,42,10],[40,3,40,10],[41,3,41,10],[38,13,39,13],[38,14,39,14],[38,15,39,15],[38,17,39,17],[37,11,39,11]]}
[]
[null,{"$f":"valDistrName & \" (\"&valorg4code&\")\"","v":"Org Name (Org )"}]
[]
[null,"FY19 Districtwide Strategy and Planning"]
[]
[null,"Step 5.1\nDistrict Strategic Plan"]
[null,"Please identify the planning document that is the source for your district initiatives for FY19\n (i.e., District Improvement Plan, Strategic Plan, etc.):"]
[]
[null,"    Which stakeholder groups had input into the district initiatives listed below in Step 5.5?",null,null,null,null,null,null,null,null,"Resources: Supporting Strategic Planning\n •  Planning for Success is a proven planning model supporting the process in addition to creation of multi- \n     year plans and annual action plans.  All components are available on DESE's website for getting started.\n\n •  RADAR (Resource Allocation and District Action Reports) is a new tool allowing districts to compare\n     their use of resources with up to ten districts, analyze trends over 5 years, and visualize resource data \n     in user-friendly formats.\n\n •   Curriculum collaboration:  To facilitate connections across districts using similar curriculum, the \n      Department has developed a tool showing the ELA/literacy, math, and STE materials in use across the \n      state. If your district’s data do not appear in the tool, be sure to complete this form."]
[null,null,"central office personnel",null,null,null,null,"community-based partners"]
[null,null,"community members",null,null,null,null,"paraprofessionals"]
[null,null,"principals / school administrators",null,null,null,null,"school council"]
[null,null,"school counselors",null,null,null,null,"specialized instructional support personnel"]
[null,null,"students",null,null,null,null,"teachers"]
[null,null,"town/city officials",null,null,null,null,"parents, families, and guardians"]
[null,null,"English Learner Parent Advisory Council",null,null,null,null,"McKinney-Vento liaison"]
[]
[]
[]
[null,"Step 5.2\nFamily and Community Engagement"]
[null,"\n  Describe how your district will promote parent, family and community engagement.  \n  In particular, describe supplemental activities funded by: \n        * Title I, Part A (effective family engagement), \n        * Title II, Part A (engaging stakeholders in cycle of continuous improvement), \n        * Title III, Part A (engagement with education of English learners),\n        * Title IV, Part A (partners from the community)."]
[]
[]
[]
[]
[null,"Step 5.3\nEquitable Access to Excellent Educators"]
[null,"Has your district reviewed its Student Learning Experience (SLE) Reports available using Edwin Analytics?",null,null,null,null,null,null,null,null,"Select One"]
[null,"Based on your district's review of SLE reports and/or district practices and data, has your district identified any significant \nschool and/or district gaps in student access to excellent educators?",null,null,null,null,null,null,null,null,"Select One"]
[null,"\nWhat steps is the district taking to address any identified gaps?"]
[null,"Please indicate below in Step 5.5 which of your strategies/activities for FY19 respond, in whole or in part, to the equity gaps that you have identified.  "]
[]
[null,"Step 5.4\nData and Evaluation",null,null,null,null,null,null,"List at least one and up to three or more sources of data\nUse \"Other\" cell to describe sources of evidence not listed in dropdowns or to add sources."]
[null,"List the principal sources of data used by the district to select strategies and activities listed below",null,null,null,null,null,null,"Select One",null,"Select One",null,null,"Select One"]
[null,"List the principal data that will be used to track progress and success for strategies and activities listed below",null,null,null,null,null,null,"Select One",null,"Select One",null,null,"Select One"]
[]
[]
[null,"Step 5.5\nSchool Year 2018-2019:  District Activities and Strategies"]
[null,"Input key initiatives from district improvement plan or other strategic plan to be implemented in the 2018-2019 school year using keywords/short title and then briefly describe strategies/activities.  \n\nPlease list all strategic initiatives for the upcoming year, even those not funded with federal program grant funds.   ",null,null,null,null,null,null,null,null,null,"Is this activity/strat-\negy explicitly connected to district efforts to close equity gaps?","Funding Source\n(Place an \"X\" in all funding sources that support each strategy/activity)"]
[null,null,null,null,null,null,null,null,null,null,null,null,"Title I, Part A","Title II, Part A","Title III, Part A","Title IV, Part A","Title V-B\n(REAP Grant)","School Redesign (Level 4 and 5 schools)","IDEA","Perkins","Other Federal ","State and/or Local","Private Funding"]
[null,"\n Initiative Keywords or \nShort Title ",null,"Strategies/Activities"]
[null,"Example: \nCo-Teaching for English Learners",null,"To meet academic and English language acquisition needs of English learners: (1) hire appropriately licensed and trained educators (ESL and core academic teachers), (2) provide ongoing professional learning and collaboration time for co-teachers, (3) adapting curricular materials to appropriately shelter English and integrate language acquisition, and (4) supporting co-teachers to assess student progress in both academic content and language acquisition. ",null,null,null,null,null,null,null,"Yes","x","x",null,null,null,null,null,null,null,"x"]
[null,"Example: \nMath Curriculum Selection",null,"Providing a committee of 8-10 educators and other stakeholders with the time, information, and support they need to (1) review available middle grades math curricula for their quality, alignment to Massachusetts standards, and suitability to the district’s context and (2) select one curriculum for use in grades 6-8 districtwide ",null,null,null,null,null,null,null,"Yes","x","x",null,null,null,null,null,null,null,"x"]
[null,"Example: \nSocial-Emotional Learning ",null,"1) Establishing a district-wide team to develop a system for tracking the effectiveness of behavioral interventions and supports 2) Evaluating research-based SEL curricula in order to implement 3) Partnering with outside consultants to enhance the ESL curriculum by including SEL strategies.  ",null,null,null,null,null,null,null,"No","x",null,"x","x",null,null,null,null,null,"x"]
[null,1,null,null,null,null,null,null,null,null,null,"Select One"]
[null,2,null,null,null,null,null,null,null,null,null,"Select One"]
[null,3,null,null,null,null,null,null,null,null,null,"Select One"]
[null,4,null,null,null,null,null,null,null,null,null,"Select One"]
[null,5,null,null,null,null,null,null,null,null,null,"Select One"]
[null,6,null,null,null,null,null,null,null,null,null,"Select One"]
[null,7,null,null,null,null,null,null,null,null,null,"Select One"]
[null,8,null,null,null,null,null,null,null,null,null,"Select One"]
[null,9,null,null,null,null,null,null,null,null,null,"Select One"]

{"sheet":"data","index":6,"n_rows":410,"n_cols":2,"rows_kept":410,"cut":false,"hidden":true,"merged":[]}
["Select your organization","Org Code"]
["Abby Kelley Foster Charter Public (District)","04450000"]
["Abington","00010000"]
["Academy Of the Pacific Rim Charter Public (District)","04120000"]
["Acton-Boxborough","06000000"]
["Acushnet","00030000"]
["Adams-Cheshire","06030000"]
["Advanced Math and Science Academy Charter (District)","04300000"]
["Agawam","00050000"]
["Alma del Mar Charter School (District)","04090000"]
["Amesbury","00070000"]
["Amherst","00080000"]
["Amherst-Pelham","06050000"]
["Andover","00090000"]
["Argosy Collegiate Charter School (District)","35090000"]
["Arlington","00100000"]
["Ashburnham-Westminster","06100000"]
["Ashland","00140000"]
["Assabet Valley Regional Vocational Technical","08010000"]
["Athol-Royalston","06150000"]
["Atlantis Charter (District)","04910000"]
["Attleboro","00160000"]
["Auburn","00170000"]
["Avon","00180000"]
["Ayer Shirley School District","06160000"]
["Barnstable","00200000"]
["Barnstable Community Horace Mann Charter Public (District)","04270000"]
["Baystate Academy Charter Public School (District)","35020000"]
["Bedford","00230000"]
["Belchertown","00240000"]
["Bellingham","00250000"]
["Belmont","00260000"]
["Benjamin Banneker Charter Public (District)","04200000"]
["Benjamin Franklin Classical Charter Public (District)","04470000"]
["Bentley Academy Charter School (District)","35110000"]
["Berkley","00270000"]
["Berkshire Arts and Technology Charter Public (District)","04140000"]
["Berkshire Hills","06180000"]
["Berlin","00280000"]
["Berlin-Boylston","06200000"]
["Beverly","00300000"]
["Billerica","00310000"]
["Blackstone Valley Regional Vocational Technical","08050000"]
["Blackstone-Millville","06220000"]
["Blue Hills Regional Vocational Technical","08060000"]
["Boston","00350000"]
["Boston Collegiate Charter (District)","04490000"]
["Boston Day and Evening Academy Charter (District)","04240000"]
["Boston Green Academy Horace Mann Charter School (District)","04110000"]
["Boston Preparatory Charter Public (District)","04160000"]
["Boston Renaissance Charter Public (District)","04810000"]
["Bourne","00360000"]
["Boxford","00380000"]
["Boylston","00390000"]
["Braintree","00400000"]
["Brewster","00410000"]
["Bridge Boston Charter School (District)","04170000"]
["Bridgewater-Raynham","06250000"]
["Brimfield","00430000"]
["Bristol County Agricultural","09100000"]
["Bristol-Plymouth Regional Vocational Technical","08100000"]
["Brockton","00440000"]
["Brooke Charter School (District)","04280000"]
["Brookfield","00450000"]
["Brookline","00460000"]
["Burlington","00480000"]
["Cambridge","00490000"]
["Canton","00500000"]
["Cape Cod Lighthouse Charter (District)","04320000"]
["Cape Cod Regional Vocational Technical","08150000"]
["Carlisle","00510000"]
["Carver","00520000"]
["Central Berkshire","06350000"]
["Chelmsford","00560000"]
["Chelsea","00570000"]
["Chesterfield-Goshen","06320000"]
["Chicopee","00610000"]
["Christa McAuliffe Charter Public (District)","04180000"]
["City on a Hill Charter Public School Circuit Street (District)","04370000"]
["City on a Hill Charter Public School Dudley Square (District)","35040000"]
["City on a Hill Charter Public School New Bedford (District)","35070000"]
["Clarksburg","00630000"]
["Clinton","00640000"]
["Codman Academy Charter Public (District)","04380000"]
["Cohasset","00650000"]
["Collegiate Charter School of Lowell (District)","35030000"]
["Community Charter School of Cambridge (District)","04360000"]
["Community Day Charter Public School - Gateway (District)","04260000"]
["Community Day Charter Public School - Prospect (District)","04400000"]
["Community Day Charter Public School - R. Kingman Webster (District)","04310000"]
["Concord","00670000"]
["Concord-Carlisle","06400000"]
["Conservatory Lab Charter (District)","04390000"]
["Conway","00680000"]
["Danvers","00710000"]
["Dartmouth","00720000"]
["Dedham","00730000"]
["Deerfield","00740000"]
["Dennis-Yarmouth","06450000"]
["Dighton-Rehoboth","06500000"]
["Douglas","00770000"]
["Dover","00780000"]
["Dover-Sherborn","06550000"]
["Dracut","00790000"]
["Dudley Street Neighborhood Charter School (District)","04070000"]
["Dudley-Charlton Reg","06580000"]
["Duxbury","00820000"]
["East Bridgewater","00830000"]
["East Longmeadow","00870000"]
["Eastham","00850000"]
["Easthampton","00860000"]
["Easton","00880000"]
["Edgartown","00890000"]
["Edward M. Kennedy Academy for Health Careers (Horace Mann Charter) (District)","04520000"]
["Erving","00910000"]
["Essex North Shore Agricultural and Technical School District","08170000"]
["Everett","00930000"]
["Excel Academy Charter (District)","04100000"]
["Fairhaven","00940000"]
["Fall River","00950000"]
["Falmouth","00960000"]
["Farmington River Reg","06620000"]
["Fitchburg","00970000"]
["Florida","00980000"]
["Four Rivers Charter Public (District)","04130000"]
["Foxborough","00990000"]
["Foxborough Regional Charter (District)","04460000"]
["Framingham","01000000"]
["Francis W. Parker Charter Essential (District)","04780000"]
["Franklin","01010000"]
["Franklin County Regional Vocational Technical","08180000"]
["Freetown-Lakeville","06650000"]
["Frontier","06700000"]
["Gardner","01030000"]
["Gateway","06720000"]
["Georgetown","01050000"]
["Gill-Montague","06740000"]
["Global Learning Charter Public (District)","04960000"]
["Gloucester","01070000"]
["Gosnold","01090000"]
["Grafton","01100000"]
["Granby","01110000"]
["Greater Fall River Regional Vocational Technical","08210000"]
["Greater Lawrence Regional Vocational Technical","08230000"]
["Greater Lowell Regional Vocational Technical","08280000"]
["Greater New Bedford Regional Vocational Technical","08250000"]
["Greenfield","01140000"]
["Groton-Dunstable","06730000"]
["Hadley","01170000"]
["Halifax","01180000"]
["Hamilton-Wenham","06750000"]
["Hampden Charter School of Science (District)","04990000"]
["Hampden Charter School of Science West (District)","35160000"]
["Hampden-Wilbraham","06800000"]
["Hampshire","06830000"]
["Hancock","01210000"]
["Hanover","01220000"]
["Harvard","01250000"]
["Hatfield","01270000"]
["Haverhill","01280000"]
["Hawlemont","06850000"]
["Helen Y. Davis Leadership Academy Charter Public (District)","04190000"]
["Hill View Montessori Charter Public (District)","04550000"]
["Hilltown Cooperative Charter Public (District)","04500000"]
["Hingham","01310000"]
["Holbrook","01330000"]
["Holland","01350000"]
["Holliston","01360000"]
["Holyoke","01370000"]
["Holyoke Community Charter (District)","04530000"]
["Hopedale","01380000"]
["Hopkinton","01390000"]
["Hudson","01410000"]
["Hull","01420000"]
["Innovation Academy Charter (District)","04350000"]
["Institutional Schools","03700000"]
["Ipswich","01440000"]
["KIPP Academy Boston Charter School (District)","04630000"]
["KIPP Academy Lynn Charter (District)","04290000"]
["King Philip","06900000"]
["Kingston","01450000"]
["Lanesborough","01480000"]
["Lawrence","01490000"]
["Lawrence Family Development Charter (District)","04540000"]
["Lee","01500000"]
["Leicester","01510000"]
["Lenox","01520000"]
["Leominster","01530000"]
["Leverett","01540000"]
["Lexington","01550000"]
["Libertas Academy Charter School (District)","35140000"]
["Lincoln","01570000"]
["Lincoln-Sudbury","06950000"]
["Littleton","01580000"]
["Longmeadow","01590000"]
["Lowell","01600000"]
["Lowell Community Charter Public (District)","04560000"]
["Lowell Middlesex Academy Charter (District)","04580000"]
["Ludlow","01610000"]
["Lunenburg","01620000"]
["Lynn","01630000"]
["Lynnfield","01640000"]
["MATCH Charter Public School (District)","04690000"]
["Ma Academy for Math and Science","04680000"]
["Malden","01650000"]
["Manchester Essex Regional","06980000"]
["Mansfield","01670000"]
["Map Academy Charter School (District)","35170000"]
["Marblehead","01680000"]
["Marblehead Community Charter Public (District)","04640000"]
["Marion","01690000"]
["Marlborough","01700000"]
["Marshfield","01710000"]
["Martha's Vineyard","07000000"]
["Martha's Vineyard Charter (District)","04660000"]
["Martin Luther King Jr. Charter School of Excellence (District)","04920000"]
["Masconomet","07050000"]
["Mashpee","01720000"]
["Massachusetts Virtual Academy at Greenfield Commonwealth Virtual District","39010000"]
["Mattapoisett","01730000"]
["Maynard","01740000"]
["Medfield","01750000"]
["Medford","01760000"]
["Medway","01770000"]
["Melrose","01780000"]
["Mendon-Upton","07100000"]
["Methuen","01810000"]
["Middleborough","01820000"]
["Middleton","01840000"]
["Milford","01850000"]
["Millbury","01860000"]
["Millis","01870000"]
["Milton","01890000"]
["Minuteman Regional Vocational Technical","08300000"]
["Mohawk Trail","07170000"]
["Monomoy Regional School District","07120000"]
["Monson","01910000"]
["Montachusett Regional Vocational Technical","08320000"]
["Mount Greylock","07150000"]
["Mystic Valley Regional Charter (District)","04700000"]
["Nahant","01960000"]
["Nantucket","01970000"]
["Narragansett","07200000"]
["Nashoba","07250000"]
["Nashoba Valley Regional Vocational Technical","08520000"]
["Natick","01980000"]
["Nauset","06600000"]
["Needham","01990000"]
["Neighborhood House Charter (District)","04440000"]
["New Bedford","02010000"]
["New Heights Charter School of Brockton (District)","35130000"]
["New Salem-Wendell","07280000"]
["Newburyport","02040000"]
["Newton","02070000"]
["Norfolk","02080000"]
["Norfolk County Agricultural","09150000"]
["North Adams","02090000"]
["North Andover","02110000"]
["North Attleborough","02120000"]
["North Brookfield","02150000"]
["North Middlesex","07350000"]
["North Reading","02170000"]
["Northampton","02100000"]
["Northampton-Smith Vocational Agricultural","04060000"]
["Northboro-Southboro","07300000"]
["Northborough","02130000"]
["Northbridge","02140000"]
["Northeast Metropolitan Regional Vocational Technical","08530000"]
["Northern Berkshire Regional Vocational Technical","08510000"]
["Norton","02180000"]
["Norwell","02190000"]
["Norwood","02200000"]
["Oak Bluffs","02210000"]
["Old Colony Regional Vocational Technical","08550000"]
["Old Rochester","07400000"]
["Old Sturbridge Academy Charter Public School (District)","35150000"]
["Orange","02230000"]
["Orleans","02240000"]
["Oxford","02260000"]
["Palmer","02270000"]
["Pathfinder Regional Vocational Technical","08600000"]
["Paulo Freire Social Justice Charter School (District)","35010000"]
["Peabody","02290000"]
["Pelham","02300000"]
["Pembroke","02310000"]
["Pentucket","07450000"]
["Petersham","02340000"]
["Phoenix Academy Public Charter High School Springfield (District)","35080000"]
["Phoenix Charter Academy (District)","04930000"]
["Pioneer Charter School of Science (District)","04940000"]
["Pioneer Charter School of Science II (PCSS-II) (District)","35060000"]
["Pioneer Valley","07500000"]
["Pioneer Valley Chinese Immersion Charter (District)","04970000"]
["Pioneer Valley Performing Arts Charter Public (District)","04790000"]
["Pittsfield","02360000"]
["Plainville","02380000"]
["Plymouth","02390000"]
["Plympton","02400000"]
["Prospect Hill Academy Charter (District)","04870000"]
["Provincetown","02420000"]
["Quabbin","07530000"]
["Quaboag Regional","07780000"]
["Quincy","02430000"]
["Ralph C Mahar","07550000"]
["Randolph","02440000"]
["Reading","02460000"]
["Revere","02480000"]
["Richmond","02490000"]
["Rising Tide Charter Public (District)","04830000"]
["River Valley Charter (District)","04820000"]
["Rochester","02500000"]
["Rockland","02510000"]
["Rockport","02520000"]
["Rowe","02530000"]
["Roxbury Preparatory Charter (District)","04840000"]
["Sabis International Charter (District)","04410000"]
["Salem","02580000"]
["Salem Academy Charter (District)","04850000"]
["Sandwich","02610000"]
["Saugus","02620000"]
["Savoy","02630000"]
["Scituate","02640000"]
["Seekonk","02650000"]
["Seven Hills Charter Public (District)","04860000"]
["Sharon","02660000"]
["Shawsheen Valley Regional Vocational Technical","08710000"]
["Sherborn","02690000"]
["Shrewsbury","02710000"]
["Shutesbury","02720000"]
["Silver Hill Horace Mann Charter (District)","04770000"]
["Silver Lake","07600000"]
["Sizer School: A North Central Charter Essential (District)","04740000"]
["Somerset","02730000"]
["Somerset Berkley Regional School District","07630000"]
["Somerville","02740000"]
["South Hadley","02780000"]
["South Middlesex Regional Vocational Technical","08290000"]
["South Shore Charter Public (District)","04880000"]
["South Shore Regional Vocational Technical","08730000"]
["Southampton","02750000"]
["Southborough","02760000"]
["Southbridge","02770000"]
["Southeastern Regional Vocational Technical","08720000"]
["Southern Berkshire","07650000"]
["Southern Worcester County Regional Vocational Technical","08760000"]
["Southwick-Tolland-Granville Regional School District","07660000"]
["Spencer-E Brookfield","07670000"]
["Springfield","02810000"]
["Springfield Preparatory Charter School (District)","35100000"]
["Stoneham","02840000"]
["Stoughton","02850000"]
["Sturbridge","02870000"]
["Sturgis Charter Public (District)","04890000"]
["Sudbury","02880000"]
["Sunderland","02890000"]
["Sutton","02900000"]
["Swampscott","02910000"]
["Swansea","02920000"]
["TEC Connections Academy Commonwealth Virtual School District","39020000"]
["Tantasqua","07700000"]
["Taunton","02930000"]
["Tewksbury","02950000"]
["Tisbury","02960000"]
["Topsfield","02980000"]
["Tri-County Regional Vocational Technical","08780000"]
["Triton","07730000"]
["Truro","03000000"]
["Tyngsborough","03010000"]
["UP Academy Charter School of Boston (District)","04800000"]
["UP Academy Charter School of Dorchester (District)","35050000"]
["Up-Island Regional","07740000"]
["Upper Cape Cod Regional Vocational Technical","08790000"]
["Uxbridge","03040000"]
["Veritas Preparatory Charter School (District)","04980000"]
["Wachusett","07750000"]
["Wakefield","03050000"]
["Wales","03060000"]
["Walpole","03070000"]
["Waltham","03080000"]
["Ware","03090000"]
["Wareham","03100000"]
["Watertown","03140000"]
["Wayland","03150000"]
["Webster","03160000"]
["Wellesley","03170000"]
["Wellfleet","03180000"]
["West Boylston","03220000"]
["West Bridgewater","03230000"]
["West Springfield","03320000"]
["Westborough","03210000"]
["Westfield","03250000"]
["Westford","03260000"]
["Westhampton","03270000"]
["Weston","03300000"]
["Westport","03310000"]
["Westwood","03350000"]
["Weymouth","03360000"]
["Whately","03370000"]
["Whitman-Hanson","07800000"]
["Whittier Regional Vocational Technical","08850000"]
["Williamsburg","03400000"]
["Williamstown","03410000"]
["Wilmington","03420000"]
["Winchendon","03430000"]
["Winchester","03440000"]
["Winthrop","03460000"]
["Woburn","03470000"]
["Worcester","03480000"]
["Worthington","03490000"]
["Wrentham","03500000"]

{"sheet":"ForImport","index":7,"n_rows":2,"n_cols":12,"rows_kept":2,"cut":false,"hidden":true,"merged":[]}
["org8code","centralofficepersonnel","community-based partners","communitymembers","paraprofessionals","principals_schooladministrators","schoolcouncil","schoolcounselors","students","teachers","town_cityofficials","others"]
[{"$f":"valorg8code","v":{"$error":"#NAME?"}},false,false,false,false,false,false,false,false,false,false,false]

{"sheet":"6. Title I, A & D Narrative","index":8,"n_rows":58,"n_cols":19,"rows_kept":58,"cut":false,"hidden":false,"merged":[[31,2,31,6],[16,11,16,12],[17,3,17,10],[17,11,17,12],[18,3,18,10],[18,11,18,12],[30,7,30,8],[31,7,31,8],[20,3,20,10],[20,11,20,12],[24,1,24,14],[26,2,26,6],[28,2,28,6],[25,1,25,6],[32,13,32,14],[32,7,32,8],[25,9,25,10],[25,13,25,14],[25,11,25,12],[30,13,30,14],[1,1,1,7],[9,1,9,14],[26,11,26,12],[10,1,10,2],[10,3,10,10],[10,11,10,12],[23,1,23,3],[26,7,26,8],[2,1,2,3],[4,1,4,13],[21,3,21,10],[11,11,11,12],[21,11,21,12],[16,3,16,10],[2,4,2,11],[11,1,11,2],[11,3,11,10],[5,1,5,4],[8,1,8,3],[12,3,12,10],[12,11,12,12],[11,14,11,15],[29,13,29,14],[31,13,31,14],[49,1,49,8],[39,1,39,3],[41,1,41,13],[39,4,39,13],[43,1,44,8],[38,1,38,3],[46,9,47,12],[43,9,43,10],[44,9,44,10],[46,1,47,8],[36,13,36,14],[36,7,36,8],[35,7,35,8],[36,2,36,6],[13,11,13,12],[13,3,13,10],[35,2,35,6],[35,13,35,14],[34,2,34,6],[27,2,27,6],[33,2,33,6],[33,13,33,14],[27,7,27,8],[33,7,33,8],[29,7,29,8],[29,2,29,6],[32,2,32,6],[19,3,19,10],[19,11,19,12],[11,16,11,17],[10,14,10,15],[10,16,10,17],[34,7,34,8],[34,13,34,14],[25,7,25,8],[26,9,26,10],[26,13,26,14],[27,13,27,14],[28,7,28,8],[28,13,28,14],[14,3,14,10],[14,11,14,12],[15,3,15,10],[15,11,15,12],[30,2,30,6]]}
[]
[null,{"$f":"valDistrName & \" (\"&valorg4code&\")\"","v":"Org Name (Org )"}]
[null,"Title I, Part A",null,null,"Improving Basic Programs (Fund Code 305)"]
[]
[null,"   Program Purpose:\n   To provide all children significant opportunity to receive a fair, equitable, and high-quality education, and to close educational achievement gaps."]
[]
[]
[]
[null,"STEP 6.1\nDescribe Title I, Part A-funded activities from Tab 5. District Strategies"]
[null,"From Tab 5:  District Activities and Strategies\nColumns A & B will populate automatically from Tab 5, Step 5.5, for any activity that you indicate includes Title I, Part A funding.  Starting with Column C, describe only those activities from each strategy/activity that will be funded in whole or in part with Title I , Part A funds."]
[null,"A",null,"B",null,null,null,null,null,null,null,"C",null,"D","E",null,"F",null,"G"]
[null,"Strategy/Activity",null,"Description ",null,null,null,null,null,null,null,"Briefly describe specific activities funded by Title I based on assessment of needs",null,"Grades served by this activity","What data prompted this activity?\n(Select at least one source for each activity; report additional sources/explanation in \"Other\" box at row's end)",null,"What data will you use to determine progress and attainment of goals?\n(Select at least one source for each activity; report additional sources/explanation in \"Other\" box at row's end)",null,"If  you selected \"Other\" in Column E or F,  please describe data that you will use here"]
[{"$f":"IF(C13=\"\",1,0)","v":1},1,{"$f":"IF(ISBLANK('5. Districtwide Strategies'!C44),\"\",IF('5. Districtwide Strategies'!M44<>\"\",'5. Districtwide Strategies'!C44,\"\"))","v":""},{"$f":"IF(ISBLANK('5. Districtwide Strategies'!D44),\"\",IF('5. Districtwide Strategies'!M44<>\"\",'5. Districtwide Strategies'!D44,\"\"))","v":""},null,null,null,null,null,null,null,null,null,null,"Select One","Select One","Select One","Select One"]
[{"$f":"IF(C14=\"\",1,0)","v":1},2,{"$f":"IF(ISBLANK('5. Districtwide Strategies'!C45),\"\",IF('5. Districtwide Strategies'!M45<>\"\",'5. Districtwide Strategies'!C45,\"\"))","v":""},{"$f":"IF(ISBLANK('5. Districtwide Strategies'!D45),\"\",IF('5. Districtwide Strategies'!M45<>\"\",'5. Districtwide Strategies'!D45,\"\"))","v":""},null,null,null,null,null,null,null,null,null,null,"Select One","Select One","Select One","Select One"]
[1,3,{"$f":"IF(ISBLANK('5. Districtwide Strategies'!C46),\"\",IF('5. Districtwide Strategies'!M46<>\"\",'5. Districtwide Strategies'!C46,\"\"))","v":""},{"$f":"IF(ISBLANK('5. Districtwide Strategies'!D46),\"\",IF('5. Districtwide Strategies'!M46<>\"\",'5. Districtwide Strategies'!D46,\"\"))","v":""},null,null,null,null,null,null,null,null,null,null,"Select One","Select One","Select One","Select One"]
[1,4,{"$f":"IF(ISBLANK('5. Districtwide Strategies'!C47),\"\",IF('5. Districtwide Strategies'!M47<>\"\",'5. Districtwide Strategies'!C47,\"\"))","v":""},{"$f":"IF(ISBLANK('5. Districtwide Strategies'!D47),\"\",IF('5. Districtwide Strategies'!M47<>\"\",'5. Districtwide Strategies'!D47,\"\"))","v":""},null,null,null,null,null,null,null,null,null,null,"Select One","Select One","Select One","Select One"]
[1,5,{"$f":"IF(ISBLANK('5. Districtwide Strategies'!C48),\"\",IF('5. Districtwide Strategies'!M48<>\"\",'5. Districtwide Strategies'!C48,\"\"))","v":""},{"$f":"IF(ISBLANK('5. Districtwide Strategies'!D48),\"\",IF('5. Districtwide Strategies'!M48<>\"\",'5. Districtwide Strategies'!D48,\"\"))","v":""},null,null,null,null,null,null,null,null,null,null,"Select One","Select One","Select One","Select One"]
[1,6,{"$f":"IF(ISBLANK('5. Districtwide Strategies'!C49),\"\",IF('5. Districtwide Strategies'!M49<>\"\",'5. Districtwide Strategies'!C49,\"\"))","v":""},{"$f":"IF(ISBLANK('5. Districtwide Strategies'!D49),\"\",IF('5. Districtwide Strategies'!M49<>\"\",'5. Districtwide Strategies'!D49,\"\"))","v":""},null,null,null,null,null,null,null,null,null,null,"Select One","Select One","Select One","Select One"]
[1,7,{"$f":"IF(ISBLANK('5. Districtwide Strategies'!C50),\"\",IF('5. Districtwide Strategies'!M50<>\"\",'5. Districtwide Strategies'!C50,\"\"))","v":""},{"$f":"IF(ISBLANK('5. Districtwide Strategies'!D50),\"\",IF('5. Districtwide Strategies'!M50<>\"\",'5. Districtwide Strategies'!D50,\"\"))","v":""},null,null,null,null,null,null,null,null,null,null,"Select One","Select One","Select One","Select One"]
[1,8,{"$f":"IF(ISBLANK('5. Districtwide Strategies'!C51),\"\",IF('5. Districtwide Strategies'!M51<>\"\",'5. Districtwide Strategies'!C51,\"\"))","v":""},{"$f":"IF(ISBLANK('5. Districtwide Strategies'!D51),\"\",IF('5. Districtwide Strategies'!M51<>\"\",'5. Districtwide Strategies'!D51,\"\"))","v":""},null,null,null,null,null,null,null,null,null,null,"Select One","Select One","Select One","Select One"]
[1,9,{"$f":"IF(ISBLANK('5. Districtwide Strategies'!C52),\"\",IF('5. Districtwide Strategies'!M52<>\"\",'5. Districtwide Strategies'!C52,\"\"))","v":""},{"$f":"IF(ISBLANK('5. Districtwide Strategies'!D52),\"\",IF('5. Districtwide Strategies'!M52<>\"\",'5. Districtwide Strategies'!D52,\"\"))","v":""},null,null,null,null,null,null,null,null,null,null,"Select One","Select One","Select One","Select One"]
[1,10,{"$f":"IF(ISBLANK('5. Districtwide Strategies'!C53),\"\",IF('5. Districtwide Strategies'!M53<>\"\",'5. Districtwide Strategies'!C53,\"\"))","v":""},{"$f":"IF(ISBLANK('5. Districtwide Strategies'!D53),\"\",IF('5. Districtwide Strategies'!M53<>\"\",'5. Districtwide Strategies'!D53,\"\"))","v":""},null,null,null,null,null,null,null,null,null,null,"Select One","Select One","Select One","Select One"]
[]
[null,"STEP 6.2\nDescribe Title I, Part A-funded activities not included in Tab 5. District Strategies"]
[null,"Title I-funded activities not listed above from Tab 5.\nStarting with Column A, describe  activities not listed above that will be funded in whole or in part with Title I , Part A funds. "]
[null,"Describe activities funded by Title I not listed above",null,null,null,null,null,"Grades served by this activities",null,"What data prompted this activity?\n(Select at least one source for each activity; report additional sources/explanation in \"Other\" box at row's end)",null,"What data will you use to determine progress and attainment of goals?\n(Select at least one source for each activity; report additional sources/explanation in \"Other\" box at row's end)",null,"If  you selected \"Other\" in Column D or E,  please describe data that you will use here"]
[null,null,"A",null,null,null,null,"B",null,"C",null,"D",null,"E"]
[null,1,null,null,null,null,null,null,null,"Select One","Select One","Select One","Select One"]
[null,2,null,null,null,null,null,null,null,"Select One","Select One","Select One","Select One"]
[null,3,null,null,null,null,null,null,null,"Select One","Select One","Select One","Select One"]
[null,4,null,null,null,null,null,null,null,"Select One","Select One","Select One","Select One"]
[null,5,null,null,null,null,null,null,null,"Select One","Select One","Select One","Select One"]
[null,6,null,null,null,null,null,null,null,"Select One","Select One","Select One","Select One"]
[null,7,null,null,null,null,null,null,null,"Select One","Select One","Select One","Select One"]
[null,8,null,null,null,null,null,null,null,"Select One","Select One","Select One","Select One"]
[null,9,null,null,null,null,null,null,null,"Select One","Select One","Select One","Select One"]
[null,10,null,null,null,null,null,null,null,"Select One","Select One","Select One","Select One"]
[]
[null,"STEP 6.3\nTitle I, Part D, Subpart 2"]
[null,"Title I, Part D\nSubpart 2",null,null,"Prevention and Intervention Programs for Children and Youth Who Are Neglected, Delinquent or At Risk"]
[]
[null,"   Program Purpose:\n   (1) to improve educational services for children and youth in local, tribal, and State institutions for neglected or delinquent children and youth so that such children and youth \n         have the opportunity to meet the same challenging State academic standards that all children in the State are expected to meet;\n   (2) to provide such children and youth with the services needed to make a successful transition from institutionalization to further schooling or employment;  and\n   (3) to prevent at-risk youth from dropping out of school, and to provide dropouts, and children and youth returning  from correctional facilities or institutions for neglected or\n         delinquent children and youth, with a support system to  ensure their continued education and the involvement of their families and communities.\n  "]
[null," "]
[null,"Have you uploaded the following documents regarding any residential facility providing services to neglected or delinquent children and youth in your district with this application as an attachment in EdGrants: \n\n(If your district exceeds space limitations for uploading documents in EdGrants, please contact your DESE grants liaison for alternatives).",null,null,null,null,null,null,null,"Formal agreement"]
[null,null,null,null,null,null,null,null,null,"Budget showing how Title I \nPart D-2 funds will be spent"]
[]
[null,"\nIf you have not uploaded your formal agreement and/or budget, please explain."]
[]
[]
[null,"Referring to your formal agreement for services for FY19, please check all information contained in the agreement:"]
[]
[null,null,"Description of all services to be provided to neglected or delinquent youth"]
[null,null,"How participating schools and facilities will coordinate work with neglected or delinquent youth, including coordination with social, health and other service providers"]
[null,null,"How transitions will be coordinated between schools and facilities for children returning from correctional facilities"]
[null,null,"How students with different characteristics and needs will be served, including making the facilities aware of existing individualized education programs"]
[null,null,"Any partnerships with local business to provide training and other services for participating students"]
[null,null,"How the program will involve parents in improvement efforts for participants"]
[null,null,"How this program will be coordinated with other federal, state and local programs serving at-risk children and youth"]

{"sheet":"7. Title I, A Reservations","index":9,"n_rows":42,"n_cols":8,"rows_kept":42,"cut":false,"hidden":false,"merged":[[8,9,42,16],[19,4,19,5],[28,1,30,1],[39,3,39,6],[28,3,28,7],[30,3,30,5],[34,3,34,5],[36,3,36,5],[38,3,38,5],[24,3,24,5],[25,3,25,6],[20,3,20,5],[1,1,1,5],[2,6,2,7],[12,3,12,5],[13,3,13,5],[5,1,5,4],[7,1,7,3],[3,1,3,7],[5,6,5,7],[8,3,9,7],[10,3,10,5],[11,3,11,5],[8,1,10,1]]}
[]
[null,{"$f":"valDistrName & \" (\"&valorg4code&\")\"","v":"Org Name (Org )"}]
[]
[null,"FY19 Title I District Reservation Worksheet "]
[]
[null,null,null,null,null,"Title I Grant Allocation:",{"$f":"valAllocationFlexT1","v":0}]
[]
[]
[null,"Step 7.1",null,"Enter district reservations as appropriate"]
[]
[null,null,null,"Equitable participation for private school students (populated from private schools worksheet)",null,null,{"$f":"valPrivateSchoolT1","v":0},{"$f":"IF($G$6=0,0,G11/$G$6)","v":0}]
[null,null,null,"Family engagement (at least 1% required for districts with allocations of $500,000 or greater)",null,null,null,{"$f":"IF($G$6=0,0,G12/$G$6)","v":0}]
[null,null,null,"Services for locally operated institutions for neglected or delinquent children and youth (districts with local N/D institutions only)",null,null,null,0]
[null,null,null,"Administrative services (optional)",null,null,null,0]
[null,null,null,"Preschool programs (optional)",null,null,null,0]
[null,null,null,"Services for homeless students (see TIP, please describe any non-Title I services for homeless students below)",null,null,null,0]
[null,null,null,"Foster care transportation (optional)",null,null,null,0]
[null,null,null,"Indirect costs (optional, but may not exceed district rate)",null,null,null,0]
[null,null,null,"MTRS (optional)",null,null,null,0]
[null,null,null,"Other (describe)",null,null,null,0]
[null,null,null,"TOTAL reservation ",null,null,{"$f":"SUM(G11:G20)","v":0},0]
[]
[null,null,null,"Balance remaining for school allocations:",null,null,{"$f":"G6-G21","v":0}]
[]
[null,null,null,"Please describe any services that the district is providing to students who are homeless from non-Title-I resources to meet assessed needs."]
[]
[]
[]
[null,"Step 7.2",null,"Confirm minimum per-pupil amount for school allocations"]
[]
[null,null,null,"Total number of children from low-income families districtwide",null,null,{"$f":"TotalLowInc","v":0}]
[]
[null,null,"*","Minimum per pupil amount for districts serving any school below 35% poverty ",null,null,{"$f":"IF('8. Title I, A School Funding'!U160=0,0,IF('8. Title I, A School Funding'!U160<>valSwitchFormula, (G6/G31)*1.25,\"\"))","v":0}]
[]
[null,null,"*","Minimum per pupil amount for districts serving only schools at/above 35% poverty\n",null,null,{"$f":"IF('8. Title I, A School Funding'!U160=0,0,IF(valSwitchFormula='8. Title I, A School Funding'!U160,G23/G31,\"\"))","v":0}]
[]
[null,null,null,"Districts serving only schools at/above 35% poverty may select their own district-determined amount:",null,null,0]
[]
[null,null,null," (If a district-determined amount was selected, please describe method below)"]
[]
[]
[null,null,"*","Note: Minimum per pupil calculations are not complete until program type (Column 3b/Title I School Funding worksheet, Tab 8) has been selected for all served schools. "]

{"sheet":"8. Title I, A School Funding","index":10,"n_rows":198,"n_cols":21,"rows_kept":198,"cut":false,"hidden":false,"merged":[[5,9,5,11],[6,3,6,5],[180,1,196,14],[13,4,15,4],[13,14,15,14],[10,10,11,14],[13,3,15,3],[13,1,14,2],[13,10,15,10],[165,1,179,14],[197,1,239,21],[1,1,1,5],[9,1,9,7],[158,1,158,7],[13,6,15,6],[13,13,15,13],[13,5,15,5],[13,7,15,7],[13,8,15,8],[13,9,15,9],[13,12,15,12],[13,11,15,11],[4,13,4,14],[9,10,9,14],[4,3,4,5],[5,3,5,6]]}
[]
[null,{"$f":"valDistrName & \" (\"&valorg4code&\")\"","v":"Org Name (Org )"}]
[null,"FY19 Title I School Funding Worksheet"]
[]
[null,null,"SW","Schoolwide Program",null,null,null,null,null,"     District-Wide Low-Income Percentage:",null,null,null,{"$f":"IFERROR(TotalLowInc/J159,\"\")","v":""}]
[null,null,"TA","Targeted Assistance Program",null,null,null,null,null,"     Minimum Per Pupil Amount:",null,null,{"$f":"IF(PPMinbelow<>\"\", PPMinbelow,PPMinabove)","v":0}]
[null,null,"NT","Non-Title I "]
[null,null,"CL","Closed School"]
[]
[null,"STEP 8.1: Select low-income data source & click OK \n(Default low-income enrollment is March Eco Dis x 1.6)",null,null,null,null,null,null,null,null,"Step 8.2: Method of qualifying Title I Schools"]
[]
[]
[]
[null,"STEP 8.3: \nEnter Title I status in column 3b and additional data for district schools  Do Not Cut and Paste",null,"Grand-fathered Schools\n\n(place \"x\" in box, see Tip) ","Prioritized HS with >50% low-income enrollment\n (place \"x\" in box, see Tip)","Grade Span Grouping ","Grades Served by School","FY18 Program Type ","FY19 Program Type ","Total # of Children Enrolled in School ","Total # of Children From Low-Income Families","Maximum Low-Income Enrollment \n(may not exceed Col. 4, see Tip)","Percent Low-Income ","Enter Allocation for Each Title I School \n","Per Pupil Amount \n(Col. 8/Col. 6, see above box for min. per pupil amount)"]
[]
[]
[null,"School Name 1(a)","School Code 1(b)","1(c)","1(d)","2(a)","2(b)","3(a)","3(b)","4","5","6","7","8","9","Copy to Master","Grade Order","75% rule","Sort Order",null,"Switchformula"]
[null,null,null,null,null,null,null,null,null,null,null,{"$f":"IF(K18>J18, J18,K18)","v":0},{"$f":"IFERROR(L18/J18,\" \")","v":" "}]
[null,null,null,null,null,null,null,null,null,null,null,{"$f":"IF(K19>J19, J19,K19)","v":0},{"$f":"IFERROR(L19/J19,\" \")","v":" "},null,{"$f":"IF(OR(L19=\"\",N19=\"\"),\"\",IFERROR(N19/L19,\"\"))","v":""},{"$f":"IF(C19=\"\",0,1)","v":0},6,1,100,null,{"$f":"IF(OR(C19=\"\",I19=\"NT\",I19=\"\",I19=\"CL\"),\"\",IF(OR(I19=\"SW\", I19=\"TA\"),IF(M19>=0.35,1,0),0))","v":""}]
[null,null,null,null,null,null,null,null,null,null,null,{"$f":"IF(K20>J20, J20,K20)","v":0},{"$f":"IFERROR(L20/J20,\" \")","v":" "},null,{"$f":"IF(OR(L20=\"\",N20=\"\"),\"\",IFERROR(N20/L20,\"\"))","v":""},{"$f":"IF(C20=\"\",0,1)","v":0},5,1,100,null,{"$f":"IF(OR(C20=\"\",I20=\"NT\",I20=\"\",I20=\"CL\"),\"\",IF(OR(I20=\"SW\", I20=\"TA\"),IF(M20>=0.35,1,0),0))","v":""}]
[null,null,null,null,null,null,null,null,null,null,null,{"$f":"IF(K21>J21, J21,K21)","v":0},{"$f":"IFERROR(L21/J21,\" \")","v":" "},null,{"$f":"IF(OR(L21=\"\",N21=\"\"),\"\",IFERROR(N21/L21,\"\"))","v":""},{"$f":"IF(C21=\"\",0,1)","v":0},2,0,2,null,{"$f":"IF(OR(C21=\"\",I21=\"NT\",I21=\"\",I21=\"CL\"),\"\",IF(OR(I21=\"SW\", I21=\"TA\"),IF(M21>=0.35,1,0),0))","v":""}]
[null,null,null,null,null,null,null,null,null,null,null,{"$f":"IF(K22>J22, J22,K22)","v":0},{"$f":"IFERROR(L22/J22,\" \")","v":" "},null,{"$f":"IF(OR(L22=\"\",N22=\"\"),\"\",IFERROR(N22/L22,\"\"))","v":""},{"$f":"IF(C22=\"\",0,1)","v":0},5,1,null,null,{"$f":"IF(OR(C22=\"\",I22=\"NT\",I22=\"\",I22=\"CL\"),\"\",IF(OR(I22=\"SW\", I22=\"TA\"),IF(M22>=0.35,1,0),0))","v":""}]
[null,null,null,null,null,null,null,null,null,null,null,0," ",null,"",0,5,1,null,null,""]
[null,null,null,null,null,null,null,null,null,null,null,0," ",null,"",0,5,1,null,null,""]
[null,null,null,null,null,null,null,null,null,null,null,0," ",null,"",0,5,1,null,null,""]
[null,null,null,null,null,null,null,null,null,null,null,0," ",null,"",0,5,1,null,null,""]
[null,null,null,null,null,null,null,null,null,null,null,0," ",null,"",0,5,1,null,null,""]
[null,null,null,null,null,null,null,null,null,null,null,0," ",null,"",0,3,1,null,null,""]
[null,null,null,null,null,null,null,null,null,null,null,0," ",null,"",0,6,1,null,null,""]
[null,null,null,null,null,null,null,null,null,null,null,{"$f":"IF(K30>J30, J30,K30)","v":0},{"$f":"IFERROR(L30/J30,\" \")","v":" "},null,{"$f":"IF(OR(L30=\"\",N30=\"\"),\"\",IFERROR(N30/L30,\"\"))","v":""},{"$f":"IF(C30=\"\",0,1)","v":0},6,1,null,null,{"$f":"IF(OR(C30=\"\",I30=\"NT\",I30=\"\",I30=\"CL\"),\"\",IF(OR(I30=\"SW\", I30=\"TA\"),IF(M30>=0.35,1,0),0))","v":""}]
[null,null,null,null,null,null,null,null,null,null,null,0," ",null,"",0,6,0,null,null,""]
[null,null,null,null,null,null,null,null,null,null,null,0," ",null,"",0,6,0,null,null,""]
[null,null,null,null,null,null,null,null,null,null,null,0," ",null,"",0,6,0,null,null,""]
[null,null,null,null,null,null,null,null,null,null,null,0," ",null,"",0,6,0,null,null,""]
[null,null,null,null,null,null,null,null,null,null,null,0," ",null,"",0,6,0,null,null,""]
[null,null,null,null,null,null,null,null,null,null,null,0," ",null,"",0,6,0,null,null,""]
[null,null,null,null,null,null,null,null,null,null,null,0," ",null,"",0,6,0,null,null,""]
[null,null,null,null,null,null,null,null,null,null,null,0," ",null,"",0,6,0,null,null,""]
[null,null,null,null,null,null,null,null,null,null,null,0," ",null,"",0,6,0,null,null,""]
[null,null,null,null,null,null,null,null,null,null,null,0," ",null,"",0,6,0,null,null,""]
[null,null,null,null,null,null,null,null,null,null,null,0," ",null,"",0,6,0,null,null,""]
[null,null,null,null,null,null,null,null,null,null,null,0," ",null,"",0,6,0,null,null,""]
[null,null,null,null,null,null,null,null,null,null,null,0," ",null,"",0,6,0,null,null,""]
[null,null,null,null,null,null,null,null,null,null,null,0," ",null,"",0,6,0,null,null,""]
[null,null,null,null,null,null,null,null,null,null,null,0," ",null,"",0,6,0,null,null,""]
[null,null,null,null,null,null,null,null,null,null,null,0," ",null,"",0,6,0,null,null,""]
[null,null,null,null,null,null,null,null,null,null,null,0," ",null,"",0,6,0,null,null,""]
[null,null,null,null,null,null,null,null,null,null,null,0," ",null,"",0,6,0,null,null,""]
[null,null,null,null,null,null,null,null,null,null,null,0," ",null,"",0,6,0,null,null,""]
[null,null,null,null,null,null,null,null,null,null,null,0," ",null,"",0,6,0,null,null,""]
[null,null,null,null,null,null,null,null,null,null,null,0," ",null,"",0,6,0,null,null,""]
[null,null,null,null,null,null,null,null,null,null,null,0," ",null,"",0,6,0,null,null,""]
[null,null,null,null,null,null,null,null,null,null,null,0," ",null,"",0,4,0,null,null,""]
[null,null,null,null,null,null,null,null,null,null,null,0," ",null,"",0,4,0,null,null,""]
[null,null,null,null,null,null,null,null,null,null,null,0," ",null,"",0,4,0,null,null,""]
[null,null,null,null,null,null,null,null,null,null,null,0," ",null,"",0,4,0,null,null,""]
[null,null,null,null,null,null,null,null,null,null,null,0," ",null,"",0,3,0,null,null,""]
[null,null,null,null,null,null,null,null,null,null,null,0," ",null,"",0,3,0,null,null,""]
[null,null,null,null,null,null,null,null,null,null,null,0," ",null,"",0,3,0,null,null,""]
[null,null,null,null,null,null,null,null,null,null,null,0," ",null,"",0,3,0,null,null,""]
[null,null,null,null,null,null,null,null,null,null,null,0," ",null,"",0,3,0,null,null,""]
[null,null,null,null,null,null,null,null,null,null,null,0," ",null,"",0,2,0,null,null,""]
[null,null,null,null,null,null,null,null,null,null,null,0," ",null,"",0,2,0,null,null,""]
[null,null,null,null,null,null,null,null,null,null,null,{"$f":"IF(K64>J64, J64,K64)","v":0},{"$f":"IFERROR(L64/J64,\" \")","v":" "},null,{"$f":"IF(OR(L64=\"\",N64=\"\"),\"\",IFERROR(N64/L64,\"\"))","v":""},{"$f":"IF(C64=\"\",0,1)","v":0},6,1,null,null,""]
[null,null,null,null,null,null,null,null,null,null,null,0," ",null,"",0,5,1,null,null,""]
[null,null,null,null,null,null,null,null,null,null,null,0," ",null,"",0,2,1,null,null,""]
[null,null,null,null,null,null,null,null,null,null,null,0," ",null,"",0,3,1,null,null,""]
[null,null,null,null,null,null,null,null,null,null,null,0," ",null,"",0,6,1,null,null,""]
[null,null,null,null,null,null,null,null,null,null,null,0," ",null,"",0,6,1,null,null,""]
[null,null,null,null,null,null,null,null,null,null,null,0," ",null,"",0,4,1,null,null,""]
[null,null,null,null,null,null,null,null,null,null,null,0," ",null,"",0,6,1,null,null,""]
[null,null,null,null,null,null,null,null,null,null,null,0," ",null,"",0,6,1,null,null,""]
[null,null,null,null,null,null,null,null,null,null,null,0," ",null,"",0,2,1,null,null,""]
[null,null,null,null,null,null,null,null,null,null,null,0," ",null,"",0,5,1,null,null,""]
[null,null,null,null,null,null,null,null,null,null,null,0," ",null,"",0,5,1,null,null,""]
[null,null,null,null,null,null,null,null,null,null,null,0," ",null,"",0,6,1,null,null,""]
[null,null,null,null,null,null,null,null,null,null,null,0," ",null,"",0,5,1,null,null,""]
[null,null,null,null,null,null,null,null,null,null,null,0," ",null,"",0,3,1,null,null,""]
[null,null,null,null,null,null,null,null,null,null,null,0," ",null,"",0,6,1,null,null,""]
[null,null,null,null,null,null,null,null,null,null,null,0," ",null,"",0,6,1,null,null,""]
[null,null,null,null,null,null,null,null,null,null,null,0," ",null,"",0,5,1,null,null,""]
[null,null,null,null,null,null,null,null,null,null,null,0," ",null,"",0,3,1,null,null,""]
[null,null,null,null,null,null,null,null,null,null,null,{"$f":"IF(K83>J83, J83,K83)","v":0},{"$f":"IFERROR(L83/J83,\" \")","v":" "},null,{"$f":"IF(OR(L83=\"\",N83=\"\"),\"\",IFERROR(N83/L83,\"\"))","v":""},{"$f":"IF(C83=\"\",0,1)","v":0},6,1,null,null,""]
[null,null,null,null,null,null,null,null,null,null,null,0," ",null,"",0,2,1,null,null,{"$f":"IF(OR(C84=\"\",I84=\"NT\",I84=\"\",I84=\"CL\"),\"\",IF(OR(I84=\"SW\", I84=\"TA\"),IF(M84>=0.35,1,0),0))","v":""}]
[null,null,null,null,null,null,null,null,null,null,null,0," ",null,"",0,2,1,null,null,""]
[null,null,null,null,null,null,null,null,null,null,null,0," ",null,"",0,3,1,null,null,""]
[null,null,null,null,null,null,null,null,null,null,null,0," ",null,"",0,5,1,null,null,""]
[null,null,null,null,null,null,null,null,null,null,null,0," ",null,"",0,3,1,null,null,""]
[null,null,null,null,null,null,null,null,null,null,null,0," ",null,"",0,3,1,null,null,""]
[null,null,null,null,null,null,null,null,null,null,null,0," ",null,"",0,6,1,null,null,""]
[null,null,null,null,null,null,null,null,null,null,null,0," ",null,"",0,5,1,null,null,""]
[null,null,null,null,null,null,null,null,null,null,null,0," ",null,"",0,6,1,null,null,""]
[null,null,null,null,null,null,null,null,null,null,null,0," ",null,"",0,3,1,null,null,""]
[null,null,null,null,null,null,null,null,null,null,null,0," ",null,"",0,7,1,null,null,""]
[null,null,null,null,null,null,null,null,null,null,null,0," ",null,"",0,3,1,null,null,""]
[null,null,null,null,null,null,null,null,null,null,null,0," ",null,"",0,5,1,null,null,""]
[null,null,null,null,null,null,null,null,null,null,null,0," ",null,"",0,5,1,null,null,""]
[null,null,null,null,null,null,null,null,null,null,null,0," ",null,"",0,3,1,null,null,""]
[null,null,null,null,null,null,null,null,null,null,null,0," ",null,"",0,2,1,null,null,""]
[null,null,null,null,null,null,null,null,null,null,null,0," ",null,"",0,6,1,null,null,""]
[null,null,null,null,null,null,null,null,null,null,null,0," ",null,"",0,3,1,null,null,""]
[null,null,null,null,null,null,null,null,null,null,null,0," ",null,"",0,6,1,null,null,""]
[null,null,null,null,null,null,null,null,null,null,null,0," ",null,"",0,2,1,null,null,""]
[null,null,null,null,null,null,null,null,null,null,null,0," ",null,"",0,6,1,null,null,""]
[null,null,null,null,null,null,null,null,null,null,null,0," ",null,"",0,6,1,null,null,""]
[null,null,null,null,null,null,null,null,null,null,null,0," ",null,"",0,5,1,null,null,""]
[null,null,null,null,null,null,null,null,null,null,null,0," ",null,"",0,5,1,null,null,""]
[null,null,null,null,null,null,null,null,null,null,null,0," ",null,"",0,5,1,null,null,""]
[null,null,null,null,null,null,null,null,null,null,null,0," ",null,"",0,6,1,null,null,""]
[null,null,null,null,null,null,null,null,null,null,null,0," ",null,"",0,7,1,null,null,""]
[null,null,null,null,null,null,null,null,null,null,null,0," ",null,"",0,3,1,null,null,""]
[null,null,null,null,null,null,null,null,null,null,null,0," ",null,"",0,6,1,null,null,""]
[null,null,null,null,null,null,null,null,null,null,null,0," ",null,"",0,7,0,null,null,""]
[null,null,null,null,null,null,null,null,null,null,null,0," ",null,"",0,7,0,null,null,""]
[null,null,null,null,null,null,null,null,null,null,null,{"$f":"IF(K115>J115, J115,K115)","v":0},{"$f":"IFERROR(L115/J115,\" \")","v":" "},null,{"$f":"IF(OR(L115=\"\",N115=\"\"),\"\",IFERROR(N115/L115,\"\"))","v":""},{"$f":"IF(C115=\"\",0,1)","v":0},7,0,null,null,""]
[null,null,null,null,null,null,null,null,null,null,null,0," ",null,"",0,6,0,null,null,""]
[null,null,null,null,null,null,null,null,null,null,null,0," ",null,"",0,6,0,null,null,""]
[null,null,null,null,null,null,null,null,null,null,null,0," ",null,"",0,6,0,null,null,""]
[null,null,null,null,null,null,null,null,null,null,null,0," ",null,"",0,6,0,null,null,""]
[null,null,null,null,null,null,null,null,null,null,null,0," ",null,"",0,6,0,null,null,""]
[null,null,null,null,null,null,null,null,null,null,null,0," ",null,"",0,6,0,null,null,""]
[null,null,null,null,null,null,null,null,null,null,null,0," ",null,"",0,5,0,null,null,""]
[null,null,null,null,null,null,null,null,null,null,null,0," ",null,"",0,5,0,null,null,""]
[null,null,null,null,null,null,null,null,null,null,null,0," ",null,"",0,5,0,null,null,""]
[null,null,null,null,null,null,null,null,null,null,null,0," ",null,"",0,5,0,null,null,""]
[null,null,null,null,null,null,null,null,null,null,null,0," ",null,"",0,5,0,null,null,""]
[null,null,null,null,null,null,null,null,null,null,null,0," ",null,"",0,5,0,null,null,""]
[null,null,null,null,null,null,null,null,null,null,null,0," ",null,"",0,5,0,null,null,""]
[null,null,null,null,null,null,null,null,null,null,null,0," ",null,"",0,5,0,null,null,""]
[null,null,null,null,null,null,null,null,null,null,null,0," ",null,"",0,5,0,null,null,""]
[null,null,null,null,null,null,null,null,null,null,null,0," ",null,"",0,5,0,null,null,""]
[null,null,null,null,null,null,null,null,null,null,null,0," ",null,"",0,3,0,null,null,""]
[null,null,null,null,null,null,null,null,null,null,null,0," ",null,"",0,3,0,null,null,""]
[null,null,null,null,null,null,null,null,null,null,null,0," ",null,"",0,2,0,null,null,""]
[null,null,null,null,null,null,null,null,null,null,null,0," ",null,"",0,2,0,null,null,""]
[null,null,null,null,null,null,null,null,null,null,null,0," ",null,"",0,2,0,null,null,""]
[null,null,null,null,null,null,null,null,null,null,null,{"$f":"IF(K137>J137, J137,K137)","v":0},{"$f":"IFERROR(L137/J137,\" \")","v":" "},null,{"$f":"IF(OR(L137=\"\",N137=\"\"),\"\",IFERROR(N137/L137,\"\"))","v":""},{"$f":"IF(C137=\"\",0,1)","v":0},null,null,null,null,""]
[null,null,null,null,null,null,null,null,null,null,null,0," ",null,"",0,null,null,null,null,""]
[null,null,null,null,null,null,null,null,null,null,null,0," ",null,"",0,null,null,null,null,""]
[null,null,null,null,null,null,null,null,null,null,null,0," ",null,"",0,null,null,null,null,""]
[null,null,null,null,null,null,null,null,null,null,null,0," ",null,"",0,null,null,null,null,""]
[null,null,null,null,null,null,null,null,null,null,null,0," ",null,"",0,null,null,null,null,""]
[null,null,null,null,null,null,null,null,null,null,null,0," ",null,"",0,null,null,null,null,""]
[null,null,null,null,null,null,null,null,null,null,null,0," ",null,"",0,null,null,null,null,""]
[null,null,null,null,null,null,null,null,null,null,null,0," ",null,"",0,null,null,null,null,""]
[null,null,null,null,null,null,null,null,null,null,null,0,{"$f":"IFERROR(L146/J146,\" \")","v":" "},null,"",0,null,null,null,null,""]
[null,null,null,null,null,null,null,null,null,null,null,0," ",null,"",{"$f":"IF(C147=\"\",0,1)","v":0},null,null,null,null,""]
[null,null,null,null,null,null,null,null,null,null,null,0," ",null,{"$f":"IF(OR(L148=\"\",N148=\"\"),\"\",IFERROR(N148/L148,\"\"))","v":""},0,null,null,null,null,{"$f":"IF(OR(C148=\"\",I148=\"NT\",I148=\"\",I148=\"CL\"),\"\",IF(OR(I148=\"SW\", I148=\"TA\"),IF(M148>=0.35,1,0),0))","v":""}]
[null,null,null,null,null,null,null,null,null,null,null,0," ",null,"",0,null,null,null,null,""]
[null,null,null,null,null,null,null,null,null,null,null,0," ",null,"",0,null,null,null,null,""]
[null,null,null,null,null,null,null,null,null,null,null,0," ",null,"",0,null,null,null,null,""]
[null,null,null,null,null,null,null,null,null,null,null,0," ",null,"",0,null,null,null,null,""]
[null,null,null,null,null,null,null,null,null,null,null,0," ",null,"",0,null,null,null,null,""]
[null,null,null,null,null,null,null,null,null,null,null,0," ",null,"",0,null,null,null,null,""]
[null,null,null,null,null,null,null,null,null,null,null,0," ",null,"",0,null,null,null,null,""]
[null,null,null,null,null,null,null,null,null,null,null,0," ",null,"",0,null,null,null,null,""]
[null,null,null,null,null,null,null,null,null,null,null,0," ",null,"",0,null,null,null,null,""]
[null,null,null,null,null,null,null,null,null,null,null,0," ",null,"",0,null,null,null,null,""]
[null,null,null,null,null,null,null,null,null,{"$f":"SUM(J19:J158)","v":0},{"$f":"SUM(K19:K158)","v":0},{"$f":"SUM(L19:L158)","v":0},null,{"$f":"SUM($N$19:$N$158)","v":0},null,null,null,null,null,null,{"$f":"SUM(U19:U158)","v":0}]
[null,null,null,null,null,null,null,null,null,null,null,null,null,null,null,null,null,null,null,null,{"$f":"COUNTIF(U19:U158, 0)+COUNTIF(U19:U158,1)","v":0}]
[]
[]
[]
[null,null,null,null,null,null,null,null,null,null,null,null,{"$f":"SUMIF(I19:I158,{\"TA\"},L19:L158)+SUMIF(I19:I158,{\"SW\"},L19:L158)","v":0}]
[]
[null,"Instructions:  \n\nThe School Funding worksheet has three main sections:\n\n• Step 8.1: The district selects the date and type of the low-income data the district is using to determine schools eligible to be served with Title I funds. Click the OK button to proceed.\n• Step 8.2: The district chooses a method for qualifying Title I schools. Click the OK button to proceed.\n• Step 8.3: The district designates schools as Title I and enters additional data for the district’s schools.  Once this section is complete, the district will be able to see the required amount reserved for private schools in Step 7.1 of the District Reservation tab. \n\nStep 8.1:  Select the type of poverty data used to identify eligible schools:  Federal law requires the district to rank all of its school attendance areas (the geographic area from which a public school draws its children) according to their percent of poverty. The first task is to select the source of the poverty data the district is using to identify eligible schools using the drop-down menu in Step 8.1. The default source of enrollment and poverty data that will automatically populate when the district name is chosen on the cover page is the March Economically Disadvantaged data multiplied by 1.6.  Selecting Economically Disadvantaged data as an option automatically populates Column 4 (Total Number of Children Enrolled in Schools in Column 1). The School Funding worksheet automatically calculates the poverty percentage of each school. However, if you chose \"other\" for poverty data source, contact your liaison to adjust your workbook.\n\n\n"]
[]
[]
[]
[]
[]
[]
[]
[]
[]
[]
[]
[]
[]
[]
[null,"Step 8.2:  Using the drop-down menu, select a method of qualifying Title I schools that allows the district to appropriately allocate resources to the school attendance areas that would benefit most from Title I funds. Broadly speaking, the district may choose to use a district-wide ranking or rank school attendance areas by grade span groupings. \n\n• Option 1 is the district-wide low-income percentage method. Under this qualifying method, schools at or above the district-wide poverty average are eligible for services; as such, money may run out before serving all of these schools. If selected, the School Funding worksheet will automatically sort all schools in rank order by low-income percentage based on the data source used to determine eligible Title I school attendance areas.\n• Option 2 is the grade span grouping/district-wide percentage method. Under this qualifying method, schools serving the same grades are grouped together, and any school at or above the district-wide poverty average in each group is eligible for services. If selected, the School Funding worksheet will automatically sort the schools by grade span and then by low-income percentage based on the data source used to determine eligible Title I school attendance areas.\n• Option 3 is the 35% rule. Under this qualifying method, all district schools at or above 35% poverty are eligible for services; as such, funds may be insufficient to serve all schools down to the 35% poverty level.\n• Option 4 is the grade span grouping/35% rule. Under this qualifying method, schools with similar grade spans are grouped together and any school at or above 35% poverty in each group is eligible for services. \n• Option 5 is the grade span grouping/group-wide percentage method. Under this qualifying method, schools serving the same grades are grouped together and any school at or above the group-wide poverty average in each group is eligible for services.\n• Options 6 and 7 apply to smaller districts and single-school districts. If the district contains one school per grade span or if the total enrollment of the district is less than 1,000 students, then the district is not required to rank-order schools and consequently may serve any school.  Districts in this category with more than one school should be able to justify which schools will be served by Title I. \n\n"]
[]
[]
[]
[]
[]
[]
[]
[]
[]
[]
[]
[]
[]
[]
[]
[]
[null,"General Rules for 8.2: \n\n• Because the district may only use the grade span grouping option after schools above 75% poverty are served regardless of grade span (and, at the district's option, high schools with > 50% poverty), the School Funding worksheet will always first rank schools above 75% poverty, regardless of grade span.\n\n• A district that opts to serve schools at or below 75 percent poverty using grade-span groupings may determine higher or lower per-pupil amounts for different grade spans as long as those amounts do not exceed the amount allocated to any area or school above 75 percent poverty. Per-pupil amounts within grade spans may vary, but the district may not allocate higher per-pupil amounts to areas or schools with lower poverty rates within grade spans.\n\n• The same method of qualifying schools must be used for all groupings. For example, if there are three grade span groupings, all three must use the 35% rule, or all three must use district-wide poverty average, or each must use its group-wide poverty average.\n \nStep 8.3\nIndicate which schools will receive Title I, Part A services by clicking a cell and selecting from one of four options (select this coming school year’s (FY19) program type in column 3b):\n\n• Select “SW” (schoolwide) if the school will conduct a schoolwide program as defined under federal regulations in the coming school year. As a general rule, only schools with 40% or higher poverty percentages can implement schoolwide programs. For detailed information on schoolwide programs, go here.\n• Select “TA” (Targeted Assistance) if the school will conduct a targeted assistance program in the coming school year.\n• Select “NT” (Non-Title I) if the school will not receive Title I funding.\n• Select “CL” (Closed) if the school will be closed in the coming school year.\n\nNote:   The district may elect to “skip” an eligible school attendance area or school that has a higher percentage of children from low-income families than a school that is served only if the following criteria are met: (1) The school meets the Title I comparability requirements; (2) The school is receiving supplemental funds from other State or local sources that are spent according to the requirements of Section 1114 or 1115 of Title I, Part A; and (3) The funds expended from such other sources equal or exceed the amount that would be provided under Title I, Part A.\nPlease note, however, that eligible private school children who reside in a “skipped” attendance area must be provided Title I services even though the public school attendance area is skipped.\n\nIndicate “grandfathered” and/or preferred high schools (>50% poverty), if applicable.  Districts may designate and serve a school attendance area or school that is not eligible this year, but that was eligible and served in the preceding fiscal year, but only for one (1) additional fiscal year.  Districts may also prioritize high schools with greater than 50% poverty (these schools should be ranked in order after schools with 75% poverty or greater). Place an “X” in Column 1(c) for any grandfathered school and in 1(d) for any high school above 50% poverty that the district chooses to prioritize.\n\nEnter the actual Title I allocation per school in the appropriate cell in Column 8. Keep in mind the two basic rules of allocation. First, all school allocations, except for the last served, must meet minimum per-pupil amounts figured on Tab 7 and appearing in the box at the upper right of this tab). Title I, A District Reservations. Second, barring allowable exceptions (i.e., districts containing one school per grade span or districts with a total enrollment of less than 1,000 students), higher poverty schools must receive the same or greater amount per-pupil than lower poverty schools in your rank order. \n\nThe total amount allocated for schools in Column 8 must equal the balance of funds available for school allocations after reservations from Tab 7.\n\nNotes:\n•  Column 9 automatically displays the actual per-pupil amount based on the allocation amounts and the total (maximum) number of low-income children in Column 6.  Note that districts electing to use the 1.6 multiplier cannot exceed the actual number of children enrolled in each school.\n•  The District-Wide Low-Income Percentage is displayed in the box above the columns on the right hand side of the worksheet. Remember that a district may rank its schools by either the district-wide low-income percentage or low-income percentages within grade span groupings.\n\n"]

{"sheet":"9. Title I, Part A Budget ","index":11,"n_rows":104,"n_cols":21,"rows_kept":104,"cut":false,"hidden":false,"merged":[[103,2,103,5],[95,15,95,16],[5,5,6,6],[5,2,6,4],[89,3,89,10],[89,16,92,16],[89,20,89,21],[90,3,90,9],[90,20,90,21],[91,3,91,9],[91,20,91,21],[92,20,92,21],[80,3,80,9],[80,20,80,21],[81,3,81,9],[81,20,81,21],[82,2,82,10],[84,8,84,9],[84,16,87,16],[85,8,85,9],[86,8,86,9],[75,16,82,16],[76,3,76,9],[76,20,76,21],[77,3,77,9],[77,20,77,21],[78,3,78,9],[78,20,78,21],[79,3,79,9],[79,20,79,21],[75,20,75,21],[66,3,66,5],[68,3,68,9],[68,16,73,16],[68,20,68,21],[69,3,69,9],[69,20,69,21],[70,3,70,9],[71,3,71,9],[72,3,72,9],[72,20,72,21],[61,16,66,16],[61,20,61,21],[62,3,62,9],[62,20,62,21],[63,3,63,9],[63,20,63,21],[64,3,64,9],[64,20,64,21],[65,3,65,9],[65,20,65,21],[73,2,73,10],[70,20,70,21],[71,20,71,21],[56,20,56,21],[57,3,57,6],[57,20,57,21],[58,3,58,6],[58,20,58,21],[59,2,59,10],[52,16,58,16],[52,20,52,21],[53,3,53,6],[53,20,53,21],[54,3,54,6],[54,20,54,21],[55,3,55,6],[55,20,55,21],[56,3,56,6],[45,3,45,10],[46,3,46,10],[46,20,46,21],[47,3,47,10],[47,20,47,21],[41,3,41,6],[41,20,41,21],[42,2,42,10],[43,2,43,6],[44,3,44,10],[44,16,50,16],[48,3,48,10],[48,20,48,21],[49,3,49,10],[49,20,49,21],[44,20,45,21],[50,2,50,10],[35,2,35,10],[36,2,36,6],[37,16,41,16],[37,20,37,21],[38,3,38,6],[38,20,38,21],[39,3,39,6],[39,20,39,21],[40,3,40,6],[40,20,40,21],[32,3,32,6],[32,20,32,21],[33,3,33,6],[33,20,33,21],[34,3,34,6],[34,20,34,21],[28,3,28,6],[28,20,28,21],[29,2,29,10],[29,20,29,21],[30,2,30,6],[31,3,31,6],[31,20,31,21],[25,3,25,6],[25,20,25,21],[26,3,26,6],[26,20,26,21],[27,3,27,6],[27,20,27,21],[19,3,19,6],[19,20,19,21],[20,20,20,21],[21,2,21,6],[22,20,22,21],[23,3,23,6],[23,16,28,16],[23,20,23,21],[24,3,24,6],[24,20,24,21],[1,1,1,9],[2,20,2,21],[3,1,3,21],[6,7,6,8],[6,9,6,10],[13,1,13,23],[14,2,14,10],[14,20,14,21],[16,3,16,6],[16,16,20,16],[16,20,16,21],[17,3,17,6],[17,20,17,21],[18,3,18,6],[18,20,18,21]]}
[]
[null,{"$f":"valDistrName & \" (\"&valorg4code&\")\"","v":"Org Name (Org )"}]
[]
[null,"FY19 Title I, Part A (Fund Code 305) Budget Worksheet"]
[]
[null,null,"Allocation \n(before any flexing)",null,null,{"$f":"valAllocationT1","v":0}]
[]
[]
[]
[null,null,null,null,null,null,null,null,null,{"$f":"valDistrName","v":"Org Name"},null,null,null,null,null,null,null,null,{"$f":"valDistrName & \" (\"&valorg4code&\")\"","v":"Org Name (Org )"}]
[null,null,null,null,null,null,null,null,{"$f":"valDistrName","v":"Org Name"}]
[]
[]
[]
[null,null,"Line Item Category: Select an option from the drop down menu.",null,null,null,null,null,null,null,null,null,"Amount",null,"Expenditures (whole numbers)",null,"Expense includes private school services",null,"Primary Function",null,"Comments"]
[]
[null,null,1,"ADMINISTRATOR SALARIES:",null,null,null,null,"# of staff","FTE","MTRS",null,null,null,"Amount",null,null,null,"Select from Drop Down List",null,"Budget Detail"]
[null,null,null,"Select One",null,null,null,null,null,null,null,false,{"$f":"IF(L18,O18,0)","v":0},null,null,null,null,null,"Select One"]
[null,null,null,"Select One",null,null,null,null,null,null,null,false,{"$f":"IF(L19,O19,0)","v":0},null,null,null,null,null,"Select One"]
[null,null,null,"Select One",null,null,null,null,null,null,null,false,{"$f":"IF(L20,O20,0)","v":0},null,null,null,null,null,"Select One"]
[]
[null,null,"SUB-TOTAL",null,null,null,null,null,{"$f":"SUM(I18:I20)","v":0},{"$f":"SUM(J18:J20)","v":0},null,null,{"$f":"SUM(M18:M20)","v":0},null,{"$f":"SUM(O18:O20)","v":0}]
[null,null,2,"INSTRUCTIONAL/PROF STAFF:",null,null,null,null,"# of staff","FTE","MTRS",null,null,null,"Amount",null,null,null,"Select from Drop Down List",null,"Budget Detail"]
[null,null,null,"Select One",null,null,null,null,null,null,null,false,{"$f":"IF(L24, O24,0)","v":0},null,null,null,null,null,"Select One"]
[null,null,null,"Select One",null,null,null,null,null,null,null,false,0,null,null,null,null,null,"Select One"]
[null,null,null,"Select One",null,null,null,null,null,null,null,false,0,null,null,null,null,null,"Select One"]
[null,null,null,"Select One",null,null,null,null,null,null,null,false,0,null,null,null,null,null,"Select One"]
[null,null,null,"Select One",null,null,null,null,null,null,null,false,0,null,null,null,null,null,"Select One"]
[null,null,null,"Select One",null,null,null,null,null,null,null,false,0,null,null,null,null,null,"Select One"]
[]
[null,null,"SUB-TOTAL",null,null,null,null,null,{"$f":"SUM(I24:I29)","v":0},{"$f":"SUM(J24:J29)","v":0},null,null,{"$f":"SUM(M24:M29)","v":0},null,{"$f":"SUM(O24:O29)","v":0}]
[null,null,3,"SUPPORT STAFF SALARIES:",null,null,null,null,"# of staff","FTE","MTRS",null,null,null,"Amount",null,null,null,"Select from Drop Down List",null,"Budget Detail"]
[null,null,null,"Select One",null,null,null,null,null,null,null,false,{"$f":"IF(L33, O33,0)","v":0},null,null,null,null,null,"Select One"]
[null,null,null,"Select One",null,null,null,null,null,null,null,false,{"$f":"IF(L34, O34,0)","v":0},null,null,null,null,null,"Select One"]
[null,null,null,"Select One",null,null,null,null,null,null,null,false,0,null,null,null,null,null,"Select One"]
[]
[null,null,"SUB-TOTAL",null,null,null,null,null,{"$f":"SUM(I33:I35)","v":0},{"$f":"SUM(J33:J35)","v":0},null,null,{"$f":"SUM(M33:M35)","v":0},null,{"$f":"SUM(O33:O35)","v":0}]
[null,null,4,"STIPENDS:",null,null,null,"# of staff","Rate","Rate Type","MTRS",null,null,null,"Amount",null,null,null,"Select from Drop Down List",null,"Budget Detail"]
[null,null,null,"Other ",null,null,null,null,null,null,null,false,{"$f":"IF(L39, O39,0)","v":0},null,null,null,null,null,"Select One"]
[null,null,null,"Select One",null,null,null,null,null,null,null,false,{"$f":"IF(L40, O40,0)","v":0},null,null,null,null,null,"Select One"]
[null,null,null,"Select One",null,null,null,null,null,null,null,false,0,null,null,null,null,null,"Select One"]
[null,null,null,"Select One",null,null,null,null,null,null,null,false,0,null,null,null,null,null,"Select One"]
[]
[null,null,"SUB-TOTAL",null,null,null,null,null,null,null,null,null,{"$f":"SUM(M39:M42)","v":0},null,{"$f":"SUM(O39:O42)","v":0}]
[null,null,5,"FRINGE BENEFITS:",null,null,null,null,null,null,null,null,null,null,"Amount",null,null,null,"Brief Description",null,"Budget Detail"]
[null,null,null,"5a  MTRS (automatically calculated if MTRS box is checked above)  ",null,null,null,null,null,null,null,null,null,null,{"$f":"ROUND((SUM(M37,M44,M31,M22))*0.09,0)","v":0}]
[null,null,null,"5b  Other",null,null,null,null,null,null,null,null,null,null,{"$f":"SUM(O48:O50)","v":0}]
[null,null,null,"Health Insurance"]
[null,null,null,"Other Retirement Systems"]
[null,null,null,"Federal Insurance Contributions Act (FICA)"]
[]
[null,null,"SUB-TOTAL",null,null,null,null,null,null,null,null,null,null,null,{"$f":"SUM(O46:O47)","v":0}]
[null,null,6,"CONTRACTUAL SERVICES:",null,null,null,null,"Rate","Rate Type",null,null,null,null,"Amount",null,null,null,"Select from Drop Down List",null,"Budget Detail"]
[null,null,null,"Select One",null,null,null,null,null,null,null,null,null,null,null,null,null,null,"Select One"]
[null,null,null,"Select One",null,null,null,null,null,null,null,null,null,null,null,null,null,null,"Select One"]
[null,null,null,"Select One",null,null,null,null,null,null,null,null,null,null,null,null,null,null,"Select One"]
[null,null,null,"Select One",null,null,null,null,null,null,null,null,null,null,null,null,null,null,"Select One"]
[null,null,null,"Select One",null,null,null,null,null,null,null,null,null,null,null,null,null,null,"Select One"]
[null,null,null,"Select One",null,null,null,null,null,null,null,null,null,null,null,null,null,null,"Select One"]
[]
[null,null,"SUB-TOTAL",null,null,null,null,null,null,null,null,null,null,null,{"$f":"SUM(O54:O59)","v":0}]
[null,null,7,"SUPPLIES AND MATERIALS:",null,null,null,null,null,null,null,null,null,null,"Amount",null,null,null,"Select from Drop Down List",null,"Budget Detail"]
[null,null,null,"Select One",null,null,null,null,null,null,null,null,null,null,null,null,null,null,"Select One"]
[null,null,null,"Select One",null,null,null,null,null,null,null,null,null,null,null,null,null,null,"Select One"]
[null,null,null,"Select One",null,null,null,null,null,null,null,null,null,null,null,null,null,null,"Select One"]
[null,null,null,"Select One",null,null,null,null,null,null,null,null,null,null,null,null,null,null,"Select One"]
[]
[null,null,"SUB-TOTAL",null,null,null,null,null,null,null,null,null,null,null,{"$f":"SUM(O63:O66)","v":0}]
[null,null,8,"TRAVEL:  (mileage, conference registration, courses, hotels, etc.)",null,null,null,null,null,null,null,null,null,null,"Amount",null,null,null,"Select from Drop Down List",null,"Budget Detail"]
[null,null,null,"Select One",null,null,null,null,null,null,null,null,null,null,null,null,null,null,"Select One"]
[null,null,null,"Select One",null,null,null,null,null,null,null,null,null,null,null,null,null,null,"Select One"]
[null,null,null,"Select One",null,null,null,null,null,null,null,null,null,null,null,null,null,null,"Select One"]
[null,null,null,"Select One",null,null,null,null,null,null,null,null,null,null,null,null,null,null,"Select One"]
[]
[null,null,"SUB-TOTAL",null,null,null,null,null,null,null,null,null,null,null,{"$f":"SUM(O70:O73)","v":0}]
[null,null,9,"OTHER COSTS:",null,null,null,null,null,null,null,null,null,null,"Amount",null,null,null,"Select from Drop Down List",null,"Budget Detail"]
[null,null,null,"Select One",null,null,null,null,null,null,null,null,null,null,null,null,null,null,"Select One"]
[null,null,null,"Select One",null,null,null,null,null,null,null,null,null,null,null,null,null,null,"Select One"]
[null,null,null,"Select One",null,null,null,null,null,null,null,null,null,null,null,null,null,null,"Select One"]
[null,null,null,"Select One",null,null,null,null,null,null,null,null,null,null,null,null,null,null,"Select One"]
[null,null,null,"Select One",null,null,null,null,null,null,null,null,null,null,null,null,null,null,"Select One"]
[null,null,null,"Select One",null,null,null,null,null,null,null,null,null,null,null,null,null,null,"Select One"]
[]
[null,null,"SUB-TOTAL",null,null,null,null,null,null,null,null,null,null,null,{"$f":"SUM(O77:O82)","v":0}]
[null,null,null,null,null,null,"(a) rate (%)",null,"(b) allocation less indirect",null,null,null,null,null,"Amount"]
[null,null,10,"INDIRECT COSTS *",null,null,null,null,{"$f":"IF(G86=\"\",\"\", F6/(1+G86))","v":""}]
[null,null,null,"   maximum allowed",null,null," (a x b)",null,{"$f":"IFERROR(+I86*G86,\"\")","v":""}]
[]
[]
[null,null,11,"EQUIPMENT:\nOnly list items costing $5,000+ per unit and having a useful life more than 1 year",null,null,null,null,null,null,null,null,null,null,"Amount",null,null,null,"Select from Drop Down List",null,"Budget Detail"]
[null,null,null,null,null,null,null,null,null,null,null,null,null,null,null,null,null,null,"Select One"]
[null,null,null,null,null,null,null,null,null,null,null,null,null,null,null,null,null,null,"Select One"]
[]
[null,null,"SUB-TOTAL",null,null,null,null,null,null,null,null,null,null,null,{"$f":"SUM(O91:O92)","v":0}]
[]
[null,null,"TOTAL FUNDS REQUESTED ",null,null,null,null,null,null,null,null,null,null,null,{"$f":"O94+O86+O84+O75+O68+O61+O52+O44+O37+O31+O22","v":0}]
[]
[]
[]
[null,null,"* Indirect costs must be consistent with the rate established by the Office of School Finance.  Districts are allowed to take less than the maximum.  In calculating the indirect cost allowable for a particular grant, note that indirect"]
[null,null,"costs cannot be charged on either capital expenditures or on indirect costs themselves.  To arrive at the allowable amount one cannot simply multiply a total entitlement by the indirect rate.  The decision to recover "]
[null,null,"indirect costs using these established rates is a local option.  If indirect costs are recovered, they shall be returned to the general fund of the city or town in  accordance with G.L. Chapter 44, Section 53.  In the case"]
[null,null,"of regional schools, indirect costs shall be returned to the regional school general fund. "]
[null,null,"www.doe.mass.edu/Grants/essential.html"]

{"sheet":"10. Title II, Part A Narrative","index":12,"n_rows":66,"n_cols":25,"rows_kept":66,"cut":false,"hidden":false,"merged":[[50,2,50,8],[50,16,50,19],[49,2,49,8],[49,16,49,19],[46,2,46,8],[46,16,46,19],[47,2,47,8],[47,16,47,19],[48,2,48,8],[48,16,48,19],[20,2,20,3],[20,4,20,13],[20,14,20,16],[19,2,19,3],[19,4,19,13],[19,14,19,16],[21,4,21,13],[11,14,11,16],[12,14,12,16],[13,14,13,16],[14,14,14,16],[21,14,21,16],[18,2,18,3],[18,4,18,13],[15,14,15,16],[16,14,16,16],[17,14,17,16],[18,14,18,16],[15,2,15,3],[15,4,15,13],[16,2,16,3],[16,4,16,13],[17,2,17,3],[17,4,17,13],[1,1,1,7],[29,14,30,15],[29,12,30,13],[29,1,30,2],[29,4,30,8],[12,2,12,3],[13,2,13,3],[14,2,14,3],[21,2,21,3],[28,1,28,2],[28,4,28,8],[29,3,30,3],[11,4,11,13],[12,4,12,13],[13,4,13,13],[14,4,14,13],[2,1,2,4],[2,5,2,13],[8,1,8,3],[4,1,4,15],[7,1,7,4],[9,1,9,24],[11,22,11,23],[10,22,10,23],[28,16,28,19],[38,1,38,14],[27,1,27,14],[31,16,31,19],[32,16,32,19],[33,16,33,19],[33,7,33,8],[31,7,31,8],[32,7,32,8],[35,1,35,2],[31,1,31,2],[32,1,32,2],[33,1,33,2],[34,1,34,2],[29,16,30,19],[39,1,39,8],[44,16,44,19],[40,1,40,8],[40,12,40,13],[42,2,42,8],[43,2,43,8],[44,2,44,8],[40,16,40,19],[42,16,42,19],[43,16,43,19],[40,14,40,15],[39,12,39,13],[39,14,39,15],[51,16,51,19],[57,7,59,7],[57,1,59,6],[57,15,59,15],[57,8,59,13],[57,14,59,14],[56,8,56,13],[55,1,56,3],[51,2,51,8],[45,16,45,19],[45,2,45,8],[10,20,10,21],[34,16,34,19],[35,16,35,19],[34,4,34,6],[35,4,35,6],[34,7,34,8],[35,7,35,8],[33,4,33,6],[28,12,28,13],[29,9,30,9],[29,10,30,10],[29,11,30,11],[31,4,31,6],[39,16,39,19],[32,4,32,6],[11,1,11,3],[11,20,11,21],[10,4,10,14],[10,15,10,16],[24,1,24,3],[25,1,25,19],[28,14,28,15]]}
[]
[null,{"$f":"valDistrName & \" (\"&valorg4code&\")\"","v":"Org Name (Org )"}]
[null,"Title II, Part A",null,null,null,"Educator Effectiveness (Fund Code 140)"]
[]
[null,"   Program Purpose\n    1) to increase student achievement consistent with challenging state standards;\n    2) to improve the quality and effectiveness of teachers, principals, and other school leaders;\n    3) to increase the number of teachers, principals, and other school leaders who are effective in improving student academic achievement in schools; and\n    4) provide low-income and minority students greater access to effective teachers, principals and other school leaders."]
[]
[]
[]
[null,"STEP 10.1\nDescribe Title II, Part A-funded activities  from Tab 5. District Strategies"]
[null,"From Tab 5:  District Activities and Strategies\nColumns A & B will populate automatically from Tab 5, Step 5.5 for any activity that you indicate includes Title II, Part A funding.  Starting with Column C, describe only those activities from each strategy/activity that will be funded in whole or in part with Title II, Part A funds."]
[null,null,null,"A","B",null,null,null,null,null,null,null,null,null,null,"C",null,"D",null,"E","F",null,"G",null,"H"]
[null,"Strategy/Activity",null,null,"Description ",null,null,null,null,null,null,null,null,null,"Describe specific activities funded by Title IIA ",null,null,"Are these activities aligned with Massachusetts Curriculum Frameworks?","Are these activities serving schools with the highest needs in your district?","Is this activity/strategy explicitly connected to district efforts to close equity gaps?","What data prompted this activity?\n(Select at least one source for each activity; report additional sources/explanation in \"Other\" box at row's end)",null,"What data will you use to determine progress and attainment of goals for these activities?\n(Select at least one source for each activity; report additional sources/explanation in \"Other\" box at row's end)",null,"If  you selected \"Other\" in Column F or G,  please describe data that you will use here"]
[{"$f":"IF(C13=\"\",1,0)","v":1},1,{"$f":"IF(ISBLANK('5. Districtwide Strategies'!C44),\"\",IF('5. Districtwide Strategies'!$N44<>\"\",'5. Districtwide Strategies'!C44,\"\"))","v":""},null,{"$f":"IF(ISBLANK('5. Districtwide Strategies'!D44),\"\",IF('5. Districtwide Strategies'!$N44<>\"\",'5. Districtwide Strategies'!D44,\"\"))","v":""},null,null,null,null,null,null,null,null,null,null,null,null,"Select One","Select One","Select One","Select One","Select One","Select One","Select One"]
[1,2,{"$f":"IF(ISBLANK('5. Districtwide Strategies'!C45),\"\",IF('5. Districtwide Strategies'!$N45<>\"\",'5. Districtwide Strategies'!C45,\"\"))","v":""},null,{"$f":"IF(ISBLANK('5. Districtwide Strategies'!D45),\"\",IF('5. Districtwide Strategies'!$N45<>\"\",'5. Districtwide Strategies'!D45,\"\"))","v":""},null,null,null,null,null,null,null,null,null,null,null,null,"Select One","Select One","Select One","Select One","Select One","Select One","Select One"]
[1,3,{"$f":"IF(ISBLANK('5. Districtwide Strategies'!C46),\"\",IF('5. Districtwide Strategies'!$N46<>\"\",'5. Districtwide Strategies'!C46,\"\"))","v":""},null,{"$f":"IF(ISBLANK('5. Districtwide Strategies'!D46),\"\",IF('5. Districtwide Strategies'!$N46<>\"\",'5. Districtwide Strategies'!D46,\"\"))","v":""},null,null,null,null,null,null,null,null,null,null,null,null,"Select One","Select One","Select One","Select One","Select One","Select One","Select One"]
[1,4,{"$f":"IF(ISBLANK('5. Districtwide Strategies'!C47),\"\",IF('5. Districtwide Strategies'!$N47<>\"\",'5. Districtwide Strategies'!C47,\"\"))","v":""},null,{"$f":"IF(ISBLANK('5. Districtwide Strategies'!D47),\"\",IF('5. Districtwide Strategies'!$N47<>\"\",'5. Districtwide Strategies'!D47,\"\"))","v":""},null,null,null,null,null,null,null,null,null,null,null,null,"Select One","Select One","Select One","Select One","Select One","Select One","Select One"]
[1,5,{"$f":"IF(ISBLANK('5. Districtwide Strategies'!C48),\"\",IF('5. Districtwide Strategies'!$N48<>\"\",'5. Districtwide Strategies'!C48,\"\"))","v":""},null,{"$f":"IF(ISBLANK('5. Districtwide Strategies'!D48),\"\",IF('5. Districtwide Strategies'!$N48<>\"\",'5. Districtwide Strategies'!D48,\"\"))","v":""},null,null,null,null,null,null,null,null,null,null,null,null,"Select One","Select One","Select One","Select One","Select One","Select One","Select One"]
[1,6,{"$f":"IF(ISBLANK('5. Districtwide Strategies'!C49),\"\",IF('5. Districtwide Strategies'!$N49<>\"\",'5. Districtwide Strategies'!C49,\"\"))","v":""},null,{"$f":"IF(ISBLANK('5. Districtwide Strategies'!D49),\"\",IF('5. Districtwide Strategies'!$N49<>\"\",'5. Districtwide Strategies'!D49,\"\"))","v":""},null,null,null,null,null,null,null,null,null,null,null,null,"Select One","Select One","Select One","Select One","Select One","Select One","Select One"]
[1,7,{"$f":"IF(ISBLANK('5. Districtwide Strategies'!C50),\"\",IF('5. Districtwide Strategies'!$N50<>\"\",'5. Districtwide Strategies'!C50,\"\"))","v":""},null,{"$f":"IF(ISBLANK('5. Districtwide Strategies'!D50),\"\",IF('5. Districtwide Strategies'!$N50<>\"\",'5. Districtwide Strategies'!D50,\"\"))","v":""},null,null,null,null,null,null,null,null,null,null,null,null,"Select One","Select One","Select One","Select One","Select One","Select One","Select One"]
[1,8,{"$f":"IF(ISBLANK('5. Districtwide Strategies'!C51),\"\",IF('5. Districtwide Strategies'!$N51<>\"\",'5. Districtwide Strategies'!C51,\"\"))","v":""},null,{"$f":"IF(ISBLANK('5. Districtwide Strategies'!D51),\"\",IF('5. Districtwide Strategies'!$N51<>\"\",'5. Districtwide Strategies'!D51,\"\"))","v":""},null,null,null,null,null,null,null,null,null,null,null,null,"Select One","Select One","Select One","Select One","Select One","Select One","Select One"]
[1,9,{"$f":"IF(ISBLANK('5. Districtwide Strategies'!C52),\"\",IF('5. Districtwide Strategies'!$N52<>\"\",'5. Districtwide Strategies'!C52,\"\"))","v":""},null,{"$f":"IF(ISBLANK('5. Districtwide Strategies'!D52),\"\",IF('5. Districtwide Strategies'!$N52<>\"\",'5. Districtwide Strategies'!D52,\"\"))","v":""},null,null,null,null,null,null,null,null,null,null,null,null,"Select One","Select One","Select One","Select One","Select One","Select One","Select One"]
[{"$f":"IF(C22=\"\",1,0)","v":1},10,{"$f":"IF(ISBLANK('5. Districtwide Strategies'!C53),\"\",IF('5. Districtwide Strategies'!$N53<>\"\",'5. Districtwide Strategies'!C53,\"\"))","v":""},null,{"$f":"IF(ISBLANK('5. Districtwide Strategies'!D53),\"\",IF('5. Districtwide Strategies'!$N53<>\"\",'5. Districtwide Strategies'!D53,\"\"))","v":""},null,null,null,null,null,null,null,null,null,null,null,null,"Select One","Select One","Select One","Select One","Select One","Select One","Select One"]
[]
[]
[null,"STEP 10.2\nDescribe Title II, Part A funded activities not included in Tab 5. District Strategies"]
[null,"Title II, Part A-funded activities not listed above from Tab 5.\nStarting with Column A, describe  activities not listed above that will be funded in whole or in part with Title II, Part A funds. "]
[]
[null,"Menu:  Please use menu and dropdown options for any Title II, Part A-funded activities in which your district plans to engage in FY19. Use the Narrative section, below, to describe Title II, Part A-funded activities not listed here."]
[null,"A",null,"B","C",null,null,null,null,"D","E","F","G",null,"H",null,"I"]
[null,"Is your district using  Title II, Part A funds to engage in any of these activities ?\n",null,"Yes or No?","Is your district using any of these substrategies?\n(Choose up to 2, if applicable. If you select  \"Other,\" please explain in the box at the row's end)",null,null,null,null,"Are these activities aligned with Massachusetts Curriculum Frameworks?","Are these activities serving schools with the highest needs in your district?","Is this activity/strategy explicitly connected to district efforts to close equity gaps?","What data prompted this activity?\n(Select at least one source for each activity; report additional sources/explanation in \"Other\" box at row's end)",null,"What data will you use to determine progress and attainment of goals?\n(Select at least one source for each activity; report additional sources/explanation in \"Other\" box at row's end)",null,"If  you selected \"Other\" in Column C,G, or H,  please describe data that you will use here"]
[]
[null,"Cultivating a pipeline of educators through partnerships with preparation providers",null,"Select One","Select One",null,null,"Select One",null,"Select One","Select One","Select One","Select One","Select One","Select One","Select One"]
[null,"Induction & Mentoring Programs",null,"Select One","Select One",null,null,"Select One",null,"Select One","Select One","Select One","Select One","Select One","Select One","Select One"]
[null,"Implementing an Education Evaluation System that includes measures of student learning and staff/student feedback",null,"Select One","Select One",null,null,"Select One",null,"Select One","Select One","Select One","Select One","Select One","Select One","Select One"]
[null,"High-Quality Professional Development",null,"Select One","Select One",null,null,"Select One",null,"Select One","Select One","Select One","Select One","Select One","Select One","Select One"]
[null,"Advancing and Recognizing educators",null,"Select One","Select One",null,null,"Select One",null,"Select One","Select One","Select One","Select One","Select One","Select One","Select One"]
[]
[]
[null,"Narrative:  For Title II, Part A-funded activities not listed above, please describe below in narrative format."]
[null,"A",null,null,null,null,null,null,null,"B",null,"C","D",null,"E",null,"F"]
[null,"Describe activities funded by Title II, Part A not listed above",null,null,null,null,null,null,null,"Are these activities aligned with Massachusetts Curriculum Frameworks?","Are these activities serving schools with the highest needs in your district?","Is this activity/strat-\negy explicitly connected to district efforts to close equity gaps?\n","What data prompted this activity?\n(Select at least one source for each activity; report additional sources/explanation in \"Other\" box at row's end)",null,"What data will you use to determine progress and attainment of goals?\n(Select at least one source for each activity; report additional sources/explanation in \"Other\" box at row's end)",null,"If  you selected \"Other\" in Column D or E,  please describe data/evidence here"]
[null,null,1]
[null,1,null,null,null,null,null,null,null,"Select One","Select One","Select One","Select One","Select One","Select One","Select One"]
[null,2,null,null,null,null,null,null,null,"Select One","Select One","Select One","Select One","Select One","Select One","Select One"]
[{"$f":"IF(C45=\"\",\"\",1)","v":""},3,null,null,null,null,null,null,null,"Select One","Select One","Select One","Select One","Select One","Select One","Select One"]
["",4,null,null,null,null,null,null,null,"Select One","Select One","Select One","Select One","Select One","Select One","Select One"]
["",5,null,null,null,null,null,null,null,"Select One","Select One","Select One","Select One","Select One","Select One","Select One"]
["",6,null,null,null,null,null,null,null,"Select One","Select One","Select One","Select One","Select One","Select One","Select One"]
["",7,null,null,null,null,null,null,null,"Select One","Select One","Select One","Select One","Select One","Select One","Select One"]
["",8,null,null,null,null,null,null,null,"Select One","Select One","Select One","Select One","Select One","Select One","Select One"]
["",9,null,null,null,null,null,null,null,"Select One","Select One","Select One","Select One","Select One","Select One","Select One"]
["",10,null,null,null,null,null,null,null,"Select One","Select One","Select One","Select One","Select One","Select One","Select One"]
[]
[]
[]
[null,"STEP 10.3\nClass-Size Reduction"]
[null,null,null,null,null,null,null,"Y or N?","If \"yes,\" please cite the evidence supporting your decision to reduce class size and explain how the evidence supports your circumstances."]
[null,"Are you using Title II, Part A funds for class-size reduction?",null,null,null,null,null,"Select One",null,null,null,null,null,null,"Do you have enrollment data showing that class-size reduction is not supplanting use of state or local funds?","Select One"]
[]
[]
[]
[]
[]
[]
[]
[null,null,null,null,null,null,null,null,null,null,null,null,null,null,null," "]

{"sheet":"11. Title II, Part A Budget","index":13,"n_rows":104,"n_cols":24,"rows_kept":104,"cut":false,"hidden":false,"merged":[[103,2,103,6],[95,15,95,16],[3,1,3,23],[5,5,6,6],[5,2,6,4],[89,3,89,10],[89,16,92,16],[89,20,89,21],[90,3,90,9],[90,20,90,21],[91,3,91,9],[91,20,91,21],[92,20,92,21],[80,3,80,9],[80,20,80,21],[81,3,81,9],[81,20,81,21],[82,2,82,10],[84,8,84,9],[84,16,87,16],[85,8,85,9],[86,8,86,9],[73,2,73,10],[75,16,82,16],[76,3,76,9],[76,20,76,21],[77,3,77,9],[77,20,77,21],[78,3,78,9],[78,20,78,21],[79,3,79,9],[79,20,79,21],[75,20,75,21],[66,3,66,5],[68,3,68,9],[68,16,73,16],[68,20,68,21],[69,3,69,9],[69,20,69,21],[70,3,70,9],[71,3,71,9],[72,3,72,9],[72,20,72,21],[61,16,66,16],[61,20,61,21],[62,3,62,9],[62,20,62,21],[63,3,63,9],[63,20,63,21],[64,3,64,9],[64,20,64,21],[65,3,65,9],[65,20,65,21],[70,20,70,21],[71,20,71,21],[56,20,56,21],[57,3,57,6],[57,20,57,21],[58,3,58,6],[58,20,58,21],[59,2,59,10],[52,16,58,16],[52,20,52,21],[53,3,53,6],[53,20,53,21],[54,3,54,6],[54,20,54,21],[55,3,55,6],[55,20,55,21],[56,3,56,6],[44,23,45,23],[45,3,45,10],[46,3,46,10],[46,20,46,21],[47,3,47,10],[47,20,47,21],[41,3,41,6],[41,20,41,21],[42,2,42,10],[43,2,43,6],[44,3,44,10],[44,16,50,16],[48,3,48,10],[48,20,48,21],[49,3,49,10],[49,20,49,21],[50,2,50,10],[44,20,45,21],[35,2,35,10],[36,2,36,6],[37,16,41,16],[37,20,37,21],[38,3,38,6],[38,20,38,21],[39,3,39,6],[39,20,39,21],[40,3,40,6],[40,20,40,21],[32,3,32,6],[32,20,32,21],[33,3,33,6],[33,20,33,21],[34,3,34,6],[34,20,34,21],[28,3,28,6],[28,20,28,21],[29,2,29,10],[29,20,29,21],[30,2,30,6],[31,3,31,6],[31,20,31,21],[25,3,25,6],[25,20,25,21],[26,3,26,6],[26,20,26,21],[27,3,27,6],[27,20,27,21],[19,3,19,6],[19,20,19,21],[20,20,20,21],[21,2,21,6],[22,20,22,21],[23,3,23,6],[23,16,28,16],[23,20,23,21],[24,3,24,6],[24,20,24,21],[1,1,1,9],[1,20,1,24],[2,20,2,21],[6,7,6,8],[6,9,6,10],[13,1,13,24],[14,2,14,10],[14,20,14,21],[16,3,16,6],[16,16,20,16],[16,20,16,21],[17,3,17,6],[17,20,17,21],[18,3,18,6],[18,20,18,21]]}
[]
[null,{"$f":"valDistrName & \" (\"&valorg4code&\")\"","v":"Org Name (Org )"}]
[]
[null,"FY19 Title II, Part A (Fund Code 140) Budget Worksheet"]
[]
[null,null,"Allocation (before any flexing)",null,null,{"$f":"valAllocationT2","v":0}]
[]
[]
[]
[null,null,null,null,null,null,null,null,null,{"$f":"valDistrName","v":"Org Name"}]
[null,null,null,null,null,null,null,null,{"$f":"valDistrName","v":"Org Name"}]
[]
[]
[]
[null,null,"Line Item Category: Select an option from the drop down menu.",null,null,null,null,null,null,null,null,null,"Amount",null,"Expenditures (whole numbers)",null,"Expense includes private school services",null,"Primary Function",null,"Comments",null,null,"Flexed Funds \n(Which Title program rec'd Title II, Part A funds?)"]
[]
[null,null,1,"ADMINISTRATOR SALARIES:",null,null,null,null,"# of staff","FTE","MTRS",null,null,null,"Amount",null,null,null,"Select from Drop Down List",null,"Budget Detail"]
[null,null,null,"Select One",null,null,null,null,null,null,null,false,{"$f":"IF(L18,O18,0)","v":0},null,null,null,null,null,"Select One",null,null,null,null,"Select, if applicable"]
[null,null,null,"Select One",null,null,null,null,null,null,null,false,{"$f":"IF(L19,O19,0)","v":0},null,null,null,null,null,"Select One",null,null,null,null,"Select, if applicable"]
[null,null,null,"Select One",null,null,null,null,null,null,null,false,{"$f":"IF(L20,O20,0)","v":0},null,null,null,null,null,"Select One",null,null,null,null,"Select, if applicable"]
[]
[null,null,"SUB-TOTAL",null,null,null,null,null,{"$f":"SUM(I18:I20)","v":0},{"$f":"SUM(J18:J20)","v":0},null,null,{"$f":"SUM(M18:M20)","v":0},null,{"$f":"SUM(O18:O20)","v":0}]
[null,null,2,"INSTRUCTIONAL/PROF STAFF:",null,null,null,null,"# of staff","FTE","MTRS",null,null,null,"Amount",null,null,null,"Select from Drop Down List",null,"Budget Detail"]
[null,null,null,"Select One",null,null,null,null,null,null,null,false,{"$f":"IF(L24, O24,0)","v":0},null,null,null,null,null,"Select One",null,null,null,null,"Select, if applicable"]
[null,null,null,"Select One",null,null,null,null,null,null,null,false,0,null,null,null,null,null,"Select One",null,null,null,null,"Select, if applicable"]
[null,null,null,"Select One",null,null,null,null,null,null,null,false,0,null,null,null,null,null,"Select One",null,null,null,null,"Select, if applicable"]
[null,null,null,"Select One",null,null,null,null,null,null,null,false,0,null,null,null,null,null,"Select One",null,null,null,null,"Select, if applicable"]
[null,null,null,"Select One",null,null,null,null,null,null,null,false,0,null,null,null,null,null,"Select One",null,null,null,null,"Select, if applicable"]
[null,null,null,"Select One",null,null,null,null,null,null,null,false,0,null,null,null,null,null,"Select One",null,null,null,null,"Select, if applicable"]
[]
[null,null,"SUB-TOTAL",null,null,null,null,null,{"$f":"SUM(I24:I29)","v":0},{"$f":"SUM(J24:J29)","v":0},null,null,{"$f":"SUM(M24:M29)","v":0},null,{"$f":"SUM(O24:O29)","v":0}]
[null,null,3,"SUPPORT STAFF SALARIES:",null,null,null,null,"# of staff","FTE","MTRS",null,null,null,"Amount",null,null,null,"Select from Drop Down List",null,"Budget Detail"]
[null,null,null,"Select One",null,null,null,null,null,null,null,false,{"$f":"IF(L33,O33,0)","v":0},null,null,null,null,null,"Select One",null,null,null,null,"Select, if applicable"]
[null,null,null,"Select One",null,null,null,null,null,null,null,false,{"$f":"IF(L34,O34,0)","v":0},null,null,null,null,null,"Select One",null,null,null,null,"Select, if applicable"]
[null,null,null,"Select One",null,null,null,null,null,null,null,false,0,null,null,null,null,null,"Select One",null,null,null,null,"Select, if applicable"]
[]
[null,null,"SUB-TOTAL",null,null,null,null,null,{"$f":"SUM(I33:I35)","v":0},{"$f":"SUM(J33:J35)","v":0},null,null,{"$f":"SUM(M33:M35)","v":0},null,{"$f":"SUM(O33:O35)","v":0}]
[null,null,4,"STIPENDS:",null,null,null,"# of Staff","Rate","Rate Type","MTRS",null,null,null,"Amount",null,null,null,"Select from Drop Down List",null,"Budget Detail"]
[null,null,null,"Select One",null,null,null,null,null,null,null,false,{"$f":"IF(L39,O39,0)","v":0},null,null,null,null,null,"Select One",null,null,null,null,"Select, if applicable"]
[null,null,null,"Select One",null,null,null,null,null,null,null,false,{"$f":"IF(L40,O40,0)","v":0},null,null,null,null,null,"Select One",null,null,null,null,"Select, if applicable"]
[null,null,null,"Select One",null,null,null,null,null,null,null,false,0,null,null,null,null,null,"Select One",null,null,null,null,"Select, if applicable"]
[null,null,null,"Select One",null,null,null,null,null,null,null,false,0,null,null,null,null,null,"Select One",null,null,null,null,"Select, if applicable"]
[]
[null,null,"SUB-TOTAL",null,null,null,null,null,null,null,null,null,{"$f":"SUM(M39:M42)","v":0},null,{"$f":"SUM(O39:O42)","v":0}]
[null,null,5,"FRINGE BENEFITS:",null,null,null,null,null,null,null,null,null,null,"Amount",null,null,null,"Brief Description",null,"Budget Detail"]
[null,null,null,"5a  MTRS (automatically calculated if MTRS box is checked)  ",null,null,null,null,null,null,null,null,null,null,{"$f":"ROUND((SUM(M44,M37,M31,M22))*0.09,0)","v":0}]
[null,null,null,"5b  Other",null,null,null,null,null,null,null,null,null,null,{"$f":"SUM(O48:O50)","v":0},null,null,null,null,null,null,null,null,"Select, if applicable"]
[null,null,null,"Health Insurance",null,null,null,null,null,null,null,null,null,null,null,null,null,null,null,null,null,null,null,"Select, if applicable"]
[null,null,null,"Other Retirement Systems",null,null,null,null,null,null,null,null,null,null,null,null,null,null,null,null,null,null,null,"Select, if applicable"]
[null,null,null,"Federal Insurance Contributions Act (FICA)",null,null,null,null,null,null,null,null,null,null,null,null,null,null,null,null,null,null,null,"Select, if applicable"]
[]
[null,null,"SUB-TOTAL",null,null,null,null,null,null,null,null,null,null,null,{"$f":"SUM(O46:O47)","v":0}]
[null,null,6,"CONTRACTUAL SERVICES:",null,null,null,null,"Rate","Rate Type",null,null,null,null,"Amount",null,null,null,"Select from Drop Down List",null,"Budget Detail"]
[null,null,null,"Select One",null,null,null,null,null,null,null,null,null,null,null,null,null,null,"Select One",null,null,null,null,"Select, if applicable"]
[null,null,null,"Select One",null,null,null,null,null,null,null,null,null,null,null,null,null,null,"Select One",null,null,null,null,"Select, if applicable"]
[null,null,null,"Select One",null,null,null,null,null,null,null,null,null,null,null,null,null,null,"Select One",null,null,null,null,"Select, if applicable"]
[null,null,null,"Select One",null,null,null,null,null,null,null,null,null,null,null,null,null,null,"Select One",null,null,null,null,"Select, if applicable"]
[null,null,null,"Select One",null,null,null,null,null,null,null,null,null,null,null,null,null,null,"Select One",null,null,null,null,"Select, if applicable"]
[null,null,null,"Select One",null,null,null,null,null,null,null,null,null,null,null,null,null,null,"Select One",null,null,null,null,"Select, if applicable"]
[]
[null,null,"SUB-TOTAL",null,null,null,null,null,null,null,null,null,null,null,{"$f":"SUM(O54:O59)","v":0}]
[null,null,7,"SUPPLIES AND MATERIALS:",null,null,null,null,null,null,null,null,null,null,"Amount",null,null,null,"Select from Drop Down List",null,"Budget Detail"]
[null,null,null,"Select One",null,null,null,null,null,null,null,null,null,null,null,null,null,null,"Select One",null,null,null,null,"Select, if applicable"]
[null,null,null,"Select One",null,null,null,null,null,null,null,null,null,null,null,null,null,null,"Select One",null,null,null,null,"Select, if applicable"]
[null,null,null,"Select One",null,null,null,null,null,null,null,null,null,null,null,null,null,null,"Select One",null,null,null,null,"Select, if applicable"]
[null,null,null,"Select One",null,null,null,null,null,null,null,null,null,null,null,null,null,null,"Select One",null,null,null,null,"Select, if applicable"]
[]
[null,null,"SUB-TOTAL",null,null,null,null,null,null,null,null,null,null,null,{"$f":"SUM(O63:O66)","v":0}]
[null,null,8,"TRAVEL:  (mileage, conference registration, courses, hotels, etc.)",null,null,null,null,null,null,null,null,null,null,"Amount",null,null,null,"Select from Drop Down List",null,"Budget Detail"]
[null,null,null,"Select One",null,null,null,null,null,null,null,null,null,null,null,null,null,null,"Select One",null,null,null,null,"Select, if applicable"]
[null,null,null,"Select One",null,null,null,null,null,null,null,null,null,null,null,null,null,null,"Select One",null,null,null,null,"Select, if applicable"]
[null,null,null,"Select One",null,null,null,null,null,null,null,null,null,null,null,null,null,null,"Select One",null,null,null,null,"Select, if applicable"]
[null,null,null,"Select One",null,null,null,null,null,null,null,null,null,null,null,null,null,null,"Select One",null,null,null,null,"Select, if applicable"]
[]
[null,null,"SUB-TOTAL",null,null,null,null,null,null,null,null,null,null,null,{"$f":"SUM(O70:O73)","v":0}]
[null,null,9,"OTHER COSTS:",null,null,null,null,null,null,null,null,null,null,"Amount",null,null,null,"Select from Drop Down List",null,"Budget Detail"]
[null,null,null,"Select One",null,null,null,null,null,null,null,null,null,null,null,null,null,null,"Select One",null,null,null,null,"Select, if applicable"]
[null,null,null,"Select One",null,null,null,null,null,null,null,null,null,null,null,null,null,null,"Select One",null,null,null,null,"Select, if applicable"]
[null,null,null,"Select One",null,null,null,null,null,null,null,null,null,null,null,null,null,null,"Select One",null,null,null,null,"Select, if applicable"]
[null,null,null,"Select One",null,null,null,null,null,null,null,null,null,null,null,null,null,null,"Select One",null,null,null,null,"Select, if applicable"]
[null,null,null,"Select One",null,null,null,null,null,null,null,null,null,null,null,null,null,null,"Select One",null,null,null,null,"Select, if applicable"]
[null,null,null,"Select One",null,null,null,null,null,null,null,null,null,null,null,null,null,null,"Select One",null,null,null,null,"Select, if applicable"]
[]
[null,null,"SUB-TOTAL",null,null,null,null,null,null,null,null,null,null,null,{"$f":"SUM(O77:O82)","v":0}]
[null,null,null,null,null,null,"(a) rate (%)",null,"(b) allocation less indirect"]
[null,null,10,"INDIRECT COSTS *",null,null,null,null,{"$f":"IF(G86=\"\",\"\", F6/(1+G86))","v":""}]
[null,null,null,"   maximum allowed",null,null," (a x b)",null,{"$f":"IFERROR(+I86*G86,\"\")","v":""}]
[]
[]
[null,null,11,"EQUIPMENT:\nOnly list items costing $5,000+ per unit and having a useful life more than 1 year",null,null,null,null,null,null,null,null,null,null,"Amount",null,null,null,"Select from Drop Down List",null,"Budget Detail"]
[null,null,null,null,null,null,null,null,null,null,null,null,null,null,null,null,null,null,"Select One",null,null,null,null,"Select, if applicable"]
[null,null,null,null,null,null,null,null,null,null,null,null,null,null,null,null,null,null,"Select One",null,null,null,null,"Select, if applicable"]
[]
[null,null,"SUB-TOTAL",null,null,null,null,null,null,null,null,null,null,null,{"$f":"SUM(O91:O92)","v":0}]
[]
[null,null,"TOTAL FUNDS REQUESTED ",null,null,null,null,null,null,null,null,null,null,null,{"$f":"SUM(O94,O86,O84,O75,O68,O61,O52,O44,O37,O31,O22)","v":0}]
[]
[]
[]
[null,null,"* Indirect costs must be consistent with the rate established by the Office of School Finance.  Districts are allowed to take less than the maximum.  In calculating the indirect cost allowable for a particular grant, note that indirect"]
[null,null,"costs cannot be charged on either capital expenditures or on indirect costs themselves.  To arrive at the allowable amount one cannot simply multiply a total entitlement by the indirect rate.  The decision to recover "]
[null,null,"indirect costs using these established rates is a local option.  If indirect costs are recovered, they shall be returned to the general fund of the city or town in  accordance with G.L. Chapter 44, Section 53.  In the case"]
[null,null,"of regional schools, indirect costs shall be returned to the regional school general fund. "]
[null,null,"www.doe.mass.edu/Grants/essential.html"]

{"sheet":"12. Title III, Part A Narrative","index":14,"n_rows":36,"n_cols":21,"rows_kept":36,"cut":false,"hidden":false,"merged":[[30,15,30,17],[31,2,31,5],[31,7,31,8],[31,9,31,10],[31,15,31,17],[28,15,28,17],[29,2,29,5],[29,7,29,8],[29,9,29,10],[29,15,29,17],[15,20,15,25],[16,3,16,10],[16,11,16,12],[16,20,16,25],[12,3,12,10],[12,11,12,12],[12,20,12,25],[13,3,13,10],[13,11,13,12],[13,20,13,25],[14,3,14,10],[14,11,14,12],[14,20,14,25],[25,9,25,10],[33,9,33,10],[25,1,25,5],[11,3,11,10],[10,11,10,12],[11,11,11,12],[15,3,15,10],[15,11,15,12],[28,2,28,5],[28,7,28,8],[28,9,28,10],[30,2,30,5],[30,7,30,8],[30,9,30,10],[24,11,24,12],[1,1,1,6],[35,15,35,17],[23,1,23,17],[24,15,24,17],[24,6,24,10],[35,2,35,5],[25,13,25,14],[24,13,24,14],[34,2,34,5],[33,7,33,8],[32,15,32,17],[33,15,33,17],[34,15,34,17],[2,1,2,3],[2,4,2,12],[9,1,9,2],[10,20,10,25],[11,20,11,25],[32,9,32,10],[25,15,25,17],[27,15,27,17],[17,20,17,25],[18,20,18,25],[19,20,19,25],[17,11,17,12],[18,11,18,12],[19,11,19,12],[17,3,17,10],[18,3,18,10],[19,3,19,10],[27,7,27,8],[10,3,10,10],[9,3,9,10],[4,1,4,12],[9,11,9,12],[7,1,7,25],[6,1,6,3],[8,20,8,22],[9,16,9,17],[9,18,9,19],[9,20,9,25],[38,1,44,3],[38,4,44,13],[25,11,25,12],[37,1,37,3],[22,1,22,3],[35,7,35,8],[35,9,35,10],[24,1,24,5],[25,7,25,8],[34,7,34,8],[34,9,34,10],[27,2,27,5],[32,2,32,5],[33,2,33,5],[27,9,27,10],[32,7,32,8]]}
[]
[null,{"$f":"valDistrName & \" (\"&valorg4code&\")\"","v":"Org Name (Org )"}]
[null,"Title III, Part A",null,null,"Support for English Learners (Fund Code 180)"]
[]
[null,"   Program Purpose\n       1) to help ensure that English learners, including immigrant children and youth, attain English proficiency and develop high levels of academic\n             achievement in English;\n       2) to assist all English learners, including immigrant children and youth, to achieve at high levels in academic subjects so that all English learners \n             can meet the same  challenging State academic standards that all children are expected to meet;\n       3) to assist teachers (including preschool teachers), principals and other school leaders, State educational agencies, local educational agencies, \n             and schools in establishing, implementing, and sustaining effective language instruction educational programs designed to assist in teaching\n             English learners, including immigrant children and youth;\n       4) to assist teachers (including preschool teachers), principals and other school leaders, State educational agencies, and local educational agencies \n             to develop and enhance their capacity to provide effective instructional programs designed to prepare English learners, including immigrant children\n             and youth, to enter all-English instructional settings;  and\n       5) to promote parental, family, and community participation in language instruction educational programs for the parents, families, and communities of\n              English  learners."]
[]
[null,"STEP 12.1\n(All Title III, Part A Recipients must complete)"]
[null,"From Tab 5:  District Activities and Strategies\nColumns A & B will populate automatically from Tab 5, Step 5.5 for any activity that you indicate includes Title III, Part A funding.  Starting with Column C, describe only those activities from each strategy/activity that will be funded in whole or in part with Title III, Part A funds."]
[null,null,"A",null,null,null,null,"B",null,null,null,null,"C","D","E","F",null,"G",null,"H","I"]
[null,"Strategy/Activity",null,"Description ",null,null,null,null,null,null,null,"Describe specific activities or aspects of activities funded by Title III, Part A",null,"Supplemental to federal, state, and local funding?\n","This activity is intended to help English Learners increase their English language proficiency\n","This activity is intended to help English Learners meet standards in Massachusetts Curriculum Frameworks\n","What data prompted this activity?\n(Select at least one source for each activity; report additional sources/explanation in \"Other\" box at row's end)",null,"What data will you use to determine progress and attainment of goals?\n(Select at least one source for each activity; report additional sources/explanation in \"Other\" box at row's end)",null,"If  you selected \"Other\" in Column G  or H,  please describe data that you will use here"]
[{"$f":"IF(C11=\"\",1,0)","v":1},1,{"$f":"IF(ISBLANK('5. Districtwide Strategies'!C44),\"\",IF('5. Districtwide Strategies'!O44<>\"\",'5. Districtwide Strategies'!C44,\"\"))","v":""},{"$f":"IF(ISBLANK('5. Districtwide Strategies'!D44),\"\",IF('5. Districtwide Strategies'!O44<>\"\",'5. Districtwide Strategies'!D44,\"\"))","v":""},null,null,null,null,null,null,null,null,null,"Select One","Select One","Select One","Select One","Select One","Select One","Select One"]
[{"$f":"IF(C12=\"\",1,0)","v":1},2,{"$f":"IF(ISBLANK('5. Districtwide Strategies'!C45),\"\",IF('5. Districtwide Strategies'!O45<>\"\",'5. Districtwide Strategies'!C45,\"\"))","v":""},{"$f":"IF(ISBLANK('5. Districtwide Strategies'!D45),\"\",IF('5. Districtwide Strategies'!O45<>\"\",'5. Districtwide Strategies'!D45,\"\"))","v":""},null,null,null,null,null,null,null,null,null,"Select One","Select One","Select One","Select One","Select One","Select One","Select One"]
[{"$f":"IF(C13=\"\",1,0)","v":1},3,{"$f":"IF(ISBLANK('5. Districtwide Strategies'!C46),\"\",IF('5. Districtwide Strategies'!O46<>\"\",'5. Districtwide Strategies'!C46,\"\"))","v":""},{"$f":"IF(ISBLANK('5. Districtwide Strategies'!D46),\"\",IF('5. Districtwide Strategies'!O46<>\"\",'5. Districtwide Strategies'!D46,\"\"))","v":""},null,null,null,null,null,null,null,null,null,"Select One","Select One","Select One","Select One","Select One","Select One","Select One"]
[{"$f":"IF(C14=\"\",1,0)","v":1},4,{"$f":"IF(ISBLANK('5. Districtwide Strategies'!C47),\"\",IF('5. Districtwide Strategies'!O47<>\"\",'5. Districtwide Strategies'!C47,\"\"))","v":""},{"$f":"IF(ISBLANK('5. Districtwide Strategies'!D47),\"\",IF('5. Districtwide Strategies'!O47<>\"\",'5. Districtwide Strategies'!D47,\"\"))","v":""},null,null,null,null,null,null,null,null,null,"Select One","Select One","Select One","Select One","Select One","Select One","Select One"]
[1,5,{"$f":"IF(ISBLANK('5. Districtwide Strategies'!C48),\"\",IF('5. Districtwide Strategies'!O48<>\"\",'5. Districtwide Strategies'!C48,\"\"))","v":""},{"$f":"IF(ISBLANK('5. Districtwide Strategies'!D48),\"\",IF('5. Districtwide Strategies'!O48<>\"\",'5. Districtwide Strategies'!D48,\"\"))","v":""},null,null,null,null,null,null,null,null,null,"Select One","Select One","Select One","Select One","Select One","Select One","Select One"]
[1,6,{"$f":"IF(ISBLANK('5. Districtwide Strategies'!C49),\"\",IF('5. Districtwide Strategies'!O49<>\"\",'5. Districtwide Strategies'!C49,\"\"))","v":""},{"$f":"IF(ISBLANK('5. Districtwide Strategies'!D49),\"\",IF('5. Districtwide Strategies'!O49<>\"\",'5. Districtwide Strategies'!D49,\"\"))","v":""},null,null,null,null,null,null,null,null,null,"Select One","Select One","Select One","Select One","Select One","Select One","Select One"]
[1,7,{"$f":"IF(ISBLANK('5. Districtwide Strategies'!C50),\"\",IF('5. Districtwide Strategies'!O50<>\"\",'5. Districtwide Strategies'!C50,\"\"))","v":""},{"$f":"IF(ISBLANK('5. Districtwide Strategies'!D50),\"\",IF('5. Districtwide Strategies'!O50<>\"\",'5. Districtwide Strategies'!D50,\"\"))","v":""},null,null,null,null,null,null,null,null,null,"Select One","Select One","Select One","Select One","Select One","Select One","Select One"]
[1,8,{"$f":"IF(ISBLANK('5. Districtwide Strategies'!C51),\"\",IF('5. Districtwide Strategies'!O51<>\"\",'5. Districtwide Strategies'!C51,\"\"))","v":""},{"$f":"IF(ISBLANK('5. Districtwide Strategies'!D51),\"\",IF('5. Districtwide Strategies'!O51<>\"\",'5. Districtwide Strategies'!D51,\"\"))","v":""},null,null,null,null,null,null,null,null,null,"Select One","Select One","Select One","Select One","Select One","Select One","Select One"]
[1,9,{"$f":"IF(ISBLANK('5. Districtwide Strategies'!C52),\"\",IF('5. Districtwide Strategies'!O52<>\"\",'5. Districtwide Strategies'!C52,\"\"))","v":""},{"$f":"IF(ISBLANK('5. Districtwide Strategies'!D52),\"\",IF('5. Districtwide Strategies'!O52<>\"\",'5. Districtwide Strategies'!D52,\"\"))","v":""},null,null,null,null,null,null,null,null,null,"Select One","Select One","Select One","Select One","Select One","Select One","Select One"]
[1,10,{"$f":"IF(ISBLANK('5. Districtwide Strategies'!C53),\"\",IF('5. Districtwide Strategies'!O53<>\"\",'5. Districtwide Strategies'!C53,\"\"))","v":""},{"$f":"IF(ISBLANK('5. Districtwide Strategies'!D53),\"\",IF('5. Districtwide Strategies'!O53<>\"\",'5. Districtwide Strategies'!D53,\"\"))","v":""},null,null,null,null,null,null,null,null,null,"Select One","Select One","Select One","Select One","Select One","Select One","Select One"]
[]
[]
[null,"STEP 12.2\n(All Title III, Part A Recipients must complete)"]
[null,"Title III, Part A-funded activities not listed above from Tab 5.\nStarting with Column A, describe  activities not listed above that will be funded in whole or in part with Title III, Part A funds. "]
[null,"A",null,null,null,null,"B",null,null,null,null,"C",null,"D",null,"E"]
[null,"Describe activities funded by Title III not  listed above",null,null,null,null,"Supplemental to federal, state, and local funding?\n","This activity is intended to help English Learners increase their English language proficiency\n",null,"This activity is intended to help English Learners meet standards in Massachusetts Curriculum Frameworks",null,"What data prompted this activity?\n(Select at least one source for each activity; report additional sources/explanation in \"Other\" box at row's end)",null,"What data will you use to determine progress and attainment of goals?\n(Select at least one source for each activity; report additional sources/explanation in \"Other\" box at row's end)",null,"If  you selected \"Other\" in Column C or D,  please describe data that you will use  here"]
[null,null,"A"]
[null,1,null,null,null,null,"Select One","Select One",null,"Select One",null,"Select One","Select One","Select One","Select One"]
[null,2,null,null,null,null,"Select One","Select One",null,"Select One",null,"Select One","Select One","Select One","Select One"]
[null,3,null,null,null,null,"Select One","Select One",null,"Select One",null,"Select One","Select One","Select One","Select One"]
[null,4,null,null,null,null,"Select One","Select One",null,"Select One",null,"Select One","Select One","Select One","Select One"]
[null,5,null,null,null,null,"Select One","Select One",null,"Select One",null,"Select One","Select One","Select One","Select One"]
[null,6,null,null,null,null,"Select One","Select One",null,"Select One",null,"Select One","Select One","Select One","Select One"]
[null,7,null,null,null,null,"Select One","Select One",null,"Select One",null,"Select One","Select One","Select One","Select One"]
[null,8,null,null,null,null,"Select One","Select One",null,"Select One",null,"Select One","Select One","Select One","Select One"]
[null,9,null,null,null,null,"Select One","Select One",null,"Select One",null,"Select One","Select One","Select One","Select One"]

{"sheet":"13. Title III, Part A Budget","index":15,"n_rows":104,"n_cols":21,"rows_kept":104,"cut":false,"hidden":false,"merged":[[103,2,103,5],[95,15,95,16],[5,5,6,6],[5,2,6,4],[89,3,89,10],[89,16,92,16],[89,20,89,21],[90,3,90,9],[90,20,90,21],[91,3,91,9],[91,20,91,21],[92,20,92,21],[80,3,80,9],[80,20,80,21],[81,3,81,9],[81,20,81,21],[82,2,82,10],[84,8,84,9],[84,16,87,16],[85,8,85,9],[86,8,86,9],[75,16,82,16],[76,3,76,9],[76,20,76,21],[77,3,77,9],[77,20,77,21],[78,3,78,9],[78,20,78,21],[79,3,79,9],[79,20,79,21],[75,20,75,21],[66,3,66,5],[68,3,68,9],[68,16,73,16],[68,20,68,21],[69,3,69,9],[69,20,69,21],[70,3,70,9],[71,3,71,9],[72,3,72,9],[72,20,72,21],[61,16,66,16],[61,20,61,21],[62,3,62,9],[62,20,62,21],[63,3,63,9],[63,20,63,21],[64,3,64,9],[64,20,64,21],[65,3,65,9],[65,20,65,21],[73,2,73,10],[70,20,70,21],[71,20,71,21],[56,20,56,21],[57,3,57,6],[57,20,57,21],[58,3,58,6],[58,20,58,21],[59,2,59,10],[52,16,58,16],[52,20,52,21],[53,3,53,6],[53,20,53,21],[54,3,54,6],[54,20,54,21],[55,3,55,6],[55,20,55,21],[56,3,56,6],[45,3,45,10],[46,3,46,10],[46,20,46,21],[47,3,47,10],[47,20,47,21],[41,3,41,6],[41,20,41,21],[42,2,42,10],[43,2,43,6],[44,3,44,10],[44,16,50,16],[48,3,48,10],[48,20,48,21],[49,3,49,10],[49,20,49,21],[44,20,45,21],[50,2,50,10],[35,2,35,10],[36,2,36,6],[37,16,41,16],[37,20,37,21],[38,3,38,6],[38,20,38,21],[39,3,39,6],[39,20,39,21],[40,3,40,6],[40,20,40,21],[32,3,32,6],[32,20,32,21],[33,3,33,6],[33,20,33,21],[34,3,34,6],[34,20,34,21],[28,3,28,6],[28,20,28,21],[29,2,29,10],[29,20,29,21],[30,2,30,6],[31,3,31,6],[31,20,31,21],[25,3,25,6],[25,20,25,21],[26,3,26,6],[26,20,26,21],[27,3,27,6],[27,20,27,21],[19,3,19,6],[19,20,19,21],[20,20,20,21],[21,2,21,6],[22,20,22,21],[23,3,23,6],[23,16,28,16],[23,20,23,21],[24,3,24,6],[24,20,24,21],[1,1,1,9],[2,20,2,21],[3,1,3,21],[6,7,6,8],[6,9,6,10],[14,2,14,10],[14,20,14,21],[16,3,16,6],[16,16,20,16],[16,20,16,21],[17,3,17,6],[17,20,17,21],[18,3,18,6],[18,20,18,21]]}
[]
[null,{"$f":"valDistrName & \" (\"&valorg4code&\")\"","v":"Org Name (Org )"}]
[]
[null,"FY19 Title III, Part A (Fund Code 180) Budget Worksheet"]
[]
[null,null,"Allocation (before any flexing)",null,null,{"$f":"valAllocationT3","v":0}]
[]
[]
[]
[null,null,null,null,null,null,null,null,null,{"$f":"valDistrName","v":"Org Name"}]
[null,null,null,null,null,null,null,null,{"$f":"valDistrName","v":"Org Name"}]
[]
[]
[]
[null,null,"Line Item Category: Select an option from the drop down menu.",null,null,null,null,null,null,null,null,null,"Amount",null,"Expenditures (whole numbers)",null,"Expense includes private school services",null,"Primary Function",null,"Comments"]
[]
[null,null,1,"ADMINISTRATOR SALARIES:",null,null,null,null,"# of staff","FTE","MTRS",null,null,null,"Amount",null,null,null,"Select from Drop Down List",null,"Budget Detail"]
[null,null,null,"Select One",null,null,null,null,null,null,null,false,{"$f":"IF(L18,O18,0)","v":0},null,null,null,null,null,"Select One"]
[null,null,null,"Select One",null,null,null,null,null,null,null,false,{"$f":"IF(L19,O19,0)","v":0},null,null,null,null,null,"Select One"]
[null,null,null,"Select One",null,null,null,null,null,null,null,false,{"$f":"IF(L20,O20,0)","v":0},null,null,null,null,null,"Select One"]
[]
[null,null,"SUB-TOTAL",null,null,null,null,null,{"$f":"SUM(I18:I20)","v":0},{"$f":"SUM(J18:J20)","v":0},null,null,{"$f":"SUM(M18:M20)","v":0},null,{"$f":"SUM(O18:O20)","v":0}]
[null,null,2,"INSTRUCTIONAL/PROF STAFF:",null,null,null,null,"# of staff","FTE","MTRS",null,null,null,"Amount",null,null,null,"Select from Drop Down List",null,"Budget Detail"]
[null,null,null,"Select One",null,null,null,null,null,null,null,false,{"$f":"IF(L24, O24,0)","v":0},null,null,null,null,null,"Select One"]
[null,null,null,"Select One",null,null,null,null,null,null,null,false,{"$f":"IF(L25, O25,0)","v":0},null,null,null,null,null,"Select One"]
[null,null,null,"Select One",null,null,null,null,null,null,null,false,0,null,null,null,null,null,"Select One"]
[null,null,null,"Select One",null,null,null,null,null,null,null,false,0,null,null,null,null,null,"Select One"]
[null,null,null,"Select One",null,null,null,null,null,null,null,false,0,null,null,null,null,null,"Select One"]
[null,null,null,"Select One",null,null,null,null,null,null,null,false,{"$f":"IF(L29, O29,0)","v":0},null,null,null,null,null,"Select One"]
[]
[null,null,"SUB-TOTAL",null,null,null,null,null,{"$f":"SUM(I24:I29)","v":0},{"$f":"SUM(J24:J29)","v":0},null,null,{"$f":"SUM(M24:M29)","v":0},null,{"$f":"SUM(O24:O29)","v":0}]
[null,null,3,"SUPPORT STAFF SALARIES:",null,null,null,null,"# of staff","FTE","MTRS",null,null,null,"Amount",null,null,null,"Select from Drop Down List",null,"Budget Detail"]
[null,null,null,"Select One",null,null,null,null,null,null,null,false,{"$f":"IF(L33, O33, 0)","v":0},null,null,null,null,null,"Select One"]
[null,null,null,"Select One",null,null,null,null,null,null,null,false,{"$f":"IF(L34, O34, 0)","v":0},null,null,null,null,null,"Select One"]
[null,null,null,"Select One",null,null,null,null,null,null,null,false,0,null,null,null,null,null,"Select One"]
[]
[null,null,"SUB-TOTAL",null,null,null,null,null,{"$f":"SUM(I33:I35)","v":0},{"$f":"SUM(J33:J35)","v":0},null,null,{"$f":"SUM(M33:M35)","v":0},null,{"$f":"SUM(O33:O35)","v":0}]
[null,null,4,"STIPENDS:",null,null,null,"# of Staff","Rate","Rate Type","MTRS",null,null,null,"Amount",null,null,null,"Select from Drop Down List",null,"Budget Detail"]
[null,null,null,"Select One",null,null,null,null,null,null,null,false,{"$f":"IF(L39, O39, 0)","v":0},null,null,null,null,null,"Select One"]
[null,null,null,"Select One",null,null,null,null,null,null,null,false,{"$f":"IF(L40, O40, 0)","v":0},null,null,null,null,null,"Select One"]
[null,null,null,"Select One",null,null,null,null,null,null,null,false,0,null,null,null,null,null,"Select One"]
[null,null,null,"Select One",null,null,null,null,null,null,null,false,0,null,null,null,null,null,"Select One"]
[]
[null,null,"SUB-TOTAL",null,null,null,null,null,null,null,null,null,{"$f":"SUM(M39:M42)","v":0},null,{"$f":"SUM(O39:O42)","v":0}]
[null,null,5,"FRINGE BENEFITS:",null,null,null,null,null,null,null,null,null,null,"Amount",null,null,null,"Brief Description",null,"Budget Detail"]
[null,null,null,"5a  MTRS (automatically calculated if MTRS box is checked)  ",null,null,null,null,null,null,null,null,null,null,{"$f":"ROUND((SUM(M44,M37,M31,M22))*0.09,0)","v":0}]
[null,null,null,"5b  Other",null,null,null,null,null,null,null,null,null,null,{"$f":"SUM(O48:O50)","v":0}]
[null,null,null,"Health Insurance"]
[null,null,null,"Other Retirement Systems"]
[null,null,null,"Federal Insurance Contributions Act (FICA)"]
[]
[null,null,"SUB-TOTAL",null,null,null,null,null,null,null,null,null,null,null,{"$f":"SUM(O46:O47)","v":0}]
[null,null,6,"CONTRACTUAL SERVICES:",null,null,null,null,"Rate","Rate Type",null,null,null,null,"Amount",null,null,null,"Select from Drop Down List",null,"Budget Detail"]
[null,null,null,"Select One",null,null,null,null,null,null,null,null,null,null,null,null,null,null,"Select One"]
[null,null,null,"Select One",null,null,null,null,null,null,null,null,null,null,null,null,null,null,"Select One"]
[null,null,null,"Select One",null,null,null,null,null,null,null,null,null,null,null,null,null,null,"Select One"]
[null,null,null,"Select One",null,null,null,null,null,null,null,null,null,null,null,null,null,null,"Select One"]
[null,null,null,"Select One",null,null,null,null,null,null,null,null,null,null,null,null,null,null,"Select One"]
[null,null,null,"Select One",null,null,null,null,null,null,null,null,null,null,null,null,null,null,"Select One"]
[]
[null,null,"SUB-TOTAL",null,null,null,null,null,null,null,null,null,null,null,{"$f":"SUM(O54:O59)","v":0}]
[null,null,7,"SUPPLIES AND MATERIALS:",null,null,null,null,null,null,null,null,null,null,"Amount",null,null,null,"Select from Drop Down List",null,"Budget Detail"]
[null,null,null,"Select One",null,null,null,null,null,null,null,null,null,null,null,null,null,null,"Select One"]
[null,null,null,"Select One",null,null,null,null,null,null,null,null,null,null,null,null,null,null,"Select One"]
[null,null,null,"Select One",null,null,null,null,null,null,null,null,null,null,null,null,null,null,"Select One"]
[null,null,null,"Select One",null,null,null,null,null,null,null,null,null,null,null,null,null,null,"Select One"]
[]
[null,null,"SUB-TOTAL",null,null,null,null,null,null,null,null,null,null,null,{"$f":"SUM(O63:O66)","v":0}]
[null,null,8,"TRAVEL:  (mileage, conference registration, courses, hotels, etc.)",null,null,null,null,null,null,null,null,null,null,"Amount",null,null,null,"Select from Drop Down List",null,"Budget Detail"]
[null,null,null,"Select One",null,null,null,null,null,null,null,null,null,null,null,null,null,null,"Select One"]
[null,null,null,"Select One",null,null,null,null,null,null,null,null,null,null,null,null,null,null,"Select One"]
[null,null,null,"Select One",null,null,null,null,null,null,null,null,null,null,null,null,null,null,"Select One"]
[null,null,null,"Select One",null,null,null,null,null,null,null,null,null,null,null,null,null,null,"Select One"]
[]
[null,null,"SUB-TOTAL",null,null,null,null,null,null,null,null,null,null,null,{"$f":"SUM(O70:O73)","v":0}]
[null,null,9,"OTHER COSTS:",null,null,null,null,null,null,null,null,null,null,"Amount",null,null,null,"Select from Drop Down List",null,"Budget Detail"]
[null,null,null,"Select One",null,null,null,null,null,null,null,null,null,null,null,null,null,null,"Select One"]
[null,null,null,"Select One",null,null,null,null,null,null,null,null,null,null,null,null,null,null,"Select One"]
[null,null,null,"Select One",null,null,null,null,null,null,null,null,null,null,null,null,null,null,"Select One"]
[null,null,null,"Select One",null,null,null,null,null,null,null,null,null,null,null,null,null,null,"Select One"]
[null,null,null,"Select One",null,null,null,null,null,null,null,null,null,null,null,null,null,null,"Select One"]
[null,null,null,"Select One",null,null,null,null,null,null,null,null,null,null,null,null,null,null,"Select One"]
[]
[null,null,"SUB-TOTAL",null,null,null,null,null,null,null,null,null,null,null,{"$f":"SUM(O77:O82)","v":0}]
[null,null,null,null,null,null,"(a) rate (%)",null,"(b) allocation less indirect"]
[null,null,10,"INDIRECT COSTS *",null,null,null,null,{"$f":"IF(G86=\"\",\"\", F6/(1+G86))","v":""}]
[null,null,null,"   maximum allowed",null,null," (a x b)",null,{"$f":"IFERROR(+I86*G86,\"\")","v":""}]
[]
[]
[null,null,11,"EQUIPMENT:\nOnly list items costing $5,000+ per unit and having a useful life more than 1 year",null,null,null,null,null,null,null,null,null,null,"Amount",null,null,null,"Select from Drop Down List",null,"Budget Detail"]
[null,null,null,null,null,null,null,null,null,null,null,null,null,null,null,null,null,null,"Select One"]
[null,null,null,null,null,null,null,null,null,null,null,null,null,null,null,null,null,null,"Select One"]
[]
[null,null,"SUB-TOTAL",null,null,null,null,null,null,null,null,null,null,null,{"$f":"SUM(O91:O92)","v":0}]
[]
[null,null,"TOTAL FUNDS REQUESTED ",null,null,null,null,null,null,null,null,null,null,null,{"$f":"SUM(O94,O86,O84,O75,O68,O61,O52,O44,O37,O31,O22)","v":0}]
[]
[]
[]
[null,null,"* Indirect costs must be consistent with the rate established by the Office of School Finance.  Districts are allowed to take less than the maximum.  In calculating the indirect cost allowable for a particular grant, note that indirect"]
[null,null,"costs cannot be charged on either capital expenditures or on indirect costs themselves.  To arrive at the allowable amount one cannot simply multiply a total entitlement by the indirect rate.  The decision to recover "]
[null,null,"indirect costs using these established rates is a local option.  If indirect costs are recovered, they shall be returned to the general fund of the city or town in  accordance with G.L. Chapter 44, Section 53.  In the case"]
[null,null,"of regional schools, indirect costs shall be returned to the regional school general fund. "]
[null,null,"www.doe.mass.edu/Grants/essential.html"]

{"sheet":"14. Title IV, Part A Narrative","index":16,"n_rows":53,"n_cols":21,"rows_kept":53,"cut":false,"hidden":false,"merged":[[52,1,52,7],[1,1,1,7],[36,18,36,20],[33,2,33,7],[33,13,33,15],[33,16,33,17],[33,18,33,20],[34,2,34,7],[34,13,34,15],[34,16,34,17],[34,18,34,20],[35,2,35,7],[35,13,35,15],[35,16,35,17],[35,18,35,20],[17,3,17,10],[17,11,17,12],[17,20,17,21],[31,18,31,20],[32,2,32,7],[10,16,11,17],[10,18,11,19],[10,11,11,12],[21,11,21,12],[12,11,12,12],[19,3,19,10],[14,20,14,21],[15,3,15,10],[15,11,15,12],[15,20,15,21],[14,3,14,10],[14,11,14,12],[19,11,19,12],[19,20,19,21],[13,3,13,10],[13,11,13,12],[13,20,13,21],[16,3,16,10],[16,11,16,12],[16,20,16,21],[18,3,18,10],[18,11,18,12],[18,20,18,21],[31,2,31,7],[31,13,31,15],[31,16,31,17],[36,2,36,7],[36,13,36,15],[36,16,36,17],[26,13,26,17],[20,20,20,21],[21,20,21,21],[32,18,32,20],[32,13,32,15],[32,16,32,17],[30,16,30,17],[25,1,25,20],[27,13,28,17],[26,8,26,10],[26,1,26,7],[20,11,20,12],[49,1,49,7],[51,1,51,7],[39,2,39,7],[2,5,2,13],[4,1,4,14],[7,1,7,2],[21,3,21,10],[12,3,12,10],[10,3,11,10],[10,1,11,2],[8,1,8,20],[10,13,10,15],[20,3,20,10],[24,1,24,2],[27,8,27,10],[30,2,30,7],[37,2,37,7],[27,1,28,7],[27,11,28,12],[38,2,38,7],[30,13,30,15],[37,13,37,15],[37,16,37,17],[38,16,38,17],[53,2,53,10],[50,1,50,7],[42,1,42,2],[42,11,55,15],[39,16,39,17],[9,16,9,17],[9,18,9,19],[9,11,9,12],[26,11,26,12],[26,18,26,20],[37,18,37,20],[38,18,38,20],[39,18,39,20],[38,13,38,15],[27,18,28,20],[30,18,30,20],[39,13,39,15],[10,20,11,21],[12,20,12,21],[43,1,43,9],[46,1,46,7],[47,1,47,7],[48,1,48,7],[45,1,45,7]]}
[]
[null,{"$f":"valDistrName & \" (\"&valorg4code&\")\"","v":"Org Name (Org )"}]
[null,"Title IV, Part A",null,null,null,"Student Support and Academic Enrichment (Fund Code 309)"]
[]
[null,"   Program Purpose\n     Improving students' academic achievement by:\n       1. Providing all students with access to a well-rounded education;\n       2. Improving school conditions for learning; and\n       3. Improving the use of technology in order to improve academic achievement and digital literacy of all students.  "]
[]
[]
[null,"STEP 14.1\n(All Title IV, Part A Recipients must complete)"]
[null,"From Tab 5:  District Activities and Strategies\nColumns A & B will populate automatically from Tab 5, Step 5.5 for any activity that you indicate includes Title IV, Part A funding.  Starting with Column C, describe only those activities from each strategy/activity that will be funded in whole or in part with Title IV, Part A funds."]
[null,null,"A",null,null,null,null,"B",null,null,null,"C",null,null,"D",null,"E",null,"F",null,"G"]
[null,"Strategy/Activity",null,"Description ",null,null,null,null,null,null,null,"Describe specific activities funded by Title IVA, including any partnerships with outside organizations",null,"Indicate Title IVA categories each activity supports\n(Yes or No)\nEach activity must have a \"yes\" in at least one category",null,null,"What data prompted this activity?\n(Select at least one source for each activity; report additional sources/explanation in \"Other\" box at row's end)",null,"What data will you use to determine progress and attainment of goals?\n(Select at least one source for each activity; report additional sources/explanation in \"Other\" box at row's end)",null,"If  you selected \"Other\" in Column E or F,  please describe data you will ues here"]
[null,null,null,null,null,null,null,null,null,null,null,null,null,"Access to Well Rounded Education","Safe and Healthy Schools","Effective Use of Technology"]
[{"$f":"IF(C13=\"\",1,0)","v":1},1,{"$f":"IF(ISBLANK('5. Districtwide Strategies'!C44),\"\",IF('5. Districtwide Strategies'!P44<>\"\",'5. Districtwide Strategies'!C44,\"\"))","v":""},{"$f":"IF(ISBLANK('5. Districtwide Strategies'!D44),\"\",IF('5. Districtwide Strategies'!P44<>\"\",'5. Districtwide Strategies'!D44,\"\"))","v":""},null,null,null,null,null,null,null,null,null,"Select One","Select One","Select One","Select One","Select One","Select One","Select One"]
[{"$f":"IF(C14=\"\",1,0)","v":1},2,{"$f":"IF(ISBLANK('5. Districtwide Strategies'!C45),\"\",IF('5. Districtwide Strategies'!P45<>\"\",'5. Districtwide Strategies'!C45,\"\"))","v":""},{"$f":"IF(ISBLANK('5. Districtwide Strategies'!D45),\"\",IF('5. Districtwide Strategies'!P45<>\"\",'5. Districtwide Strategies'!D45,\"\"))","v":""},null,null,null,null,null,null,null,null,null,"Select One","Select One","Select One","Select One","Select One","Select One","Select One"]
[{"$f":"IF(C15=\"\",1,0)","v":1},3,{"$f":"IF(ISBLANK('5. Districtwide Strategies'!C46),\"\",IF('5. Districtwide Strategies'!P46<>\"\",'5. Districtwide Strategies'!C46,\"\"))","v":""},{"$f":"IF(ISBLANK('5. Districtwide Strategies'!D46),\"\",IF('5. Districtwide Strategies'!P46<>\"\",'5. Districtwide Strategies'!D46,\"\"))","v":""},null,null,null,null,null,null,null,null,null,"Select One","Select One","Select One","Select One","Select One","Select One","Select One"]
[{"$f":"IF(C16=\"\",1,0)","v":1},4,{"$f":"IF(ISBLANK('5. Districtwide Strategies'!C47),\"\",IF('5. Districtwide Strategies'!P47<>\"\",'5. Districtwide Strategies'!C47,\"\"))","v":""},{"$f":"IF(ISBLANK('5. Districtwide Strategies'!D47),\"\",IF('5. Districtwide Strategies'!P47<>\"\",'5. Districtwide Strategies'!D47,\"\"))","v":""},null,null,null,null,null,null,null,null,null,"Select One","Select One","Select One","Select One","Select One","Select One","Select One"]
[1,5,{"$f":"IF(ISBLANK('5. Districtwide Strategies'!C48),\"\",IF('5. Districtwide Strategies'!P48<>\"\",'5. Districtwide Strategies'!C48,\"\"))","v":""},{"$f":"IF(ISBLANK('5. Districtwide Strategies'!D48),\"\",IF('5. Districtwide Strategies'!P48<>\"\",'5. Districtwide Strategies'!D48,\"\"))","v":""},null,null,null,null,null,null,null,null,null,"Select One","Select One","Select One","Select One","Select One","Select One","Select One"]
[1,6,{"$f":"IF(ISBLANK('5. Districtwide Strategies'!C49),\"\",IF('5. Districtwide Strategies'!P49<>\"\",'5. Districtwide Strategies'!C49,\"\"))","v":""},{"$f":"IF(ISBLANK('5. Districtwide Strategies'!D49),\"\",IF('5. Districtwide Strategies'!P49<>\"\",'5. Districtwide Strategies'!D49,\"\"))","v":""},null,null,null,null,null,null,null,null,null,"Select One","Select One","Select One","Select One","Select One","Select One","Select One"]
[1,7,{"$f":"IF(ISBLANK('5. Districtwide Strategies'!C50),\"\",IF('5. Districtwide Strategies'!P50<>\"\",'5. Districtwide Strategies'!C50,\"\"))","v":""},{"$f":"IF(ISBLANK('5. Districtwide Strategies'!D50),\"\",IF('5. Districtwide Strategies'!P50<>\"\",'5. Districtwide Strategies'!D50,\"\"))","v":""},null,null,null,null,null,null,null,null,null,"Select One","Select One","Select One","Select One","Select One","Select One","Select One"]
[1,8,{"$f":"IF(ISBLANK('5. Districtwide Strategies'!C51),\"\",IF('5. Districtwide Strategies'!P51<>\"\",'5. Districtwide Strategies'!C51,\"\"))","v":""},{"$f":"IF(ISBLANK('5. Districtwide Strategies'!D51),\"\",IF('5. Districtwide Strategies'!P51<>\"\",'5. Districtwide Strategies'!D51,\"\"))","v":""},null,null,null,null,null,null,null,null,null,"Select One","Select One","Select One","Select One","Select One","Select One","Select One"]
[1,9,{"$f":"IF(ISBLANK('5. Districtwide Strategies'!C52),\"\",IF('5. Districtwide Strategies'!P52<>\"\",'5. Districtwide Strategies'!C52,\"\"))","v":""},{"$f":"IF(ISBLANK('5. Districtwide Strategies'!D52),\"\",IF('5. Districtwide Strategies'!P52<>\"\",'5. Districtwide Strategies'!D52,\"\"))","v":""},null,null,null,null,null,null,null,null,null,"Select One","Select One","Select One","Select One","Select One","Select One","Select One"]
[1,10,{"$f":"IF(ISBLANK('5. Districtwide Strategies'!C53),\"\",IF('5. Districtwide Strategies'!P53<>\"\",'5. Districtwide Strategies'!C53,\"\"))","v":""},{"$f":"IF(ISBLANK('5. Districtwide Strategies'!D53),\"\",IF('5. Districtwide Strategies'!P53<>\"\",'5. Districtwide Strategies'!D53,\"\"))","v":""},null,null,null,null,null,null,null,null,null,"Select One","Select One","Select One","Select One","Select One","Select One","Select One"]
[]
[]
[null,"STEP 14.2\n(All Title IVA Recipients must complete)"]
[null,"Title IVA-funded activities not listed above from Tab 5.\nStarting with Column A, describe  activities not listed above that will be funded in whole or in part with Title IV, Part A funds. "]
[null,"A",null,null,null,null,null,null,"B",null,null,"C",null,"D",null,null,null,null,"E"]
[null,"Describe specific activities funded by Title IVA, including any partnerships with outside organizations.",null,null,null,null,null,null,"Indicate which Title IVA categories each activity supports (Yes or No)\nEach activity must have a \"yes\" in at least one category",null,null,"What data prompted this activity?\n(Select at least one source for each activity; report additional sources/explanation in \"Other\" box at row's end)",null,"What data will you use to determine progress and attainment of goals?\n(Select at least one source for each activity; report additional sources/explanation in \"Other\" box at row's end)",null,null,null,null,"If  you selected \"Other\" in Column C or D,  please describe data you will use here"]
[null,null,null,null,null,null,null,null,"Access to Well Rounded Education","Safe and Healthy Schools","Effective Use of Technology"]
[null,null,"A"]
[null,1,null,null,null,null,null,null,"Select One","Select One","Select One","Select One","Select One","Select One",null,null,"Select One"]
[null,2,null,null,null,null,null,null,"Select One","Select One","Select One","Select One","Select One","Select One",null,null,"Select One"]
[null,3,null,null,null,null,null,null,"Select One","Select One","Select One","Select One","Select One","Select One",null,null,"Select One"]
[null,4,null,null,null,null,null,null,"Select One","Select One","Select One","Select One","Select One","Select One",null,null,"Select One"]
[null,5,null,null,null,null,null,null,"Select One","Select One","Select One","Select One","Select One","Select One",null,null,"Select One"]
[null,6,null,null,null,null,null,null,"Select One","Select One","Select One","Select One","Select One","Select One",null,null,"Select One"]
[null,7,null,null,null,null,null,null,"Select One","Select One","Select One","Select One","Select One","Select One",null,null,"Select One"]
[null,8,null,null,null,null,null,null,"Select One","Select One","Select One","Select One","Select One","Select One",null,null,"Select One"]
[null,9,null,null,null,null,null,null,"Select One","Select One","Select One","Select One","Select One","Select One",null,null,"Select One"]
[null,10,null,null,null,null,null,null,"Select One","Select One","Select One","Select One","Select One","Select One",null,null,"Select One"]
[]
[]
[null,"Step 14.3\n(Only for districts receiving\n ≥ $30,000 in Title IVA funds)",null,null,null,null,null,null,null,null,null,"\nInstructions:  Insert dollar figures for each of the spending categories in Column A that have not been prepopulated.  If an activity includes more than one category, please allocate funds among the categories included to the best of your ability. \n\nDistricts with an allocation of at least $30,000 must: \n  • Conduct a comprehensive needs assessment that includes a focus on the Title IV, Part A priorities \n    (see above.) Note: Districts may fulfill (or have fulfilled) this requirement as part of the development \n    of the districts' strategic plan, improvement plan, etc. reported on Tab 5.\n\n  • Spend at least 20% of the allocation on access to well-rounded educational opportunities\n\n  • Spend at least 20% of the allocation on safe and healthy schools\n\n  • Spend some amount on improving the use of technology\n\n  • Spend the remainder on activities that support any/all of the three priorities\n\n  • No more than 15 percent of Title IVA allocation used for activities to support the effective use of \n    technology may be used for purchasing technology infrastructure. (e.g., devices, equipment, \n    software applications, platforms, digital instructional resources and/or other one-time IT purchases.\n\n  •  If funding does not meet above requirements, cell will turn red indicating an error.  Please adjust \n     spending accordingly."]
[null,"ALLOCATION OF YOUR TITLE IVA FUNDS"]
[null,null,null,null,null,null,null,null,"$","%"]
[null,"Amount available for Title IVA spending (after flexing)",null,null,null,null,null,null,{"$f":"valAllocationFlexT4","v":0}]
[null,"Equitable participation for private school students (from private school tab)",null,null,null,null,null,null,{"$f":"ROUND(valPrivateSchoolT4,0)","v":0},{"$f":"IFERROR(I47/$I$46,\"\")","v":""}]
[null,"District Administration (no more than 2% of Title IVA allocation, after flexing)",null,null,null,null,null,null,null,{"$f":"IFERROR($I$48/$I$46,\"\")","v":""}]
[null,"Access to Well-Rounded Education (at least 20%)",null,null,null,null,null,null,null,{"$f":"IFERROR($I$49/$I$46, \"\")","v":""}]
[null,"Safe and Healthy Schools (at least 20%)",null,null,null,null,null,null,null,{"$f":"IFERROR(I50/$I$46,\"\")","v":""}]
[null,"Effective Use of Technology (must be > $0)",null,null,null,null,null,null,null,{"$f":"IFERROR(I51/$I$46, \"\")","v":""}]
[null,"Effective Use of Technology (infrastructure) (no more than 15% of total technology expenditures)",null,null,null,null,null,null,null,{"$f":"IFERROR($I$52/$I$51, \"N/A\")","v":"N/A"}]
[null,"Total ",null,null,null,null,null,null,{"$f":"SUM(I47:I52)","v":0},{"$f":"IFERROR(I53/I46,\"\")","v":""}]

{"sheet":"15. Title IV, Part A Budget","index":17,"n_rows":104,"n_cols":24,"rows_kept":104,"cut":false,"hidden":false,"merged":[[103,2,103,5],[70,20,70,21],[71,20,71,21],[75,20,75,21],[95,15,95,16],[3,1,3,23],[89,3,89,10],[89,16,92,16],[89,20,89,21],[90,3,90,9],[90,20,90,21],[91,3,91,9],[91,20,91,21],[92,20,92,21],[80,3,80,9],[80,20,80,21],[81,3,81,9],[81,20,81,21],[82,2,82,10],[84,8,84,9],[84,16,87,16],[85,8,85,9],[86,8,86,9],[73,2,73,10],[75,16,82,16],[76,3,76,9],[76,20,76,21],[77,3,77,9],[77,20,77,21],[78,3,78,9],[78,20,78,21],[79,3,79,9],[79,20,79,21],[66,3,66,5],[68,3,68,9],[68,16,73,16],[68,20,68,21],[69,3,69,9],[69,20,69,21],[70,3,70,9],[71,3,71,9],[72,3,72,9],[72,20,72,21],[61,16,66,16],[61,20,61,21],[62,3,62,9],[62,20,62,21],[63,3,63,9],[63,20,63,21],[64,3,64,9],[64,20,64,21],[65,3,65,9],[65,20,65,21],[56,20,56,21],[57,3,57,6],[57,20,57,21],[58,3,58,6],[58,20,58,21],[59,2,59,10],[52,16,58,16],[52,20,52,21],[53,3,53,6],[53,20,53,21],[54,3,54,6],[54,20,54,21],[55,3,55,6],[55,20,55,21],[56,3,56,6],[44,23,45,23],[45,3,45,10],[46,3,46,10],[46,20,46,21],[47,3,47,10],[47,20,47,21],[41,3,41,6],[41,20,41,21],[42,2,42,10],[43,2,43,6],[44,3,44,10],[44,16,50,16],[48,3,48,10],[48,20,48,21],[49,3,49,10],[49,20,49,21],[50,2,50,10],[44,20,45,21],[35,2,35,10],[36,2,36,6],[37,16,41,16],[37,20,37,21],[38,3,38,6],[38,20,38,21],[39,3,39,6],[39,20,39,21],[40,3,40,6],[40,20,40,21],[32,3,32,6],[32,20,32,21],[33,3,33,6],[33,20,33,21],[34,3,34,6],[34,20,34,21],[28,3,28,6],[28,20,28,21],[29,2,29,10],[29,20,29,21],[30,2,30,6],[31,3,31,6],[31,20,31,21],[26,3,26,6],[26,20,26,21],[27,3,27,6],[27,20,27,21],[19,3,19,6],[19,20,19,21],[20,20,20,21],[21,2,21,6],[22,20,22,21],[23,3,23,6],[23,16,28,16],[23,20,23,21],[24,3,24,6],[24,20,24,21],[16,3,16,6],[16,16,20,16],[16,20,16,21],[17,3,17,6],[17,20,17,21],[18,3,18,6],[18,20,18,21],[25,3,25,6],[25,20,25,21],[1,1,1,9],[1,20,1,24],[2,20,2,21],[6,2,6,4],[6,5,6,6],[6,7,6,8],[6,9,6,10],[13,1,13,24],[14,2,14,10],[14,20,14,21]]}
[]
[null,{"$f":"valDistrName & \" (\"&valorg4code&\")\"","v":"Org Name (Org )"}]
[]
[null,"FY19 Title IV, Part A (Fund Code 309) Budget WorkSheet"]
[]
[]
[null,null,"Allocation (before any flexing)",null,null,{"$f":"valAllocationT4","v":0}]
[]
[]
[null,null,null,null,null,null,null,null,null,{"$f":"valDistrName","v":"Org Name"}]
[null,null,null,null,null,null,null,null,{"$f":"valDistrName","v":"Org Name"}]
[]
[]
[]
[null,null,"Line Item Category: Select an option from the drop down menu.",null,null,null,null,null,null,null,null,null,"Amount",null,"Expenditures (whole numbers)",null,"Expense includes private school services",null,"Primary Function",null,"Comments",null,null,"Flexed Funds \n(Which Title program rec'd Title IV, Part A funds?)"]
[]
[null,null,1,"ADMINISTRATOR SALARIES:",null,null,null,null,"# of staff","FTE","MTRS",null,null,null,"Amount",null,null,null,"Select from Drop Down List",null,"Budget Detail"]
[null,null,null,"Select One",null,null,null,null,null,null,null,false,{"$f":"IF(L18,O18,0)","v":0},null,null,null,null,null,"Select One",null,null,null,null,"Select, if applicable"]
[null,null,null,"Select One",null,null,null,null,null,null,null,false,{"$f":"IF(L19,O19,0)","v":0},null,null,null,null,null,"Select One",null,null,null,null,"Select, if applicable"]
[null,null,null,"Select One",null,null,null,null,null,null,null,false,{"$f":"IF(L20,O20,0)","v":0},null,null,null,null,null,"Select One",null,null,null,null,"Select, if applicable"]
[]
[null,null,"SUB-TOTAL",null,null,null,null,null,{"$f":"SUM(I18:I20)","v":0},{"$f":"SUM(J18:J20)","v":0},null,null,{"$f":"SUM(M18:M20)","v":0},null,{"$f":"SUM(O18:O20)","v":0}]
[null,null,2,"INSTRUCTIONAL/PROF STAFF:",null,null,null,null,"# of staff","FTE","MTRS",null,null,null,"Amount",null,null,null,"Select from Drop Down List",null,"Budget Detail"]
[null,null,null,"Select One",null,null,null,null,null,null,null,false,{"$f":"IF(L24, O24,0)","v":0},null,null,null,null,null,"Select One",null,null,null,null,"Select, if applicable"]
[null,null,null,"Select One",null,null,null,null,null,null,null,false,0,null,null,null,null,null,"Select One",null,null,null,null,"Select, if applicable"]
[null,null,null,"Select One",null,null,null,null,null,null,null,false,0,null,null,null,null,null,"Select One",null,null,null,null,"Select, if applicable"]
[null,null,null,"Select One",null,null,null,null,null,null,null,false,0,null,null,null,null,null,"Select One",null,null,null,null,"Select, if applicable"]
[null,null,null,"Select One",null,null,null,null,null,null,null,false,0,null,null,null,null,null,"Select One",null,null,null,null,"Select, if applicable"]
[null,null,null,"Select One",null,null,null,null,null,null,null,false,0,null,null,null,null,null,"Select One",null,null,null,null,"Select, if applicable"]
[]
[null,null,"SUB-TOTAL",null,null,null,null,null,{"$f":"SUM(I24:I29)","v":0},{"$f":"SUM(J24:J29)","v":0},null,null,{"$f":"SUM(M24:M29)","v":0},null,{"$f":"SUM(O24:O29)","v":0}]
[null,null,3,"SUPPORT STAFF SALARIES:",null,null,null,null,"# of staff","FTE","MTRS",null,null,null,"Amount",null,null,null,"Select from Drop Down List",null,"Budget Detail"]
[null,null,null,"Select One",null,null,null,null,null,null,null,false,{"$f":"IF(L33, O33, 0)","v":0},null,null,null,null,null,"Select One",null,null,null,null,"Select, if applicable"]
[null,null,null,"Select One",null,null,null,null,null,null,null,false,{"$f":"IF(L34, O34, 0)","v":0},null,null,null,null,null,"Select One",null,null,null,null,"Select, if applicable"]
[null,null,null,"Select One",null,null,null,null,null,null,null,false,0,null,null,null,null,null,"Select One",null,null,null,null,"Select, if applicable"]
[]
[null,null,"SUB-TOTAL",null,null,null,null,null,{"$f":"SUM(I33:I35)","v":0},{"$f":"SUM(J33:J35)","v":0},null,null,{"$f":"SUM(M33:M35)","v":0},null,{"$f":"SUM(O33:O35)","v":0}]
[null,null,4,"STIPENDS:",null,null,null,"# of Staff","Rate","Rate Type","MTRS",null,null,null,"Amount",null,null,null,"Select from Drop Down List",null,"Budget Detail"]
[null,null,null,"Select One",null,null,null,null,null,null,null,false,{"$f":"IF(L39, O39, 0)","v":0},null,null,null,null,null,"Select One",null,null,null,null,"Select, if applicable"]
[null,null,null,"Select One",null,null,null,null,null,null,null,false,{"$f":"IF(L40, O40, 0)","v":0},null,null,null,null,null,"Select One",null,null,null,null,"Select, if applicable"]
[null,null,null,"Select One",null,null,null,null,null,null,null,false,0,null,null,null,null,null,"Select One",null,null,null,null,"Select, if applicable"]
[null,null,null,"Select One",null,null,null,null,null,null,null,false,0,null,null,null,null,null,"Select One",null,null,null,null,"Select, if applicable"]
[]
[null,null,"SUB-TOTAL",null,null,null,null,null,null,null,null,null,{"$f":"SUM(M39:M42)","v":0},null,{"$f":"SUM(O39:O42)","v":0}]
[null,null,5,"FRINGE BENEFITS:",null,null,null,null,null,null,null,null,null,null,"Amount",null,null,null,"Brief Description",null,"Budget Detail"]
[null,null,null,"5a  MTRS (automatically calculated if MTRS box is checked)  ",null,null,null,null,null,null,null,null,null,null,{"$f":"ROUND((SUM(M44,M37,M31,M22))*0.09,0)","v":0}]
[null,null,null,"5b  Other",null,null,null,null,null,null,null,null,null,null,{"$f":"SUM(O48:O50)","v":0},null,null,null,null,null,null,null,null,"Select, if applicable"]
[null,null,null,"Health Insurance",null,null,null,null,null,null,null,null,null,null,null,null,null,null,null,null,null,null,null,"Select, if applicable"]
[null,null,null,"Other Retirement Systems",null,null,null,null,null,null,null,null,null,null,null,null,null,null,null,null,null,null,null,"Select, if applicable"]
[null,null,null,"Federal Insurance Contributions Act (FICA)",null,null,null,null,null,null,null,null,null,null,null,null,null,null,null,null,null,null,null,"Select, if applicable"]
[]
[null,null,"SUB-TOTAL",null,null,null,null,null,null,null,null,null,null,null,{"$f":"SUM(O46:O47)","v":0}]
[null,null,6,"CONTRACTUAL SERVICES:",null,null,null,null,"Rate","Rate Type",null,null,null,null,"Amount",null,null,null,"Select from Drop Down List",null,"Budget Detail"]
[null,null,null,"Select One",null,null,null,null,null,null,null,null,null,null,null,null,null,null,"Select One",null,null,null,null,"Select, if applicable"]
[null,null,null,"Select One",null,null,null,null,null,null,null,null,null,null,null,null,null,null,"Select One",null,null,null,null,"Select, if applicable"]
[null,null,null,"Select One",null,null,null,null,null,null,null,null,null,null,null,null,null,null,"Select One",null,null,null,null,"Select, if applicable"]
[null,null,null,"Select One",null,null,null,null,null,null,null,null,null,null,null,null,null,null,"Select One",null,null,null,null,"Select, if applicable"]
[null,null,null,"Select One",null,null,null,null,null,null,null,null,null,null,null,null,null,null,"Select One",null,null,null,null,"Select, if applicable"]
[null,null,null,"Select One",null,null,null,null,null,null,null,null,null,null,null,null,null,null,"Select One",null,null,null,null,"Select, if applicable"]
[]
[null,null,"SUB-TOTAL",null,null,null,null,null,null,null,null,null,null,null,{"$f":"SUM(O54:O59)","v":0}]
[null,null,7,"SUPPLIES AND MATERIALS:",null,null,null,null,null,null,null,null,null,null,"Amount",null,null,null,"Select from Drop Down List",null,"Budget Detail"]
[null,null,null,"Select One",null,null,null,null,null,null,null,null,null,null,null,null,null,null,"Select One",null,null,null,null,"Select, if applicable"]
[null,null,null,"Select One",null,null,null,null,null,null,null,null,null,null,null,null,null,null,"Select One",null,null,null,null,"Select, if applicable"]
[null,null,null,"Select One",null,null,null,null,null,null,null,null,null,null,null,null,null,null,"Select One",null,null,null,null,"Select, if applicable"]
[null,null,null,"Select One",null,null,null,null,null,null,null,null,null,null,null,null,null,null,"Select One",null,null,null,null,"Select, if applicable"]
[]
[null,null,"SUB-TOTAL",null,null,null,null,null,null,null,null,null,null,null,{"$f":"SUM(O63:O66)","v":0}]
[null,null,8,"TRAVEL:  (mileage, conference registration, courses, hotels, etc.)",null,null,null,null,null,null,null,null,null,null,"Amount",null,null,null,"Select from Drop Down List",null,"Budget Detail"]
[null,null,null,"Select One",null,null,null,null,null,null,null,null,null,null,null,null,null,null,"Select One",null,null,null,null,"Select, if applicable"]
[null,null,null,"Select One",null,null,null,null,null,null,null,null,null,null,null,null,null,null,"Select One",null,null,null,null,"Select, if applicable"]
[null,null,null,"Select One",null,null,null,null,null,null,null,null,null,null,null,null,null,null,"Select One",null,null,null,null,"Select, if applicable"]
[null,null,null,"Select One",null,null,null,null,null,null,null,null,null,null,null,null,null,null,"Select One",null,null,null,null,"Select, if applicable"]
[]
[null,null,"SUB-TOTAL",null,null,null,null,null,null,null,null,null,null,null,{"$f":"SUM(O70:O73)","v":0}]
[null,null,9,"OTHER COSTS:",null,null,null,null,null,null,null,null,null,null,"Amount",null,null,null,"Select from Drop Down List",null,"Budget Detail"]
[null,null,null,"Select One",null,null,null,null,null,null,null,null,null,null,null,null,null,null,"Select One",null,null,null,null,"Select, if applicable"]
[null,null,null,"Select One",null,null,null,null,null,null,null,null,null,null,null,null,null,null,"Select One",null,null,null,null,"Select, if applicable"]
[null,null,null,"Select One",null,null,null,null,null,null,null,null,null,null,null,null,null,null,"Select One",null,null,null,null,"Select, if applicable"]
[null,null,null,"Select One",null,null,null,null,null,null,null,null,null,null,null,null,null,null,"Select One",null,null,null,null,"Select, if applicable"]
[null,null,null,"Select One",null,null,null,null,null,null,null,null,null,null,null,null,null,null,"Select One",null,null,null,null,"Select, if applicable"]
[null,null,null,"Select One",null,null,null,null,null,null,null,null,null,null,null,null,null,null,"Select One",null,null,null,null,"Select, if applicable"]
[]
[null,null,"SUB-TOTAL",null,null,null,null,null,null,null,null,null,null,null,{"$f":"SUM(O77:O82)","v":0}]
[null,null,null,null,null,null,"(a) rate (%)",null,"(b) allocation less indirect"]
[null,null,10,"INDIRECT COSTS *",null,null,null,null,{"$f":"IF(G86=\"\",\"\", F7/(1+G86))","v":""}]
[null,null,null,"   maximum allowed",null,null," (a x b)",null,{"$f":"IFERROR(+I86*G86,\"\")","v":""}]
[]
[]
[null,null,11,"EQUIPMENT:\nOnly list items costing $5,000+ per unit and having a useful life more than 1 year",null,null,null,null,null,null,null,null,null,null,"Amount",null,null,null,"Select from Drop Down List",null,"Budget Detail"]
[null,null,null,null,null,null,null,null,null,null,null,null,null,null,null,null,null,null,"Select One",null,null,null,null,"Select, if applicable"]
[null,null,null,null,null,null,null,null,null,null,null,null,null,null,null,null,null,null,"Select One",null,null,null,null,"Select, if applicable"]
[]
[null,null,"SUB-TOTAL",null,null,null,null,null,null,null,null,null,null,null,{"$f":"SUM(O91:O92)","v":0}]
[]
[null,null,"TOTAL FUNDS REQUESTED ",null,null,null,null,null,null,null,null,null,null,null,{"$f":"SUM(O94,O86,O84,O75,O68,O61,O52,O44,O37,O31,O22)","v":0}]
[]
[]
[]
[null,null,"* Indirect costs must be consistent with the rate established by the Office of School Finance.  Districts are allowed to take less than the maximum.  In calculating the indirect cost allowable for a particular grant, note that indirect"]
[null,null,"costs cannot be charged on either capital expenditures or on indirect costs themselves.  To arrive at the allowable amount one cannot simply multiply a total entitlement by the indirect rate.  The decision to recover "]
[null,null,"indirect costs using these established rates is a local option.  If indirect costs are recovered, they shall be returned to the general fund of the city or town in  accordance with G.L. Chapter 44, Section 53.  In the case"]
[null,null,"of regional schools, indirect costs shall be returned to the regional school general fund. "]
[null,null,"www.doe.mass.edu/Grants/essential.html"]

{"sheet":"16. Schedule A","index":18,"n_rows":168,"n_cols":13,"rows_kept":168,"cut":false,"hidden":false,"merged":[[121,2,121,6],[121,7,121,9],[121,10,121,12],[154,2,154,6],[154,7,154,9],[154,10,154,12],[155,2,155,6],[155,7,155,9],[155,10,155,12],[150,2,150,6],[150,7,150,9],[150,10,150,12],[151,2,151,6],[151,7,151,9],[151,10,151,12],[148,2,148,6],[148,7,148,9],[148,10,148,12],[149,2,149,6],[149,7,149,9],[149,10,149,12],[145,2,146,6],[145,7,146,9],[145,10,146,12],[81,2,81,6],[81,7,81,9],[81,10,81,12],[82,2,82,6],[82,7,82,9],[82,10,82,12],[116,2,116,6],[116,7,116,9],[116,10,116,12],[112,2,112,6],[112,7,112,9],[112,10,112,12],[113,2,113,6],[113,7,113,9],[113,10,113,12],[110,2,110,6],[110,7,110,9],[110,10,110,12],[111,2,111,6],[111,7,111,9],[111,10,111,12],[108,2,108,6],[108,7,108,9],[108,10,108,12],[39,2,39,6],[39,7,39,9],[39,10,39,12],[40,2,40,6],[40,7,40,9],[40,10,40,12],[41,2,41,6],[41,7,41,9],[41,10,41,12],[36,2,36,6],[36,7,36,9],[36,10,36,12],[37,2,37,6],[37,7,37,9],[37,10,37,12],[38,2,38,6],[38,7,38,9],[38,10,38,12],[164,7,165,9],[164,10,165,12],[165,2,165,6],[167,2,168,12],[162,2,162,6],[162,7,162,9],[162,10,162,12],[163,2,163,6],[163,7,163,9],[163,10,163,12],[160,2,160,6],[160,7,160,9],[160,10,160,12],[161,2,161,6],[161,7,161,9],[161,10,161,12],[152,2,152,6],[152,7,152,9],[152,10,152,12],[153,2,153,6],[153,7,153,9],[153,10,153,12],[156,2,156,6],[156,7,156,9],[156,10,156,12],[157,2,157,6],[157,7,157,9],[157,10,157,12],[158,2,158,6],[158,7,158,9],[158,10,158,12],[159,2,159,6],[159,7,159,9],[159,10,159,12],[147,2,147,6],[147,7,147,9],[147,10,147,12],[140,2,141,2],[140,3,141,5],[140,6,141,11],[140,12,141,12],[142,2,143,2],[142,3,143,5],[142,6,143,11],[142,12,143,12],[128,2,129,12],[133,2,133,12],[134,2,134,12],[136,2,136,12],[138,2,139,2],[138,3,139,12],[124,2,124,6],[124,7,124,9],[124,10,124,12],[125,7,126,9],[125,10,126,12],[126,2,126,6],[122,2,122,6],[122,7,122,9],[122,10,122,12],[123,2,123,6],[123,7,123,9],[123,10,123,12],[114,2,114,6],[114,7,114,9],[114,10,114,12],[115,2,115,6],[115,7,115,9],[115,10,115,12],[117,2,117,6],[117,7,117,9],[117,10,117,12],[118,2,118,6],[118,7,118,9],[118,10,118,12],[119,2,119,6],[119,7,119,9],[119,10,119,12],[120,2,120,6],[120,7,120,9],[120,10,120,12],[109,2,109,6],[109,7,109,9],[109,10,109,12],[103,2,104,2],[103,3,104,5],[103,6,104,11],[103,12,104,12],[106,2,107,6],[106,7,107,9],[106,10,107,12],[95,2,95,12],[97,2,97,12],[99,2,100,2],[99,3,100,12],[101,2,102,2],[101,3,102,5],[101,6,102,11],[101,12,102,12],[86,7,87,9],[86,10,87,12],[87,2,87,6],[89,2,90,12],[94,2,94,12],[84,2,84,6],[84,7,84,9],[84,10,84,12],[85,2,85,6],[85,7,85,9],[85,10,85,12],[76,2,76,6],[76,7,76,9],[76,10,76,12],[83,2,83,6],[83,7,83,9],[83,10,83,12],[77,2,77,6],[77,7,77,9],[77,10,77,12],[78,2,78,6],[78,7,78,9],[78,10,78,12],[79,2,79,6],[79,7,79,9],[79,10,79,12],[80,2,80,6],[80,7,80,9],[80,10,80,12],[74,2,74,6],[74,7,74,9],[74,10,74,12],[75,2,75,6],[75,7,75,9],[75,10,75,12],[72,2,72,6],[72,7,72,9],[72,10,72,12],[73,2,73,6],[73,7,73,9],[73,10,73,12],[70,2,70,6],[70,7,70,9],[70,10,70,12],[71,2,71,6],[71,7,71,9],[71,10,71,12],[67,2,68,6],[67,7,68,9],[67,10,68,12],[69,2,69,6],[69,7,69,9],[69,10,69,12],[62,2,63,2],[62,3,63,5],[62,6,63,11],[62,12,63,12],[64,2,65,2],[64,3,65,5],[64,6,65,11],[64,12,65,12],[55,2,55,12],[56,2,56,12],[58,2,58,12],[60,2,61,2],[60,3,61,12],[1,3,1,11],[2,3,12,11],[46,7,47,9],[46,10,47,12],[47,2,47,6],[49,2,50,12],[44,2,44,6],[44,7,44,9],[44,10,44,12],[45,2,45,6],[45,7,45,9],[45,10,45,12],[43,10,43,12],[34,2,34,6],[34,7,34,9],[34,10,34,12],[35,2,35,6],[35,7,35,9],[35,10,35,12],[42,2,42,6],[42,7,42,9],[42,10,42,12],[43,2,43,6],[43,7,43,9],[32,2,32,6],[32,7,32,9],[32,10,32,12],[33,2,33,6],[33,7,33,9],[33,10,33,12],[30,2,30,6],[30,7,30,9],[30,10,30,12],[31,2,31,6],[31,7,31,9],[31,10,31,12],[27,7,28,9],[27,10,28,12],[29,2,29,6],[29,7,29,9],[29,10,29,12],[14,9,14,12],[15,2,15,12],[16,2,16,12],[18,2,18,12],[20,2,21,2],[20,3,21,12],[22,2,23,2],[22,3,23,5],[22,6,23,11],[22,12,23,12],[24,2,25,2],[24,3,25,5],[24,6,25,11],[24,12,25,12],[27,2,28,6]]}
[]
[null,null,null,"Instructions:\n\n "]
[null,null,null," • Fill out and print a separate copy of Schedule A for each ESSA Title program for which funds are assigned from other grant recipients and your district (agency) is operator/administrator.   \n\n  • Please fill in the appropriate grant program and fund code where indicated.\n            •   Title I, Part A/Fund Code 305; \n            •   Title II, Part A/Fund Code 140; \n            •  Title III/Fund Code 180; \n            •  Title IVA/Fund Code 309.\n"]
[]
[]
[]
[]
[]
[]
[]
[]
[]
[]
[]
[]
[null,null,"MASSACHUSETTS DEPARTMENT OF ELEMENTARY AND SECONDARY EDUCATION"]
[null,null,"STANDARD APPLICATION FOR PROGRAM GRANTS"]
[]
[null,null,"FY19 SCHEDULE A - Assignment Schedule"]
[]
[null,null,1,"Schedule A is to be completed if the applicant agency operates and administers a grant project using funds from more than one grant recipient."]
[]
[null,null,2,"Agency operating and administering the project:  ",null,null,{"$f":"valDistrName","v":"Org Name"},null,null,null,null,null,{"$f":"OrgCode","v":"Org "}]
[]
[null,null,3,"Name of grant program/\nFund Code:"]
[]
[]
[null,null,"Name of Participating Agency",null,null,null,null,"Amount of \nAssigned Funds",null,null,"* Authorized Signature"]
[]
[]
[]
[]
[]
[]
[]
[]
[]
[]
[]
[]
[]
[]
[]
[]
[]
[]
[null,null,null,null,null,null,null,{"$f":"SUM(H30:J46)","v":0}]
[null,null,"Total of Assigned Funds"]
[]
[null,null,"*I/We assign the identified funds to the project described in the accompanying grant application.  The indicated agency is authorized to receive and disburse funds for the purpose of operating the project."]
[]
[]
[]
[]
[]
[null,null,"MASSACHUSETTS DEPARTMENT OF ELEMENTARY AND SECONDARY EDUCATION"]
[null,null,"STANDARD APPLICATION FOR PROGRAM GRANTS"]
[]
[null,null,"FY19 SCHEDULE A - Assignment Schedule"]
[]
[null,null,1,"Schedule A is to be completed if the applicant agency operates and administers a grant project using funds from more than one grant recipient."]
[]
[null,null,2,"Agency operating and administering the project:  ",null,null,{"$f":"valDistrName","v":"Org Name"},null,null,null,null,null,{"$f":"OrgCode","v":"Org "}]
[]
[null,null,3,"Name of grant program/\nFund Code:"]
[]
[]
[null,null,"Name of Participating Agency",null,null,null,null,"Amount of \nAssigned Funds",null,null,"* Authorized Signature"]
[]
[]
[]
[]
[]
[]
[]
[]
[]
[]
[]
[]
[]
[]
[]
[]
[]
[]
[null,null,null,null,null,null,null,{"$f":"SUM(H70:J86)","v":0}]
[null,null,"Total of Assigned Funds"]
[]
[null,null,"*I/We assign the identified funds to the project described in the accompanying grant application.  The indicated agency is authorized to receive and disburse funds for the purpose of operating the project."]
[]
[]
[]
[]
[null,null,"MASSACHUSETTS DEPARTMENT OF ELEMENTARY AND SECONDARY EDUCATION"]
[null,null,"STANDARD APPLICATION FOR PROGRAM GRANTS"]
[]
[null,null,"FY19 SCHEDULE A - Assignment Schedule"]
[]
[null,null,1,"Schedule A is to be completed if the applicant agency operates and administers a grant project using funds from more than one grant recipient."]
[]
[null,null,2,"Agency operating and administering the project:  ",null,null,{"$f":"valDistrName","v":"Org Name"},null,null,null,null,null,{"$f":"OrgCode","v":"Org "}]
[]
[null,null,3,"Name of grant program/\nFund Code:"]
[]
[]
[null,null,"Name of Participating Agency",null,null,null,null,"Amount of \nAssigned Funds",null,null,"* Authorized Signature"]
[]
[]
[]
[]
[]
[]
[]
[]
[]
[]
[]
[]
[]
[]
[]
[]
[]
[]
[null,null,null,null,null,null,null,{"$f":"SUM(H109:J125)","v":0}]
[null,null,"Total of Assigned Funds"]
[]
[null,null,"*I/We assign the identified funds to the project described in the accompanying grant application.  The indicated agency is authorized to receive and disburse funds for the purpose of operating the project."]
[]
[]
[]
[]
[null,null,"MASSACHUSETTS DEPARTMENT OF ELEMENTARY AND SECONDARY EDUCATION"]
[null,null,"STANDARD APPLICATION FOR PROGRAM GRANTS"]
[]
[null,null,"FY19 SCHEDULE A - Assignment Schedule"]
[]
[null,null,1,"Schedule A is to be completed if the applicant agency operates and administers a grant project using funds from more than one grant recipient."]
[]
[null,null,2,"Agency operating and administering the project:  ",null,null,{"$f":"valDistrName","v":"Org Name"},null,null,null,null,null,{"$f":"OrgCode","v":"Org "}]
[]
[null,null,3,"Name of grant program/\nFund Code:"]
[]
[]
[null,null,"Name of Participating Agency",null,null,null,null,"Amount of \nAssigned Funds",null,null,"* Authorized Signature"]
[]
[]
[]
[]
[]
[]
[]
[]
[]
[]
[]
[]
[]
[]
[]
[]
[]
[]
[null,null,null,null,null,null,null,{"$f":"SUM(H148:J164)","v":0}]
[null,null,"Total of Assigned Funds"]
[]
[null,null,"*I/We assign the identified funds to the project described in the accompanying grant application.  The indicated agency is authorized to receive and disburse funds for the purpose of operating the project."]

{"sheet":"Dropdowns","index":19,"n_rows":125,"n_cols":12,"rows_kept":125,"cut":false,"hidden":true,"merged":[]}
["Budget Worksheet Dropdowns","Evidence/Data Sources","YesNo","Means of Identifying Els","Title IVA Categories","Title I School Types","Title I Low Income Methods","Private School Services Low Income Methods","Title IIA Prof. Growth ","Budget Pages:  Flexing","Private School Services:  Primary Functions","Private School DataList"]
["Primary Functions:  Title I","Select One","Select One","Select One","Access to Well-Rounded Education","SW","Select One","Select One","Select One","Flexed Funds II,Part A","Title I","Select One"]
["Select One","ACCESS data","Yes","Using initial assessment materials purchased by TIII identified by private school personnel","Safe and Healthy Schools","TA","March Eco Dis","Eco Dis","Recruiting diverse educators","Select, if applicable","Select One","Attendance data (educators)"]
["Instruction-School day (public, K-12) ","Attendance data (educators)","No","Using initial assessment materials purchased by TIII identified by LEA trained personnel","Effective Use of Technology","NT","March Eco Dis x 1.6","Free and Reduced Price Lunch/Meals Status","Building a principal pipeline","Title I, Part A","Instruction-School day (public, K-12) ","Attendance data (students)"]
["Instruction - Extended day/year (public, K-12) ","Attendance data (students)",null,"Identified by LEA by consultation agreement",null,"CL","Other ","Other","Strategically placing and/or screening  student teachers","Title III, Part A","Instruction - Extended day/year (public, K-12) ","College application, enrollment, and  completion data"]
["High quality PD","CHART reports ","YesNoNA","Previously identified for services",null,null,1,null,"Training supervising practitioners","Title IV, Part A","High quality PD","Discipline data"]
["Data collection/management","College application, enrollment, and  completion data","Select One","Previously identified student not yet proficient in English ",null,null,null,null,"Other",null,"Instructional technology","School-based assessments"]
["Homeless services","DART reports","Yes","Other",null,null,"Methods of qualifying T1 Schools",null,"None of the above","Flexed Funds IV,Part A","Parent, family and community engagement","School-sponsored research"]
["Instructional technology","Discipline data","No",null,null,null,"Select One",null,null,"Select, if applicable","Social and emotional learning","Educator evaluation data"]
["Neglected or delinquent services","District assessments","N/A",null,null,null,"District-wide low income percentage",null,"Select One","Title I, Part A","Other","Learning walks/teacher observations"]
["Parent, family and community engagement","District-sponsored research",null,null,null,null,"Grade span grouping and district-wide percentage",null,"Training mentors","Title II, Part A",null,"Peer-reviewed research"]
["Planning and evaluation","Educator evaluation data",null,null,null,null,"35% rule",null,"New administrator support","Title III, Part A","Title IIA","Student report cards"]
["Pre-school activities","Early Warning Indicator System (EWIS) data",null,null,null,null,"Grade span grouping and 35% rule",null,"Supports for educators in Years 2 and 3",null,"Select One","Surveys (student)"]
["Program administration","Learning walks/teacher observations",null,null,null,null,"Grade span grouping and group-wide percentage",null,"Cycles of observation and feedback",null,"Educator effectiveness PD","Survey (educator)"]
["Social and emotional learning","MCAS data",null,null,null,null,"One school per grade span (eg. K-5, 6-8, 9-12)",null,"Cohort-based programming",null,"Social and emotional learning PD","Surveys (other)"]
["Student transportation","Peer-reviewed research",null,null,null,null,"Total Enrollment of less than 1000 students",null,"Retaining educators of color",null,"School climate PD","Workforce outcomes data"]
["Other","RADAR reports ",null,null,null,null,1,null,"Other",null,"Inclusive practice PD","Other"]
[null,"Student report cards",null,null,null,null,null,null,"None of the above",null,"Other PD","None"]
["Primary Functions:  Title IIA","School accountability data"]
["Select One","Student Learning Experience reports",null,null,null,null,null,null,"Select One",null,"Title III Dropdown Private Schools"]
["Induction and mentoring ","Survey  - School Climate (student)",null,null,null,null,null,null,"Implementing the new student learning indicator",null,"Select One"]
["Instructional coaches","Survey - School Climate (educator)",null,null,null,null,null,null,"Incorporating staff/student feedback",null,"Instruction Extended day/year"]
["Curriculum Frameworks implementation ","Surveys - Other",null,null,null,null,null,null,"Calibrating the judgments and ratings of evaluators",null,"Supplemental literacy materials"]
["Educator effectiveness PD","Workforce outcomes data",null,null,null,null,null,null,"Other",null,"Assessment/screening materials"]
["Social and emotional learning PD","Other",null,null,null,null,null,null,"None of the above",null,"Professional development"]
["School climate PD","None",null,null,null,null,null,null,null,null,"Parent/Family Engagement for currently served TIII ELs"]
["Inclusive practice PD",null,null,null,null,null,null,null,"Select One",null,"Software for supplemental services during TIII extended day program"]
["Class size reduction",null,null,null,null,null,null,null,"Coaching supports to educators"]
["Program administration","Evidence/Data Sources TIVA",null,null,null,null,null,null,"Teacher Led PD",null,"Title VIA Dropdown Private Schools"]
["Other","Select One",null,null,null,null,null,null,"Curriculum-specific PD",null,"Select One"]
[null,"ACCESS data",null,null,null,null,null,null,"PD on data/ assessment",null,"Academic supports and personalized learning"]
["Primary Functions: Title III","Attendance data (educators)",null,null,null,null,null,null,"Other",null,"Arts education activities"]
["Select One","Attendance data (students)",null,null,null,null,null,null,"None of the above",null,"College and career readiness activities"]
["Instruction Extended day/year","CHART reports ",null,null,null,null,null,null,null,null,"Curriculum revision, training and implementation"]
["Supplemental literacy materials","College application, enrollment, and  completion data",null,null,null,null,null,null,"Select One",null,"Inclusion-related activities"]
["Assessment/screening materials","DART reports ",null,null,null,null,null,null,"Providing differentiated roles and opportunities",null,"School safety and student wellness activities"]
["Professional development","Discipline data",null,null,null,null,null,null,"Facilitating recognition programs and/or events",null,"Service learning, civics and community engagement activities"]
["Parent/Family Engagement for currently served TIII ELs","District assessments",null,null,null,null,null,null,"Other",null,"Social emotional learning activities"]
["Software for supplemental services during TIII extended day program","District-sponsored research",null,null,null,null,null,null,"None of the above",null,"Strengthening school climate and culture"]
["Other","Educator evaluation data",null,null,null,null,null,null,null,null,"Technology integration activities"]
[null,"Learning walks/teacher observations",null,null,null,null,null,null,null,null,"Other"]
["Primary Functions:  Title IV","MCAS data"]
["Select One","Peer-reviewed research"]
["Academic supports and personalized learning","RADAR reports "]
["Arts education activities","Referrals"]
["College and career readiness activities","Student Learning Experience reports"]
["Curriculum revision, training and implementation","Student report cards"]
["Inclusion-related activities","Survey  - School Climate (student)"]
["School safety and student wellness activities","Survey - School Climate (educator)"]
["Service learning, civics and community engagement activities","Survey -- Youth Risk"]
["Social emotional learning activities","Surveys -- Other"]
["Strengthening school climate and culture","Workforce outcomes data"]
["Technology integration activities","Other"]
["Other","None"]
[]
["Budget Categories"]
["Administrator Salaries"]
["Select One"]
["Grant Program Manager/Coordinator "]
["Other "]
["InstructionalProf Staff Salaries"]
["Select One"]
["Classroom Teachers  "]
["Instructional Coaches "]
["Certified Specialist Teachers (providing individualized instruction)  "]
["Instructional Coordinators and Team Leaders  "]
["Medical / Therapeutic Services "]
["Librarians and Media Center Directors "]
["Professional Development Directors/Coordinators  "]
["Guidance or School Adjustment Counselors, Social Workers  "]
["Psychological Service Providers "]
["School Physicians and School Nurses  "]
["Other  "]
["Support Staff Salaries"]
["Select One"]
["Non-Clerical Paraprofessionals/Instructional Assistants "]
["Secretary/Bookkeeper/Clerical Support  "]
["Parent Liaisons"]
[" Other "]
["Stipends"]
["Select One"]
["Teacher/ Instructional Staff Professional Days"]
["Administrators "]
["Other "]
["Support Staff"]
["Travel"]
["Select One"]
["Grant Program Manager/Coordinator (supervisory)"]
["Certified Classroom Teachers (providing group instruction) "]
["Certified Specialist Teachers (providing individualized instruction)"]
["Non-Clerical Paraprofessionals/Instructional Assistants"]
["Other "]
["Contractual Services"]
["Select One"]
["Instructional Services "]
["Consultants/Professional  Development for Teachers & Support Staff "]
["Substitutes (long and/or short term)"]
["Non-Clerical Paraprofessionals/Instructional Assistants"]
["Secretary/Bookkeeper/Clerical Support "]
["Contracted Service Providers -- Private School Services "]
["Contracted Services Providers -- Other Student Services "]
["Other "]
["Supplies and Materials"]
["Select One"]
["Textbooks and Related Software/Media/Materials "]
["Instructional Technology"]
["Other Instructional Materials (non-testing/assessment)"]
["Testing and Assessment Materials"]
["General Classroom Supplies "]
["Office Supplies  "]
["Other "]
["Other costs"]
["Select One"]
["Memberships/Subscriptions"]
["Advertising  "]
["Student Transportation Services "]
[" Rental/Lease of Equipment"]
["Maintenance of Equipment"]
["Maintenance of Technology "]
["Tuition to Non-Public Schools "]
["Tuition to Out-of-State Schools "]
["Tuition to Collaboratives"]
["Rental Lease of Buildings  "]
["Utility Services/ Telephone "]
["Other  "]

{"sheet":"DataLookupValues","index":20,"n_rows":24,"n_cols":6,"rows_kept":24,"cut":false,"hidden":true,"merged":[]}
["Workbook Information"]
["Fiscal Year","FY18","Fundcode:",305]
["Title full name","I, Part A"]
["Title abbreviated","I"]
["District Information"]
["District value",1,null,null,"Liasons"]
["District Name:",{"$f":"VLOOKUP(valDistr,dataDistr,3,FALSE)","v":"Org Name"},"district code",{"$f":"LEFT(VLOOKUP(valDistr,dataDistr,2,FALSE),4)","v":"Org "},"Name",{"$f":"VLOOKUP(valDistr,dataDistr,12,FALSE)","v":"Liaison's Name"}]
["Address1",{"$f":"VLOOKUP(valDistr,dataDistr,7,FALSE)","v":"Address 1"},null,null,"Phone",{"$f":"VLOOKUP(valDistr,dataDistr,13,FALSE)","v":"Liaison's Number"}]
["Address2",{"$f":"IF(VLOOKUP(valDistr,dataDistr,8,FALSE)=0,\"\",VLOOKUP(valDistr,dataDistr,8,FALSE))","v":"Address 2"},null,null,"Email",{"$f":"VLOOKUP(valDistr,dataDistr,14,FALSE)","v":"Liaison's Email"}]
["City, State, ZIP",{"$f":"VLOOKUP(valDistr,dataDistr,9,FALSE)&\", \"&VLOOKUP(valDistr,dataDistr,10,FALSE)&\" \"&VLOOKUP(valDistr,dataDistr,11,FALSE)","v":"Town, State Zip"}]
["District Enrollment",{"$f":"VLOOKUP(valDistr,dataDistr,16,FALSE)","v":"March Enrolled Count"},"EL Enrollment",{"$f":"VLOOKUP(valDistr,dataDistr,15,FALSE)","v":"March EL Count (18c)"}]
["Low Inc Methods TI"]
["SELECT ONE",null,"TitleI Status"]
["Oct Eco Dis",null,1]
["Oct Eco Dis x 1.6",null,2,"SW"]
["March Eco Dis",null,3,"TA"]
["March Eco Dis x 1.6",null,4,"NT"]
["Other ",null,5,"CL"]
[]
["District lookup values"]
[]
[]
[null,null,null,null,null,1]
[null,null,null,null,null,1]

{"sheet":"dataDistrictList","index":21,"n_rows":411,"n_cols":16,"rows_kept":411,"cut":false,"hidden":true,"merged":[]}
[1,"Org Code","Org Name","Org Type","Function","Contact Name","Address 1","Address 2","Town","State","Zip","Liaison's Name","Liaison's Number","Liaison's Email","March EL Count (18c)","March Enrolled Count"]
[2,"04450000","Abby Kelley Foster Charter Public (District)","Charter District","Charter School Leader","Brian Haas","10 New Bond Street",null,"Worcester","MA","01606","Aneesh Sahni",{"$f":"VLOOKUP(L2, LiaisonList!$A$1:$C$8, 2, FALSE)","v":"781-338-3532"},{"$f":"VLOOKUP(L2, LiaisonList!$A$1:$C$8, 3, FALSE)","v":"aneesh.sahni@doe.mass.edu"},126,1425]
[3,"00010000","Abington","Public School District","Superintendent","Peter Schafer","1071 Washington St.",null,"Abington","MA","02351","Alex Lilley",{"$f":"VLOOKUP(L3, LiaisonList!$A$1:$C$8, 2, FALSE)","v":"781-338-6212"},{"$f":"VLOOKUP(L3, LiaisonList!$A$1:$C$8, 3, FALSE)","v":"alilley@doe.mass.edu"},103,1946]
[4,"04120000","Academy Of the Pacific Rim Charter Public (District)","Charter District","Charter School Leader","Spencer Blasdale","1 Westinghouse Plaza",null,"Hyde Park","MA","02136","Aneesh Sahni",{"$f":"VLOOKUP(L4, LiaisonList!$A$1:$C$8, 2, FALSE)","v":"781-338-3532"},{"$f":"VLOOKUP(L4, LiaisonList!$A$1:$C$8, 3, FALSE)","v":"aneesh.sahni@doe.mass.edu"},66,526]
[5,"06000000","Acton-Boxborough","Public School District","Superintendent","William McAlduff","16 Charter Rd",null,"Acton","MA","01720","Sue Mazzarella",{"$f":"VLOOKUP(L5, LiaisonList!$A$1:$C$8, 2, FALSE)","v":"781-338-3587"},{"$f":"VLOOKUP(L5, LiaisonList!$A$1:$C$8, 3, FALSE)","v":"smazzarella@doe.mass.edu"},281,5505]
[6,"00030000","Acushnet","Public School District","Superintendent","Michael Shea","708 Middle Road","Suite 1","Acushnet","MA","02743","Aneesh Sahni",{"$f":"VLOOKUP(L6, LiaisonList!$A$1:$C$8, 2, FALSE)","v":"781-338-3532"},{"$f":"VLOOKUP(L6, LiaisonList!$A$1:$C$8, 3, FALSE)","v":"aneesh.sahni@doe.mass.edu"},7,918]
[7,"06030000","Adams-Cheshire","Public School District","Superintendent","Robert Putnam","191 Church St",null,"Cheshire","MA","01225","Alex Lilley",{"$f":"VLOOKUP(L7, LiaisonList!$A$1:$C$8, 2, FALSE)","v":"781-338-6212"},{"$f":"VLOOKUP(L7, LiaisonList!$A$1:$C$8, 3, FALSE)","v":"alilley@doe.mass.edu"},6,1138]
[8,"04300000","Advanced Math and Science Academy Charter (District)","Charter District","Charter School Leader","Anders Lewis","201 Forest Street",null,"Marlborough","MA","01752","Sue Mazzarella",{"$f":"VLOOKUP(L8, LiaisonList!$A$1:$C$8, 2, FALSE)","v":"781-338-3587"},{"$f":"VLOOKUP(L8, LiaisonList!$A$1:$C$8, 3, FALSE)","v":"smazzarella@doe.mass.edu"},99,989]
[9,"00050000","Agawam","Public School District","Superintendent","Steven Lemanski","1305 Springfield St","Suite 1","Feeding Hills","MA","01030","Deb Walker",{"$f":"VLOOKUP(L9, LiaisonList!$A$1:$C$8, 2, FALSE)","v":"781-338-3127"},{"$f":"VLOOKUP(L9, LiaisonList!$A$1:$C$8, 3, FALSE)","v":"djwalker@doe.mass.edu"},208,3685]
[10,"04090000","Alma del Mar Charter School (District)","Charter District","Charter School Leader","Will Gardner","26 Madeira Avenue",null,"New Bedford","MA","02746","Sue Mazzarella",{"$f":"VLOOKUP(L10, LiaisonList!$A$1:$C$8, 2, FALSE)","v":"781-338-3587"},{"$f":"VLOOKUP(L10, LiaisonList!$A$1:$C$8, 3, FALSE)","v":"smazzarella@doe.mass.edu"},91,407]
[11,"00070000","Amesbury","Public School District","Superintendent","Gary Reese","5 Highland Street",null,"Amesbury","MA","01913","Russ Fleming",{"$f":"VLOOKUP(L11, LiaisonList!$A$1:$C$8, 2, FALSE)","v":"781-338-6529"},{"$f":"VLOOKUP(L11, LiaisonList!$A$1:$C$8, 3, FALSE)","v":"RFleming@doe.mass.edu"},28,2085]
[12,"00080000","Amherst","Public School District","Superintendent","Michael Morris","170 Chestnut Street",null,"Amherst","MA","01002","Ellie Rounds-Bloom",{"$f":"VLOOKUP(L12, LiaisonList!$A$1:$C$8, 2, FALSE)","v":"781-338-3128"},{"$f":"VLOOKUP(L12, LiaisonList!$A$1:$C$8, 3, FALSE)","v":"erounds-bloom@doe.mass.edu"},194,1083]
[13,"06050000","Amherst-Pelham","Public School District","Superintendent","Michael Morris","170 Chestnut Street",null,"Amherst","MA","01002","Ellie Rounds-Bloom",{"$f":"VLOOKUP(L13, LiaisonList!$A$1:$C$8, 2, FALSE)","v":"781-338-3128"},{"$f":"VLOOKUP(L13, LiaisonList!$A$1:$C$8, 3, FALSE)","v":"erounds-bloom@doe.mass.edu"},86,1334]
[14,"00090000","Andover","Public School District","Superintendent","Sheldon Berman","36 Bartlet Street",null,"Andover","MA","01810","Beth O'Connell",{"$f":"VLOOKUP(L14, LiaisonList!$A$1:$C$8, 2, FALSE)","v":"781-338-3132"},{"$f":"VLOOKUP(L14, LiaisonList!$A$1:$C$8, 3, FALSE)","v":"EO'Connell@doe.mass.edu"},251,5858]
[15,"35090000","Argosy Collegiate Charter School (District)","Charter District","Charter School Leader","Kristen Pavao","263 Hamlet Street",null,"Fall River","MA","02724","Julia Foodman",{"$f":"VLOOKUP(L15, LiaisonList!$A$1:$C$8, 2, FALSE)","v":"781-338-3577"},{"$f":"VLOOKUP(L15, LiaisonList!$A$1:$C$8, 3, FALSE)","v":"jfoodman@doe.mass.edu"},87,400]
[16,"00100000","Arlington","Public School District","Superintendent","Kathleen Bodie","869 Massachusetts Avenue",null,"Arlington","MA","02476","Julia Foodman",{"$f":"VLOOKUP(L16, LiaisonList!$A$1:$C$8, 2, FALSE)","v":"781-338-3577"},{"$f":"VLOOKUP(L16, LiaisonList!$A$1:$C$8, 3, FALSE)","v":"jfoodman@doe.mass.edu"},270,5611]
[17,"06100000","Ashburnham-Westminster","Public School District","Superintendent","Gary Mazzola","11 Oakmont Drive",null,"Ashburnham","MA","01430","Aneesh Sahni",{"$f":"VLOOKUP(L17, LiaisonList!$A$1:$C$8, 2, FALSE)","v":"781-338-3532"},{"$f":"VLOOKUP(L17, LiaisonList!$A$1:$C$8, 3, FALSE)","v":"aneesh.sahni@doe.mass.edu"},47,2312]
[18,"00140000","Ashland","Public School District","Superintendent","James Adams","87 West Union Street",null,"Ashland","MA","01721","Alex Lilley",{"$f":"VLOOKUP(L18, LiaisonList!$A$1:$C$8, 2, FALSE)","v":"781-338-6212"},{"$f":"VLOOKUP(L18, LiaisonList!$A$1:$C$8, 3, FALSE)","v":"alilley@doe.mass.edu"},137,2638]
[19,"08010000","Assabet Valley Regional Vocational Technical","Public School District","Superintendent","Ernest Houle","215 Fitchburg Street",null,"Marlborough","MA","01752","Ellie Rounds-Bloom",{"$f":"VLOOKUP(L19, LiaisonList!$A$1:$C$8, 2, FALSE)","v":"781-338-3128"},{"$f":"VLOOKUP(L19, LiaisonList!$A$1:$C$8, 3, FALSE)","v":"erounds-bloom@doe.mass.edu"},28,1103]
[20,"06150000","Athol-Royalston","Public School District","Superintendent","Darcy Fernandes","1062 Pleasant Street",null,"Athol","MA","01331","Deb Walker",{"$f":"VLOOKUP(L20, LiaisonList!$A$1:$C$8, 2, FALSE)","v":"781-338-3127"},{"$f":"VLOOKUP(L20, LiaisonList!$A$1:$C$8, 3, FALSE)","v":"djwalker@doe.mass.edu"},34,1405]
[21,"04910000","Atlantis Charter (District)","Charter District","Charter School Leader","Robert Beatty","991 Jefferson St",null,"Fall River","MA","02721","Ellie Rounds-Bloom",{"$f":"VLOOKUP(L21, LiaisonList!$A$1:$C$8, 2, FALSE)","v":"781-338-3128"},{"$f":"VLOOKUP(L21, LiaisonList!$A$1:$C$8, 3, FALSE)","v":"erounds-bloom@doe.mass.edu"},121,1212]
[22,"00160000","Attleboro","Public School District","Superintendent","David Sawyer","100 Rathbun Willard Drive",null,"Attleboro","MA","02703","Ellie Rounds-Bloom",{"$f":"VLOOKUP(L22, LiaisonList!$A$1:$C$8, 2, FALSE)","v":"781-338-3128"},{"$f":"VLOOKUP(L22, LiaisonList!$A$1:$C$8, 3, FALSE)","v":"erounds-bloom@doe.mass.edu"},381,5791]
[23,"00170000","Auburn","Public School District","Superintendent","Maryellen Brunelle","5 West Street",null,"Auburn","MA","01501","Aneesh Sahni",{"$f":"VLOOKUP(L23, LiaisonList!$A$1:$C$8, 2, FALSE)","v":"781-338-3532"},{"$f":"VLOOKUP(L23, LiaisonList!$A$1:$C$8, 3, FALSE)","v":"aneesh.sahni@doe.mass.edu"},93,2496]
[24,"00180000","Avon","Public School District","Superintendent","Paul Zinni","1 Patrick Clark Drive",null,"Avon","MA","02322","Deb Walker",{"$f":"VLOOKUP(L24, LiaisonList!$A$1:$C$8, 2, FALSE)","v":"781-338-3127"},{"$f":"VLOOKUP(L24, LiaisonList!$A$1:$C$8, 3, FALSE)","v":"djwalker@doe.mass.edu"},30,714]
[25,"06160000","Ayer Shirley School District","Public School District","Superintendent","Mary Malone","115 Washington Street",null,"Ayer","MA","01432","Russ Fleming",{"$f":"VLOOKUP(L25, LiaisonList!$A$1:$C$8, 2, FALSE)","v":"781-338-6529"},{"$f":"VLOOKUP(L25, LiaisonList!$A$1:$C$8, 3, FALSE)","v":"RFleming@doe.mass.edu"},68,1636]
[26,"00200000","Barnstable","Public School District","Superintendent","Meg Mayo-Brown","P O Box 955",null,"Hyannis","MA","02601","Beth O'Connell",{"$f":"VLOOKUP(L26, LiaisonList!$A$1:$C$8, 2, FALSE)","v":"781-338-3132"},{"$f":"VLOOKUP(L26, LiaisonList!$A$1:$C$8, 3, FALSE)","v":"EO'Connell@doe.mass.edu"},471,4728]
[27,"04270000","Barnstable Community Horace Mann Charter Public (District)","Charter District","Charter School Leader","Sheila Kukstis","165 Bearses Way",null,"Hyannis","MA","02601","Russ Fleming",{"$f":"VLOOKUP(L27, LiaisonList!$A$1:$C$8, 2, FALSE)","v":"781-338-6529"},{"$f":"VLOOKUP(L27, LiaisonList!$A$1:$C$8, 3, FALSE)","v":"RFleming@doe.mass.edu"},62,303]
[28,"35020000","Baystate Academy Charter Public School (District)","Charter District","Charter School Leader","Timothy Sneed","2001 Roosevelt Avenue",null,"Springfield","MA","01104","Beth O'Connell",{"$f":"VLOOKUP(L28, LiaisonList!$A$1:$C$8, 2, FALSE)","v":"781-338-3132"},{"$f":"VLOOKUP(L28, LiaisonList!$A$1:$C$8, 3, FALSE)","v":"EO'Connell@doe.mass.edu"},59,441]
[29,"00230000","Bedford","Public School District","Superintendent","Jonathan Sills","97 McMahon Road",null,"Bedford","MA","01730","Julia Foodman",{"$f":"VLOOKUP(L29, LiaisonList!$A$1:$C$8, 2, FALSE)","v":"781-338-3577"},{"$f":"VLOOKUP(L29, LiaisonList!$A$1:$C$8, 3, FALSE)","v":"jfoodman@doe.mass.edu"},165,2606]
[30,"00240000","Belchertown","Public School District","Superintendent","Karol Coffin","PO Box 841",null,"Belchertown","MA","01007","Beth O'Connell",{"$f":"VLOOKUP(L30, LiaisonList!$A$1:$C$8, 2, FALSE)","v":"781-338-3132"},{"$f":"VLOOKUP(L30, LiaisonList!$A$1:$C$8, 3, FALSE)","v":"EO'Connell@doe.mass.edu"},21,2285]
[31,"00250000","Bellingham","Public School District","Superintendent","Peter Marano","4 Mechanic Street",null,"Bellingham","MA","02019","Sue Mazzarella",{"$f":"VLOOKUP(L31, LiaisonList!$A$1:$C$8, 2, FALSE)","v":"781-338-3587"},{"$f":"VLOOKUP(L31, LiaisonList!$A$1:$C$8, 3, FALSE)","v":"smazzarella@doe.mass.edu"},40,2178]
[32,"00260000","Belmont","Public School District","Superintendent","John Phelan","644 Pleasant Street",null,"Belmont","MA","02478","Aneesh Sahni",{"$f":"VLOOKUP(L32, LiaisonList!$A$1:$C$8, 2, FALSE)","v":"781-338-3532"},{"$f":"VLOOKUP(L32, LiaisonList!$A$1:$C$8, 3, FALSE)","v":"aneesh.sahni@doe.mass.edu"},350,4557]
[33,"04200000","Benjamin Banneker Charter Public (District)","Charter District","Charter School Leader","Sherley Bretous-Carre","21 Notre Dame Avenue",null,"Cambridge","MA","02140","Ellie Rounds-Bloom",{"$f":"VLOOKUP(L33, LiaisonList!$A$1:$C$8, 2, FALSE)","v":"781-338-3128"},{"$f":"VLOOKUP(L33, LiaisonList!$A$1:$C$8, 3, FALSE)","v":"erounds-bloom@doe.mass.edu"},18,326]
[34,"04470000","Benjamin Franklin Classical Charter Public (District)","Charter District","Charter School Leader","Heather Zolnowski","201 Main Street",null,"Franklin","MA","02038","Russ Fleming",{"$f":"VLOOKUP(L34, LiaisonList!$A$1:$C$8, 2, FALSE)","v":"781-338-6529"},{"$f":"VLOOKUP(L34, LiaisonList!$A$1:$C$8, 3, FALSE)","v":"RFleming@doe.mass.edu"},25,446]
[35,"35110000","Bentley Academy Charter School (District)","Charter District","Charter School Leader","Marlena Afonso","25 Memorial Drive",null,"Salem","MA","01970","Sue Mazzarella",{"$f":"VLOOKUP(L35, LiaisonList!$A$1:$C$8, 2, FALSE)","v":"781-338-3587"},{"$f":"VLOOKUP(L35, LiaisonList!$A$1:$C$8, 3, FALSE)","v":"smazzarella@doe.mass.edu"},60,283]
[36,"00270000","Berkley","Public School District","Superintendent","Thomas Lynch","21 North Main Street",null,"Berkley","MA","02779","Russ Fleming",{"$f":"VLOOKUP(L36, LiaisonList!$A$1:$C$8, 2, FALSE)","v":"781-338-6529"},{"$f":"VLOOKUP(L36, LiaisonList!$A$1:$C$8, 3, FALSE)","v":"RFleming@doe.mass.edu"},5,852]
[37,"04140000","Berkshire Arts and Technology Charter Public (District)","Charter District","Charter School Leader","James White","1 Commercial Pl","PO Box 267","Adams","MA","01220","Russ Fleming",{"$f":"VLOOKUP(L37, LiaisonList!$A$1:$C$8, 2, FALSE)","v":"781-338-6529"},{"$f":"VLOOKUP(L37, LiaisonList!$A$1:$C$8, 3, FALSE)","v":"RFleming@doe.mass.edu"},3,349]
[38,"06180000","Berkshire Hills","Public School District","Superintendent","Peter Dillon","50 Main Street","PO Box 617","Stockbridge","MA","01262","Julia Foodman",{"$f":"VLOOKUP(L38, LiaisonList!$A$1:$C$8, 2, FALSE)","v":"781-338-3577"},{"$f":"VLOOKUP(L38, LiaisonList!$A$1:$C$8, 3, FALSE)","v":"jfoodman@doe.mass.edu"},35,1225]
[39,"00280000","Berlin","Public School District","Superintendent","Jeffrey Zanghi","215 Main Street",null,"Boylston","MA","01505","Beth O'Connell",{"$f":"VLOOKUP(L39, LiaisonList!$A$1:$C$8, 2, FALSE)","v":"781-338-3132"},{"$f":"VLOOKUP(L39, LiaisonList!$A$1:$C$8, 3, FALSE)","v":"EO'Connell@doe.mass.edu"},6,169]
[40,"06200000","Berlin-Boylston","Public School District","Superintendent","Jeffrey Zanghi","215 Main Street",null,"Boylston","MA","01505","Beth O'Connell",{"$f":"VLOOKUP(L40, LiaisonList!$A$1:$C$8, 2, FALSE)","v":"781-338-3132"},{"$f":"VLOOKUP(L40, LiaisonList!$A$1:$C$8, 3, FALSE)","v":"EO'Connell@doe.mass.edu"},11,587]
[41,"00300000","Beverly","Public School District","Superintendent","Steven Hiersche","70 Balch St.",null,"Beverly","MA","01915","Deb Walker",{"$f":"VLOOKUP(L41, LiaisonList!$A$1:$C$8, 2, FALSE)","v":"781-338-3127"},{"$f":"VLOOKUP(L41, LiaisonList!$A$1:$C$8, 3, FALSE)","v":"djwalker@doe.mass.edu"},171,4385]
[42,"00310000","Billerica","Public School District","Superintendent","Timothy Piwowar","365 Boston Rd",null,"Billerica","MA","01821","Russ Fleming",{"$f":"VLOOKUP(L42, LiaisonList!$A$1:$C$8, 2, FALSE)","v":"781-338-6529"},{"$f":"VLOOKUP(L42, LiaisonList!$A$1:$C$8, 3, FALSE)","v":"RFleming@doe.mass.edu"},75,4603]
[43,"08050000","Blackstone Valley Regional Vocational Technical","Public School District","Superintendent","Michael Fitzpatrick","65 Pleasant Street",null,"Upton","MA","01568","Aneesh Sahni",{"$f":"VLOOKUP(L43, LiaisonList!$A$1:$C$8, 2, FALSE)","v":"781-338-3532"},{"$f":"VLOOKUP(L43, LiaisonList!$A$1:$C$8, 3, FALSE)","v":"aneesh.sahni@doe.mass.edu"},3,1220]
[44,"06220000","Blackstone-Millville","Public School District","Superintendent","Allen Himmelberger","175 Lincoln Street",null,"Blackstone","MA","01504","Sue Mazzarella",{"$f":"VLOOKUP(L44, LiaisonList!$A$1:$C$8, 2, FALSE)","v":"781-338-3587"},{"$f":"VLOOKUP(L44, LiaisonList!$A$1:$C$8, 3, FALSE)","v":"smazzarella@doe.mass.edu"},54,1636]
[45,"08060000","Blue Hills Regional Vocational Technical","Public School District","Superintendent","James Quaglia","800 Randolph Street",null,"Canton","MA","02021","Deb Walker",{"$f":"VLOOKUP(L45, LiaisonList!$A$1:$C$8, 2, FALSE)","v":"781-338-3127"},{"$f":"VLOOKUP(L45, LiaisonList!$A$1:$C$8, 3, FALSE)","v":"djwalker@doe.mass.edu"},4,842]
[46,"00350000","Boston","Public School District","Superintendent","Tommy Chang","2300 Washington Street",null,"Roxbury","MA","02119","Julia Foodman",{"$f":"VLOOKUP(L46, LiaisonList!$A$1:$C$8, 2, FALSE)","v":"781-338-3577"},{"$f":"VLOOKUP(L46, LiaisonList!$A$1:$C$8, 3, FALSE)","v":"jfoodman@doe.mass.edu"},15445,49775]
[47,"04490000","Boston Collegiate Charter (District)","Charter District","Charter School Leader","Shannah Varon","11 Mayhew Street",null,"Dorchester","MA","02125","Julia Foodman",{"$f":"VLOOKUP(L47, LiaisonList!$A$1:$C$8, 2, FALSE)","v":"781-338-3577"},{"$f":"VLOOKUP(L47, LiaisonList!$A$1:$C$8, 3, FALSE)","v":"jfoodman@doe.mass.edu"},26,700]
[48,"04240000","Boston Day and Evening Academy Charter (District)","Charter District","Charter School Leader","Alison Hramiec","20 Kearsarge Ave",null,"Roxbury","MA","02119","Aneesh Sahni",{"$f":"VLOOKUP(L48, LiaisonList!$A$1:$C$8, 2, FALSE)","v":"781-338-3532"},{"$f":"VLOOKUP(L48, LiaisonList!$A$1:$C$8, 3, FALSE)","v":"aneesh.sahni@doe.mass.edu"},25,389]
[49,"04110000","Boston Green Academy Horace Mann Charter School (District)","Charter District","Charter School Leader","Matthew Holzer","20 Warren St.",null,"Brighton","MA","02135","Ellie Rounds-Bloom",{"$f":"VLOOKUP(L49, LiaisonList!$A$1:$C$8, 2, FALSE)","v":"781-338-3128"},{"$f":"VLOOKUP(L49, LiaisonList!$A$1:$C$8, 3, FALSE)","v":"erounds-bloom@doe.mass.edu"},66,460]
[50,"04160000","Boston Preparatory Charter Public (District)","Charter District","Charter School Leader","Sharon Liszanckie","885 River Street",null,"Hyde Park","MA","02136","Julia Foodman",{"$f":"VLOOKUP(L50, LiaisonList!$A$1:$C$8, 2, FALSE)","v":"781-338-3577"},{"$f":"VLOOKUP(L50, LiaisonList!$A$1:$C$8, 3, FALSE)","v":"jfoodman@doe.mass.edu"},71,457]
[51,"04810000","Boston Renaissance Charter Public (District)","Charter District","Charter School Leader","Alexandra Banhares-Buckmire","1415 Hyde Park Ave",null,"Hyde Park","MA","02136","Alex Lilley",{"$f":"VLOOKUP(L51, LiaisonList!$A$1:$C$8, 2, FALSE)","v":"781-338-6212"},{"$f":"VLOOKUP(L51, LiaisonList!$A$1:$C$8, 3, FALSE)","v":"alilley@doe.mass.edu"},87,822]
[52,"00360000","Bourne","Public School District","Superintendent","Steven Lamarche","36 Sandwich Rd",null,"Bourne","MA","02532","Beth O'Connell",{"$f":"VLOOKUP(L52, LiaisonList!$A$1:$C$8, 2, FALSE)","v":"781-338-3132"},{"$f":"VLOOKUP(L52, LiaisonList!$A$1:$C$8, 3, FALSE)","v":"EO'Connell@doe.mass.edu"},16,1873]
[53,"00380000","Boxford","Public School District","Superintendent","Scott Morrison","28 Middleton Road",null,"Boxford","MA","01921","Russ Fleming",{"$f":"VLOOKUP(L53, LiaisonList!$A$1:$C$8, 2, FALSE)","v":"781-338-6529"},{"$f":"VLOOKUP(L53, LiaisonList!$A$1:$C$8, 3, FALSE)","v":"RFleming@doe.mass.edu"},3,681]
[54,"00390000","Boylston","Public School District","Superintendent","Jeffrey Zanghi","215 Main Street",null,"Boylston","MA","01505","Beth O'Connell",{"$f":"VLOOKUP(L54, LiaisonList!$A$1:$C$8, 2, FALSE)","v":"781-338-3132"},{"$f":"VLOOKUP(L54, LiaisonList!$A$1:$C$8, 3, FALSE)","v":"EO'Connell@doe.mass.edu"},5,266]
[55,"00400000","Braintree","Public School District","Superintendent","Frank Hackett","348 Pond Street",null,"Braintree","MA","02184","Ellie Rounds-Bloom",{"$f":"VLOOKUP(L55, LiaisonList!$A$1:$C$8, 2, FALSE)","v":"781-338-3128"},{"$f":"VLOOKUP(L55, LiaisonList!$A$1:$C$8, 3, FALSE)","v":"erounds-bloom@doe.mass.edu"},325,5734]
[56,"00410000","Brewster","Public School District","Superintendent","Thomas Conrad","78 Eldredge Pkwy",null,"Orleans","MA","02653","Julia Foodman",{"$f":"VLOOKUP(L56, LiaisonList!$A$1:$C$8, 2, FALSE)","v":"781-338-3577"},{"$f":"VLOOKUP(L56, LiaisonList!$A$1:$C$8, 3, FALSE)","v":"jfoodman@doe.mass.edu"},13,444]
[57,"04170000","Bridge Boston Charter School (District)","Charter District","Charter School Leader","Yully Cha","435 Warren St.",null,"Roxbury","MA","02119","Beth O'Connell",{"$f":"VLOOKUP(L57, LiaisonList!$A$1:$C$8, 2, FALSE)","v":"781-338-3132"},{"$f":"VLOOKUP(L57, LiaisonList!$A$1:$C$8, 3, FALSE)","v":"EO'Connell@doe.mass.edu"},73,276]
[58,"06250000","Bridgewater-Raynham","Public School District","Superintendent","Derek Swenson","166 Mt. Prospect Street",null,"Bridgewater","MA","02324","Alex Lilley",{"$f":"VLOOKUP(L58, LiaisonList!$A$1:$C$8, 2, FALSE)","v":"781-338-6212"},{"$f":"VLOOKUP(L58, LiaisonList!$A$1:$C$8, 3, FALSE)","v":"alilley@doe.mass.edu"},89,5203]
[59,"00430000","Brimfield","Public School District","Superintendent","Erin Nosek","320A Brookfield Rd",null,"Fiskdale","MA","01518","Russ Fleming",{"$f":"VLOOKUP(L59, LiaisonList!$A$1:$C$8, 2, FALSE)","v":"781-338-6529"},{"$f":"VLOOKUP(L59, LiaisonList!$A$1:$C$8, 3, FALSE)","v":"RFleming@doe.mass.edu"},0,267]
[60,"09100000","Bristol County Agricultural","Public School District","Superintendent","Adele Sands","135 Center Street",null,"Dighton","MA","02715","Deb Walker",{"$f":"VLOOKUP(L60, LiaisonList!$A$1:$C$8, 2, FALSE)","v":"781-338-3127"},{"$f":"VLOOKUP(L60, LiaisonList!$A$1:$C$8, 3, FALSE)","v":"djwalker@doe.mass.edu"},0,457]
[61,"08100000","Bristol-Plymouth Regional Vocational Technical","Public School District","Superintendent","Alexandre Magalhaes","207 Hart Street",null,"Taunton","MA","02780","Russ Fleming",{"$f":"VLOOKUP(L61, LiaisonList!$A$1:$C$8, 2, FALSE)","v":"781-338-6529"},{"$f":"VLOOKUP(L61, LiaisonList!$A$1:$C$8, 3, FALSE)","v":"RFleming@doe.mass.edu"},3,1247]
[62,"00440000","Brockton","Public School District","Superintendent","Kathleen Smith","43 Crescent Street",null,"Brockton","MA","02301","Sue Mazzarella",{"$f":"VLOOKUP(L62, LiaisonList!$A$1:$C$8, 2, FALSE)","v":"781-338-3587"},{"$f":"VLOOKUP(L62, LiaisonList!$A$1:$C$8, 3, FALSE)","v":"smazzarella@doe.mass.edu"},4161,16527]
[63,"04280000","Brooke Charter School (District)","Charter District","Charter School Leader","Kimberly Steadman","190 Cummins Highway",null,"Roslindale","MA","02131","Julia Foodman",{"$f":"VLOOKUP(L63, LiaisonList!$A$1:$C$8, 2, FALSE)","v":"781-338-3577"},{"$f":"VLOOKUP(L63, LiaisonList!$A$1:$C$8, 3, FALSE)","v":"jfoodman@doe.mass.edu"},136,1742]
[64,"00450000","Brookfield","Public School District","Superintendent","Erin Nosek","320 Brookfield Rd",null,"Fiskdale","MA","01518","Russ Fleming",{"$f":"VLOOKUP(L64, LiaisonList!$A$1:$C$8, 2, FALSE)","v":"781-338-6529"},{"$f":"VLOOKUP(L64, LiaisonList!$A$1:$C$8, 3, FALSE)","v":"RFleming@doe.mass.edu"},0,283]
[65,"00460000","Brookline","Public School District","Superintendent","Andrew Bott","333 Washington Street",null,"Brookline","MA","02445","Julia Foodman",{"$f":"VLOOKUP(L65, LiaisonList!$A$1:$C$8, 2, FALSE)","v":"781-338-3577"},{"$f":"VLOOKUP(L65, LiaisonList!$A$1:$C$8, 3, FALSE)","v":"jfoodman@doe.mass.edu"},808,7493]
[66,"00480000","Burlington","Public School District","Superintendent","Eric Conti","123 Cambridge Street",null,"Burlington","MA","01803","Sue Mazzarella",{"$f":"VLOOKUP(L66, LiaisonList!$A$1:$C$8, 2, FALSE)","v":"781-338-3587"},{"$f":"VLOOKUP(L66, LiaisonList!$A$1:$C$8, 3, FALSE)","v":"smazzarella@doe.mass.edu"},166,3422]
[67,"00490000","Cambridge","Public School District","Superintendent","Kenneth Salim","159 Thorndike Street",null,"Cambridge","MA","02141","Alex Lilley",{"$f":"VLOOKUP(L67, LiaisonList!$A$1:$C$8, 2, FALSE)","v":"781-338-6212"},{"$f":"VLOOKUP(L67, LiaisonList!$A$1:$C$8, 3, FALSE)","v":"alilley@doe.mass.edu"},577,6357]
[68,"00500000","Canton","Public School District","Superintendent","Jennifer Fischer-Mueller","960 Washington Street",null,"Canton","MA","02021","Ellie Rounds-Bloom",{"$f":"VLOOKUP(L68, LiaisonList!$A$1:$C$8, 2, FALSE)","v":"781-338-3128"},{"$f":"VLOOKUP(L68, LiaisonList!$A$1:$C$8, 3, FALSE)","v":"erounds-bloom@doe.mass.edu"},78,3223]
[69,"04320000","Cape Cod Lighthouse Charter (District)","Charter District","Charter School Leader","Paul Niles","195 Route 137",null,"East Harwich","MA","02645","Ellie Rounds-Bloom",{"$f":"VLOOKUP(L69, LiaisonList!$A$1:$C$8, 2, FALSE)","v":"781-338-3128"},{"$f":"VLOOKUP(L69, LiaisonList!$A$1:$C$8, 3, FALSE)","v":"erounds-bloom@doe.mass.edu"},3,242]
[70,"08150000","Cape Cod Regional Vocational Technical","Public School District","Superintendent","Robert Sanborn","351 Pleasant Lake Avenue",null,"Harwich","MA","02645","Julia Foodman",{"$f":"VLOOKUP(L70, LiaisonList!$A$1:$C$8, 2, FALSE)","v":"781-338-3577"},{"$f":"VLOOKUP(L70, LiaisonList!$A$1:$C$8, 3, FALSE)","v":"jfoodman@doe.mass.edu"},9,580]
[71,"00510000","Carlisle","Public School District","Superintendent","James O'Shea","83 School Street",null,"Carlisle","MA","01741","Deb Walker",{"$f":"VLOOKUP(L71, LiaisonList!$A$1:$C$8, 2, FALSE)","v":"781-338-3127"},{"$f":"VLOOKUP(L71, LiaisonList!$A$1:$C$8, 3, FALSE)","v":"djwalker@doe.mass.edu"},22,602]
[72,"00520000","Carver","Public School District","Superintendent","Scott Knief","3 Carver Square Blvd.",null,"Carver","MA","02330","Deb Walker",{"$f":"VLOOKUP(L72, LiaisonList!$A$1:$C$8, 2, FALSE)","v":"781-338-3127"},{"$f":"VLOOKUP(L72, LiaisonList!$A$1:$C$8, 3, FALSE)","v":"djwalker@doe.mass.edu"},11,1516]
[73,"06350000","Central Berkshire","Public School District","Superintendent","Laurie Casna","PO Box 299","Rt 8","Dalton","MA","01227","Alex Lilley",{"$f":"VLOOKUP(L73, LiaisonList!$A$1:$C$8, 2, FALSE)","v":"781-338-6212"},{"$f":"VLOOKUP(L73, LiaisonList!$A$1:$C$8, 3, FALSE)","v":"alilley@doe.mass.edu"},8,1546]
[74,"00560000","Chelmsford","Public School District","Superintendent","Roger Lang","230 North Road",null,"Chelmsford","MA","01824","Russ Fleming",{"$f":"VLOOKUP(L74, LiaisonList!$A$1:$C$8, 2, FALSE)","v":"781-338-6529"},{"$f":"VLOOKUP(L74, LiaisonList!$A$1:$C$8, 3, FALSE)","v":"RFleming@doe.mass.edu"},201,4874]
[75,"00570000","Chelsea","Public School District","Superintendent","Mary Bourque","500 Broadway Street","c/o City Hall Room 216","Chelsea","MA","02150","Julia Foodman",{"$f":"VLOOKUP(L75, LiaisonList!$A$1:$C$8, 2, FALSE)","v":"781-338-3577"},{"$f":"VLOOKUP(L75, LiaisonList!$A$1:$C$8, 3, FALSE)","v":"jfoodman@doe.mass.edu"},2169,6004]
[76,"06320000","Chesterfield-Goshen","Public School District","Superintendent","Craig Jurgensen","19 Stage Rd",null,"Westhampton","MA","01027","Deb Walker",{"$f":"VLOOKUP(L76, LiaisonList!$A$1:$C$8, 2, FALSE)","v":"781-338-3127"},{"$f":"VLOOKUP(L76, LiaisonList!$A$1:$C$8, 3, FALSE)","v":"djwalker@doe.mass.edu"},0,123]
[77,"00610000","Chicopee","Public School District","Superintendent","Richard Rege","180 Broadway Street",null,"Chicopee","MA","01020","Beth O'Connell",{"$f":"VLOOKUP(L77, LiaisonList!$A$1:$C$8, 2, FALSE)","v":"781-338-3132"},{"$f":"VLOOKUP(L77, LiaisonList!$A$1:$C$8, 3, FALSE)","v":"EO'Connell@doe.mass.edu"},462,7255]
[78,"04180000","Christa McAuliffe Charter Public (District)","Charter District","Charter School Leader","Kristin Harrison","139 Newbury St",null,"Framingham","MA","01701","Sue Mazzarella",{"$f":"VLOOKUP(L78, LiaisonList!$A$1:$C$8, 2, FALSE)","v":"781-338-3587"},{"$f":"VLOOKUP(L78, LiaisonList!$A$1:$C$8, 3, FALSE)","v":"smazzarella@doe.mass.edu"},16,394]
[79,"04370000","City on a Hill Charter Public School Circuit Street (District)","Charter District","Charter School Leader","Sarah Bachofer","15 Allerton Street","Suite 1","Boston","MA","02119","Julia Foodman",{"$f":"VLOOKUP(L79, LiaisonList!$A$1:$C$8, 2, FALSE)","v":"781-338-3577"},{"$f":"VLOOKUP(L79, LiaisonList!$A$1:$C$8, 3, FALSE)","v":"jfoodman@doe.mass.edu"},39,271]
[80,"35040000","City on a Hill Charter Public School Dudley Square (District)","Charter District","Charter School Leader","Sarah Bachofer","15 Allerton Street","Suite 1","Boston","MA","02119","Julia Foodman",{"$f":"VLOOKUP(L80, LiaisonList!$A$1:$C$8, 2, FALSE)","v":"781-338-3577"},{"$f":"VLOOKUP(L80, LiaisonList!$A$1:$C$8, 3, FALSE)","v":"jfoodman@doe.mass.edu"},50,261]
[81,"35070000","City on a Hill Charter Public School New Bedford (District)","Charter District","Charter School Leader","Sarah Bachofer","15 Allerton Street","Suite 1","Boston","MA","02119","Julia Foodman",{"$f":"VLOOKUP(L81, LiaisonList!$A$1:$C$8, 2, FALSE)","v":"781-338-3577"},{"$f":"VLOOKUP(L81, LiaisonList!$A$1:$C$8, 3, FALSE)","v":"jfoodman@doe.mass.edu"},41,224]
[82,"00630000","Clarksburg","Public School District","Superintendent","Jon Lev","777 West Crossroad",null,"Clarksburg","MA","01247","Sue Mazzarella",{"$f":"VLOOKUP(L82, LiaisonList!$A$1:$C$8, 2, FALSE)","v":"781-338-3587"},{"$f":"VLOOKUP(L82, LiaisonList!$A$1:$C$8, 3, FALSE)","v":"smazzarella@doe.mass.edu"},0,190]
[83,"00640000","Clinton","Public School District","Superintendent","Steven Meyer","150 School Street",null,"Clinton","MA","01510","Alex Lilley",{"$f":"VLOOKUP(L83, LiaisonList!$A$1:$C$8, 2, FALSE)","v":"781-338-6212"},{"$f":"VLOOKUP(L83, LiaisonList!$A$1:$C$8, 3, FALSE)","v":"alilley@doe.mass.edu"},168,1765]
[84,"04380000","Codman Academy Charter Public (District)","Charter District","Charter School Leader","Thabiti Brown","637 Washington Street",null,"Dorchester","MA","02124","Julia Foodman",{"$f":"VLOOKUP(L84, LiaisonList!$A$1:$C$8, 2, FALSE)","v":"781-338-3577"},{"$f":"VLOOKUP(L84, LiaisonList!$A$1:$C$8, 3, FALSE)","v":"jfoodman@doe.mass.edu"},18,321]
[85,"00650000","Cohasset","Public School District","Superintendent","Louise Demas","143 Pond Street",null,"Cohasset","MA","02025","Ellie Rounds-Bloom",{"$f":"VLOOKUP(L85, LiaisonList!$A$1:$C$8, 2, FALSE)","v":"781-338-3128"},{"$f":"VLOOKUP(L85, LiaisonList!$A$1:$C$8, 3, FALSE)","v":"erounds-bloom@doe.mass.edu"},3,1553]
[86,"35030000","Collegiate Charter School of Lowell (District)","Charter District","Charter School Leader","Frederick Randall","1857 Middlesex Street",null,"Lowell","MA","01851","Sue Mazzarella",{"$f":"VLOOKUP(L86, LiaisonList!$A$1:$C$8, 2, FALSE)","v":"781-338-3587"},{"$f":"VLOOKUP(L86, LiaisonList!$A$1:$C$8, 3, FALSE)","v":"smazzarella@doe.mass.edu"},155,754]
[87,"04360000","Community Charter School of Cambridge (District)","Charter District","Charter School Leader","Caleb Hurst-Hiller","245 Bent Street",null,"Cambridge","MA","02141","Deb Walker",{"$f":"VLOOKUP(L87, LiaisonList!$A$1:$C$8, 2, FALSE)","v":"781-338-3127"},{"$f":"VLOOKUP(L87, LiaisonList!$A$1:$C$8, 3, FALSE)","v":"djwalker@doe.mass.edu"},9,356]
[88,"04260000","Community Day Charter Public School - Gateway (District)","Charter District","Charter School Leader","Mary Chance","190 Hampshire Street",null,"Lawrence","MA","01840","Aneesh Sahni",{"$f":"VLOOKUP(L88, LiaisonList!$A$1:$C$8, 2, FALSE)","v":"781-338-3532"},{"$f":"VLOOKUP(L88, LiaisonList!$A$1:$C$8, 3, FALSE)","v":"aneesh.sahni@doe.mass.edu"},78,279]
[89,"04400000","Community Day Charter Public School - Prospect (District)","Charter District","Charter School Leader","Mary Chance","190 Hampshire Street",null,"Lawrence","MA","01840","Aneesh Sahni",{"$f":"VLOOKUP(L89, LiaisonList!$A$1:$C$8, 2, FALSE)","v":"781-338-3532"},{"$f":"VLOOKUP(L89, LiaisonList!$A$1:$C$8, 3, FALSE)","v":"aneesh.sahni@doe.mass.edu"},132,356]
[90,"04310000","Community Day Charter Public School - R. Kingman Webster (District)","Charter District","Charter School Leader","Mary Chance","190 Hampshire Street",null,"Lawrence","MA","01840","Aneesh Sahni",{"$f":"VLOOKUP(L90, LiaisonList!$A$1:$C$8, 2, FALSE)","v":"781-338-3532"},{"$f":"VLOOKUP(L90, LiaisonList!$A$1:$C$8, 3, FALSE)","v":"aneesh.sahni@doe.mass.edu"},77,278]
[91,"00670000","Concord","Public School District","Superintendent","Laurie Hunter","120 Meriam Rd",null,"Concord","MA","01742","Deb Walker",{"$f":"VLOOKUP(L91, LiaisonList!$A$1:$C$8, 2, FALSE)","v":"781-338-3127"},{"$f":"VLOOKUP(L91, LiaisonList!$A$1:$C$8, 3, FALSE)","v":"djwalker@doe.mass.edu"},52,2078]
[92,"06400000","Concord-Carlisle","Public School District","Superintendent","Laurie Hunter","120 Meriam Rd",null,"Concord","MA","01742","Deb Walker",{"$f":"VLOOKUP(L92, LiaisonList!$A$1:$C$8, 2, FALSE)","v":"781-338-3127"},{"$f":"VLOOKUP(L92, LiaisonList!$A$1:$C$8, 3, FALSE)","v":"djwalker@doe.mass.edu"},5,1258]
[93,"04390000","Conservatory Lab Charter (District)","Charter District","Charter School Leader","John Chistolini","2120 Dorchester Avenue",null,"Dorchester","MA","02124","Beth O'Connell",{"$f":"VLOOKUP(L93, LiaisonList!$A$1:$C$8, 2, FALSE)","v":"781-338-3132"},{"$f":"VLOOKUP(L93, LiaisonList!$A$1:$C$8, 3, FALSE)","v":"EO'Connell@doe.mass.edu"},57,398]
[94,"00680000","Conway","Public School District","Superintendent","Lynn Carey","113 North Main Street, Office C101",null,"South Deerfield","MA","01373","Alex Lilley",{"$f":"VLOOKUP(L94, LiaisonList!$A$1:$C$8, 2, FALSE)","v":"781-338-6212"},{"$f":"VLOOKUP(L94, LiaisonList!$A$1:$C$8, 3, FALSE)","v":"alilley@doe.mass.edu"},0,125]
[95,"00710000","Danvers","Public School District","Superintendent","Lisa Dana","64 Cabot Road",null,"Danvers","MA","01923","Sue Mazzarella",{"$f":"VLOOKUP(L95, LiaisonList!$A$1:$C$8, 2, FALSE)","v":"781-338-3587"},{"$f":"VLOOKUP(L95, LiaisonList!$A$1:$C$8, 3, FALSE)","v":"smazzarella@doe.mass.edu"},38,3384]
[96,"00720000","Dartmouth","Public School District","Superintendent","Bonny Gifford","8 Bush Street",null,"Dartmouth","MA","02748","Sue Mazzarella",{"$f":"VLOOKUP(L96, LiaisonList!$A$1:$C$8, 2, FALSE)","v":"781-338-3587"},{"$f":"VLOOKUP(L96, LiaisonList!$A$1:$C$8, 3, FALSE)","v":"smazzarella@doe.mass.edu"},97,3586]
[97,"00730000","Dedham","Public School District","Superintendent","Michael Welch","100 Whiting Avenue",null,"Dedham","MA","02026","Beth O'Connell",{"$f":"VLOOKUP(L97, LiaisonList!$A$1:$C$8, 2, FALSE)","v":"781-338-3132"},{"$f":"VLOOKUP(L97, LiaisonList!$A$1:$C$8, 3, FALSE)","v":"EO'Connell@doe.mass.edu"},217,2621]
[98,"00740000","Deerfield","Public School District","Superintendent","Lynn Carey","113 North Main Street, Office C101",null,"South Deerfield","MA","01373","Alex Lilley",{"$f":"VLOOKUP(L98, LiaisonList!$A$1:$C$8, 2, FALSE)","v":"781-338-6212"},{"$f":"VLOOKUP(L98, LiaisonList!$A$1:$C$8, 3, FALSE)","v":"alilley@doe.mass.edu"},3,366]
[99,"06450000","Dennis-Yarmouth","Public School District","Superintendent","Carol Woodbury","296 Station Avenue",null,"South Yarmouth","MA","02664","Sue Mazzarella",{"$f":"VLOOKUP(L99, LiaisonList!$A$1:$C$8, 2, FALSE)","v":"781-338-3587"},{"$f":"VLOOKUP(L99, LiaisonList!$A$1:$C$8, 3, FALSE)","v":"smazzarella@doe.mass.edu"},272,2971]
[100,"06500000","Dighton-Rehoboth","Public School District","Superintendent","Anthony Azar","2700 Regional Road",null,"North Dighton","MA","02764","Julia Foodman",{"$f":"VLOOKUP(L100, LiaisonList!$A$1:$C$8, 2, FALSE)","v":"781-338-3577"},{"$f":"VLOOKUP(L100, LiaisonList!$A$1:$C$8, 3, FALSE)","v":"jfoodman@doe.mass.edu"},4,2842]
[101,"00770000","Douglas","Public School District","Superintendent","Kevin Maines","21 Davis Street",null,"Douglas","MA","01516","Alex Lilley",{"$f":"VLOOKUP(L101, LiaisonList!$A$1:$C$8, 2, FALSE)","v":"781-338-6212"},{"$f":"VLOOKUP(L101, LiaisonList!$A$1:$C$8, 3, FALSE)","v":"alilley@doe.mass.edu"},8,1259]
[102,"00780000","Dover","Public School District","Superintendent","Andrew Keough","157 Farm Street",null,"Dover","MA","02030","Beth O'Connell",{"$f":"VLOOKUP(L102, LiaisonList!$A$1:$C$8, 2, FALSE)","v":"781-338-3132"},{"$f":"VLOOKUP(L102, LiaisonList!$A$1:$C$8, 3, FALSE)","v":"EO'Connell@doe.mass.edu"},18,470]
[103,"06550000","Dover-Sherborn","Public School District","Superintendent","Andrew Keough","157 Farm Street",null,"Dover","MA","02030","Beth O'Connell",{"$f":"VLOOKUP(L103, LiaisonList!$A$1:$C$8, 2, FALSE)","v":"781-338-3132"},{"$f":"VLOOKUP(L103, LiaisonList!$A$1:$C$8, 3, FALSE)","v":"EO'Connell@doe.mass.edu"},8,1196]
[104,"00790000","Dracut","Public School District","Superintendent","Steven Stone","2063 Lakeview Avenue",null,"Dracut","MA","01826","Aneesh Sahni",{"$f":"VLOOKUP(L104, LiaisonList!$A$1:$C$8, 2, FALSE)","v":"781-338-3532"},{"$f":"VLOOKUP(L104, LiaisonList!$A$1:$C$8, 3, FALSE)","v":"aneesh.sahni@doe.mass.edu"},67,3503]
[105,"04070000","Dudley Street Neighborhood Charter School (District)","Charter District","Charter School Leader","Dawn Lewis","6 Shirley Street",null,"Boston","MA","02119","Beth O'Connell",{"$f":"VLOOKUP(L105, LiaisonList!$A$1:$C$8, 2, FALSE)","v":"781-338-3132"},{"$f":"VLOOKUP(L105, LiaisonList!$A$1:$C$8, 3, FALSE)","v":"EO'Connell@doe.mass.edu"},62,247]
[106,"06580000","Dudley-Charlton Reg","Public School District","Superintendent","Gregg Desto","68 Dudley Oxford Road",null,"Dudley","MA","01571","Sue Mazzarella",{"$f":"VLOOKUP(L106, LiaisonList!$A$1:$C$8, 2, FALSE)","v":"781-338-3587"},{"$f":"VLOOKUP(L106, LiaisonList!$A$1:$C$8, 3, FALSE)","v":"smazzarella@doe.mass.edu"},84,3833]
[107,"00820000","Duxbury","Public School District","Superintendent","John Antonucci","93 Chandler Street",null,"Duxbury","MA","02332","Deb Walker",{"$f":"VLOOKUP(L107, LiaisonList!$A$1:$C$8, 2, FALSE)","v":"781-338-3127"},{"$f":"VLOOKUP(L107, LiaisonList!$A$1:$C$8, 3, FALSE)","v":"djwalker@doe.mass.edu"},14,3033]
[108,"00830000","East Bridgewater","Public School District","Superintendent","Elizabeth Legault","143 Plymouth Street",null,"East Bridgewater","MA","02333","Russ Fleming",{"$f":"VLOOKUP(L108, LiaisonList!$A$1:$C$8, 2, FALSE)","v":"781-338-6529"},{"$f":"VLOOKUP(L108, LiaisonList!$A$1:$C$8, 3, FALSE)","v":"RFleming@doe.mass.edu"},19,2165]
[109,"00870000","East Longmeadow","Public School District","Superintendent","Gordon Smith","180 Maple Street",null,"East Longmeadow","MA","01028","Russ Fleming",{"$f":"VLOOKUP(L109, LiaisonList!$A$1:$C$8, 2, FALSE)","v":"781-338-6529"},{"$f":"VLOOKUP(L109, LiaisonList!$A$1:$C$8, 3, FALSE)","v":"RFleming@doe.mass.edu"},60,2610]
[110,"00850000","Eastham","Public School District","Superintendent","Thomas Conrad","78 Eldredge Pkwy",null,"Orleans","MA","02653","Julia Foodman",{"$f":"VLOOKUP(L110, LiaisonList!$A$1:$C$8, 2, FALSE)","v":"781-338-3577"},{"$f":"VLOOKUP(L110, LiaisonList!$A$1:$C$8, 3, FALSE)","v":"jfoodman@doe.mass.edu"},5,168]
[111,"00860000","Easthampton","Public School District","Superintendent","Nancy Follansbee","50 Payson Avenue","Second Floor","Easthampton","MA","01027","Beth O'Connell",{"$f":"VLOOKUP(L111, LiaisonList!$A$1:$C$8, 2, FALSE)","v":"781-338-3132"},{"$f":"VLOOKUP(L111, LiaisonList!$A$1:$C$8, 3, FALSE)","v":"EO'Connell@doe.mass.edu"},37,1506]
[112,"00880000","Easton","Public School District","Superintendent","Lisha Cabral","PO Box 359",null,"North Easton","MA","02356","Alex Lilley",{"$f":"VLOOKUP(L112, LiaisonList!$A$1:$C$8, 2, FALSE)","v":"781-338-6212"},{"$f":"VLOOKUP(L112, LiaisonList!$A$1:$C$8, 3, FALSE)","v":"alilley@doe.mass.edu"},52,3653]
[113,"00890000","Edgartown","Public School District","Superintendent","Matthew D'Andrea","4 Pine Street",null,"Vineyard Haven","MA","02568","Sue Mazzarella",{"$f":"VLOOKUP(L113, LiaisonList!$A$1:$C$8, 2, FALSE)","v":"781-338-3587"},{"$f":"VLOOKUP(L113, LiaisonList!$A$1:$C$8, 3, FALSE)","v":"smazzarella@doe.mass.edu"},64,338]
[114,"04520000","Edward M. Kennedy Academy for Health Careers (Horace Mann Charter) (District)","Charter District","Charter School Leader","Caren Walker Gregory","360 Huntington Avenue","c/o 102 Cahners Hall","Boston","MA","02115","Sue Mazzarella",{"$f":"VLOOKUP(L114, LiaisonList!$A$1:$C$8, 2, FALSE)","v":"781-338-3587"},{"$f":"VLOOKUP(L114, LiaisonList!$A$1:$C$8, 3, FALSE)","v":"smazzarella@doe.mass.edu"},66,359]
[115,"00910000","Erving","Public School District","Superintendent","Jennifer Haggerty","18 Pleasant Street",null,"Erving","MA","01344","Deb Walker",{"$f":"VLOOKUP(L115, LiaisonList!$A$1:$C$8, 2, FALSE)","v":"781-338-3127"},{"$f":"VLOOKUP(L115, LiaisonList!$A$1:$C$8, 3, FALSE)","v":"djwalker@doe.mass.edu"},2,116]
[116,"08170000","Essex North Shore Agricultural and Technical School District","Public School District","Superintendent","William Lupini","565 Maple Street","P.O. Box 346","Hathorne","MA","01937","Beth O'Connell",{"$f":"VLOOKUP(L116, LiaisonList!$A$1:$C$8, 2, FALSE)","v":"781-338-3132"},{"$f":"VLOOKUP(L116, LiaisonList!$A$1:$C$8, 3, FALSE)","v":"EO'Connell@doe.mass.edu"},4,1367]
[117,"00930000","Everett","Public School District","Superintendent","Frederick Foresteire","121 Vine Street",null,"Everett","MA","02149","Ellie Rounds-Bloom",{"$f":"VLOOKUP(L117, LiaisonList!$A$1:$C$8, 2, FALSE)","v":"781-338-3128"},{"$f":"VLOOKUP(L117, LiaisonList!$A$1:$C$8, 3, FALSE)","v":"erounds-bloom@doe.mass.edu"},1470,6567]
[118,"04100000","Excel Academy Charter (District)","Charter District","Charter School Leader","Owen Stearns","58 Moore Street",null,"East Boston","MA","02128","Alex Lilley",{"$f":"VLOOKUP(L118, LiaisonList!$A$1:$C$8, 2, FALSE)","v":"781-338-6212"},{"$f":"VLOOKUP(L118, LiaisonList!$A$1:$C$8, 3, FALSE)","v":"alilley@doe.mass.edu"},171,1127]
[119,"00940000","Fairhaven","Public School District","Superintendent","Robert Baldwin","128 Washington Street",null,"Fairhaven","MA","02719","Russ Fleming",{"$f":"VLOOKUP(L119, LiaisonList!$A$1:$C$8, 2, FALSE)","v":"781-338-6529"},{"$f":"VLOOKUP(L119, LiaisonList!$A$1:$C$8, 3, FALSE)","v":"RFleming@doe.mass.edu"},38,2007]
[120,"00950000","Fall River","Public School District","Superintendent","Matthew Malone","417 Rock Street",null,"Fall River","MA","02720","Sue Mazzarella",{"$f":"VLOOKUP(L120, LiaisonList!$A$1:$C$8, 2, FALSE)","v":"781-338-3587"},{"$f":"VLOOKUP(L120, LiaisonList!$A$1:$C$8, 3, FALSE)","v":"smazzarella@doe.mass.edu"},1671,9902]
[121,"00960000","Falmouth","Public School District","Superintendent","Nancy Taylor","340 Teaticket Hwy",null,"East Falmouth","MA","02536","Beth O'Connell",{"$f":"VLOOKUP(L121, LiaisonList!$A$1:$C$8, 2, FALSE)","v":"781-338-3132"},{"$f":"VLOOKUP(L121, LiaisonList!$A$1:$C$8, 3, FALSE)","v":"EO'Connell@doe.mass.edu"},108,3264]
[122,"06620000","Farmington River Reg","Public School District","Superintendent","Thomas Nadolny","555 N Main Street","PO Box 679","Otis","MA","01253","Ellie Rounds-Bloom",{"$f":"VLOOKUP(L122, LiaisonList!$A$1:$C$8, 2, FALSE)","v":"781-338-3128"},{"$f":"VLOOKUP(L122, LiaisonList!$A$1:$C$8, 3, FALSE)","v":"erounds-bloom@doe.mass.edu"},0,96]
[123,"00970000","Fitchburg","Public School District","Superintendent","Andre Ravenelle","376 South Street",null,"Fitchburg","MA","01420","Russ Fleming",{"$f":"VLOOKUP(L123, LiaisonList!$A$1:$C$8, 2, FALSE)","v":"781-338-6529"},{"$f":"VLOOKUP(L123, LiaisonList!$A$1:$C$8, 3, FALSE)","v":"RFleming@doe.mass.edu"},756,5165]
[124,"00980000","Florida","Public School District","Superintendent","Heidi Dugal","56 North County Rd",null,"Florida","MA","01247","Sue Mazzarella",{"$f":"VLOOKUP(L124, LiaisonList!$A$1:$C$8, 2, FALSE)","v":"781-338-3587"},{"$f":"VLOOKUP(L124, LiaisonList!$A$1:$C$8, 3, FALSE)","v":"smazzarella@doe.mass.edu"},0,70]
[125,"04130000","Four Rivers Charter Public (District)","Charter District","Charter School Leader","Peter Garbus","248 Colrain Road",null,"Greenfield","MA","01301","Sue Mazzarella",{"$f":"VLOOKUP(L125, LiaisonList!$A$1:$C$8, 2, FALSE)","v":"781-338-3587"},{"$f":"VLOOKUP(L125, LiaisonList!$A$1:$C$8, 3, FALSE)","v":"smazzarella@doe.mass.edu"},0,220]
[126,"00990000","Foxborough","Public School District","Superintendent","Amy Berdos","60 South Street","C/O Igo Administration Building","Foxborough","MA","02035","Ellie Rounds-Bloom",{"$f":"VLOOKUP(L126, LiaisonList!$A$1:$C$8, 2, FALSE)","v":"781-338-3128"},{"$f":"VLOOKUP(L126, LiaisonList!$A$1:$C$8, 3, FALSE)","v":"erounds-bloom@doe.mass.edu"},57,2525]
[127,"04460000","Foxborough Regional Charter (District)","Charter District","Charter School Leader","Mark Logan","131 Central Street","35 Commercial Street","Foxborough","MA","02035","Deb Walker",{"$f":"VLOOKUP(L127, LiaisonList!$A$1:$C$8, 2, FALSE)","v":"781-338-3127"},{"$f":"VLOOKUP(L127, LiaisonList!$A$1:$C$8, 3, FALSE)","v":"djwalker@doe.mass.edu"},199,1464]
[128,"01000000","Framingham","Public School District","Superintendent","Robert Tremblay","73 Mt. Wayte Avenue","Suite 5","Framingham","MA","01702","Aneesh Sahni",{"$f":"VLOOKUP(L128, LiaisonList!$A$1:$C$8, 2, FALSE)","v":"781-338-3532"},{"$f":"VLOOKUP(L128, LiaisonList!$A$1:$C$8, 3, FALSE)","v":"aneesh.sahni@doe.mass.edu"},1960,8471]
[129,"04780000","Francis W. Parker Charter Essential (District)","Charter District","Charter School Leader","Todd Sumner","49 Antietam Street",null,"Devens","MA","01434","Julia Foodman",{"$f":"VLOOKUP(L129, LiaisonList!$A$1:$C$8, 2, FALSE)","v":"781-338-3577"},{"$f":"VLOOKUP(L129, LiaisonList!$A$1:$C$8, 3, FALSE)","v":"jfoodman@doe.mass.edu"},0,397]
[130,"01010000","Franklin","Public School District","Superintendent","Sara Ahern","355 East Central Street",null,"Franklin","MA","02038","Deb Walker",{"$f":"VLOOKUP(L130, LiaisonList!$A$1:$C$8, 2, FALSE)","v":"781-338-3127"},{"$f":"VLOOKUP(L130, LiaisonList!$A$1:$C$8, 3, FALSE)","v":"djwalker@doe.mass.edu"},79,5203]
[131,"08180000","Franklin County Regional Vocational Technical","Public School District","Superintendent","Richard Martin","82 Industrial Blvd",null,"Turners Falls","MA","01376","Sue Mazzarella",{"$f":"VLOOKUP(L131, LiaisonList!$A$1:$C$8, 2, FALSE)","v":"781-338-3587"},{"$f":"VLOOKUP(L131, LiaisonList!$A$1:$C$8, 3, FALSE)","v":"smazzarella@doe.mass.edu"},1,476]
[132,"06650000","Freetown-Lakeville","Public School District","Superintendent","Richard Medeiros","98 Howland Rd",null,"Lakeville","MA","02347","Aneesh Sahni",{"$f":"VLOOKUP(L132, LiaisonList!$A$1:$C$8, 2, FALSE)","v":"781-338-3532"},{"$f":"VLOOKUP(L132, LiaisonList!$A$1:$C$8, 3, FALSE)","v":"aneesh.sahni@doe.mass.edu"},18,2774]
[133,"06700000","Frontier","Public School District","Superintendent","Lynn Carey","113 North Main Street, Office C101",null,"South Deerfield","MA","01373","Alex Lilley",{"$f":"VLOOKUP(L133, LiaisonList!$A$1:$C$8, 2, FALSE)","v":"781-338-6212"},{"$f":"VLOOKUP(L133, LiaisonList!$A$1:$C$8, 3, FALSE)","v":"alilley@doe.mass.edu"},9,620]
[134,"01030000","Gardner","Public School District","Superintendent","Mark Pellegrino","70 Waterford Street",null,"Gardner","MA","01440","Russ Fleming",{"$f":"VLOOKUP(L134, LiaisonList!$A$1:$C$8, 2, FALSE)","v":"781-338-6529"},{"$f":"VLOOKUP(L134, LiaisonList!$A$1:$C$8, 3, FALSE)","v":"RFleming@doe.mass.edu"},102,2250]
[135,"06720000","Gateway","Public School District","Superintendent","David Hopson","12 Littleville Road",null,"Huntington","MA","01050","Russ Fleming",{"$f":"VLOOKUP(L135, LiaisonList!$A$1:$C$8, 2, FALSE)","v":"781-338-6529"},{"$f":"VLOOKUP(L135, LiaisonList!$A$1:$C$8, 3, FALSE)","v":"RFleming@doe.mass.edu"},23,791]
[136,"01050000","Georgetown","Public School District","Superintendent","Carol Jacobs","51 North Street",null,"Georgetown","MA","01833","Julia Foodman",{"$f":"VLOOKUP(L136, LiaisonList!$A$1:$C$8, 2, FALSE)","v":"781-338-3577"},{"$f":"VLOOKUP(L136, LiaisonList!$A$1:$C$8, 3, FALSE)","v":"jfoodman@doe.mass.edu"},1,1320]
[137,"06740000","Gill-Montague","Public School District","Superintendent","Michael Sullivan","35 Crocker Avenue",null,"Turners Falls","MA","01376","Beth O'Connell",{"$f":"VLOOKUP(L137, LiaisonList!$A$1:$C$8, 2, FALSE)","v":"781-338-3132"},{"$f":"VLOOKUP(L137, LiaisonList!$A$1:$C$8, 3, FALSE)","v":"EO'Connell@doe.mass.edu"},47,936]
[138,"04960000","Global Learning Charter Public (District)","Charter District","Charter School Leader","Stephen Furtado","190 Ashley Boulevard",null,"New Bedford","MA","02746","Julia Foodman",{"$f":"VLOOKUP(L138, LiaisonList!$A$1:$C$8, 2, FALSE)","v":"781-338-3577"},{"$f":"VLOOKUP(L138, LiaisonList!$A$1:$C$8, 3, FALSE)","v":"jfoodman@doe.mass.edu"},47,503]
[139,"01070000","Gloucester","Public School District","Superintendent","Richard Safier","2 Blackburn Drive",null,"Gloucester","MA","01930","Beth O'Connell",{"$f":"VLOOKUP(L139, LiaisonList!$A$1:$C$8, 2, FALSE)","v":"781-338-3132"},{"$f":"VLOOKUP(L139, LiaisonList!$A$1:$C$8, 3, FALSE)","v":"EO'Connell@doe.mass.edu"},167,2798]
[140,"01090000","Gosnold","Public School District","Superintendent","Margaret Frieswyk","263 Hill & Plain Road",null,"East Falmouth","MA","02536","Ellie Rounds-Bloom",{"$f":"VLOOKUP(L140, LiaisonList!$A$1:$C$8, 2, FALSE)","v":"781-338-3128"},{"$f":"VLOOKUP(L140, LiaisonList!$A$1:$C$8, 3, FALSE)","v":"erounds-bloom@doe.mass.edu"},0,2]
[141,"01100000","Grafton","Public School District","Superintendent","James Cummings","30 Providence Rd",null,"Grafton","MA","01519","Alex Lilley",{"$f":"VLOOKUP(L141, LiaisonList!$A$1:$C$8, 2, FALSE)","v":"781-338-6212"},{"$f":"VLOOKUP(L141, LiaisonList!$A$1:$C$8, 3, FALSE)","v":"alilley@doe.mass.edu"},36,3066]
[142,"01110000","Granby","Public School District","Superintendent","Sheryl Stanton","387 East State Street",null,"Granby","MA","01033","Ellie Rounds-Bloom",{"$f":"VLOOKUP(L142, LiaisonList!$A$1:$C$8, 2, FALSE)","v":"781-338-3128"},{"$f":"VLOOKUP(L142, LiaisonList!$A$1:$C$8, 3, FALSE)","v":"erounds-bloom@doe.mass.edu"},27,673]
[143,"08210000","Greater Fall River Regional Vocational Technical","Public School District","Superintendent","Thomas Aubin","251 Stonehaven Rd",null,"Fall River","MA","02723","Alex Lilley",{"$f":"VLOOKUP(L143, LiaisonList!$A$1:$C$8, 2, FALSE)","v":"781-338-6212"},{"$f":"VLOOKUP(L143, LiaisonList!$A$1:$C$8, 3, FALSE)","v":"alilley@doe.mass.edu"},31,1377]
[144,"08230000","Greater Lawrence Regional Vocational Technical","Public School District","Superintendent","John Lavoie","57 River Rd",null,"Andover","MA","01810","Ellie Rounds-Bloom",{"$f":"VLOOKUP(L144, LiaisonList!$A$1:$C$8, 2, FALSE)","v":"781-338-3128"},{"$f":"VLOOKUP(L144, LiaisonList!$A$1:$C$8, 3, FALSE)","v":"erounds-bloom@doe.mass.edu"},187,1492]
[145,"08280000","Greater Lowell Regional Vocational Technical","Public School District","Superintendent","Joseph Mastrocola","250 Pawtucket Blvd",null,"Tyngsborough","MA","01879","Deb Walker",{"$f":"VLOOKUP(L145, LiaisonList!$A$1:$C$8, 2, FALSE)","v":"781-338-3127"},{"$f":"VLOOKUP(L145, LiaisonList!$A$1:$C$8, 3, FALSE)","v":"djwalker@doe.mass.edu"},136,2201]
[146,"08250000","Greater New Bedford Regional Vocational Technical","Public School District","Superintendent","James O'Brien","1121 Ashley Blvd",null,"New Bedford","MA","02745","Aneesh Sahni",{"$f":"VLOOKUP(L146, LiaisonList!$A$1:$C$8, 2, FALSE)","v":"781-338-3532"},{"$f":"VLOOKUP(L146, LiaisonList!$A$1:$C$8, 3, FALSE)","v":"aneesh.sahni@doe.mass.edu"},66,2132]
[147,"01140000","Greenfield","Public School District","Superintendent","Jordana Harper","195 Federal Street, Suite 100",null,"Greenfield","MA","01301","Alex Lilley",{"$f":"VLOOKUP(L147, LiaisonList!$A$1:$C$8, 2, FALSE)","v":"781-338-6212"},{"$f":"VLOOKUP(L147, LiaisonList!$A$1:$C$8, 3, FALSE)","v":"alilley@doe.mass.edu"},106,1585]
[148,"39010000","Greenfield Commonwealth Virtual District","Public School District","Superintendent","Judith Houle","278 Main St.","Ste. 205","Greenfield","MA","01301","Deb Walker",{"$f":"VLOOKUP(L148, LiaisonList!$A$1:$C$8, 2, FALSE)","v":"781-338-3127"},{"$f":"VLOOKUP(L148, LiaisonList!$A$1:$C$8, 3, FALSE)","v":"djwalker@doe.mass.edu"},1,607]
[149,"06730000","Groton-Dunstable","Public School District","Superintendent","Laura Chesson","P O Box 729",null,"Groton","MA","01450","Julia Foodman",{"$f":"VLOOKUP(L149, LiaisonList!$A$1:$C$8, 2, FALSE)","v":"781-338-3577"},{"$f":"VLOOKUP(L149, LiaisonList!$A$1:$C$8, 3, FALSE)","v":"jfoodman@doe.mass.edu"},22,2362]
[150,"01170000","Hadley","Public School District","Superintendent","Anne McKenzie","125 Russell Street",null,"Hadley","MA","01035","Deb Walker",{"$f":"VLOOKUP(L150, LiaisonList!$A$1:$C$8, 2, FALSE)","v":"781-338-3127"},{"$f":"VLOOKUP(L150, LiaisonList!$A$1:$C$8, 3, FALSE)","v":"djwalker@doe.mass.edu"},15,491]
[151,"01180000","Halifax","Public School District","Superintendent","Joy Blackwood","250 Pembroke Street",null,"Kingston","MA","02364","Deb Walker",{"$f":"VLOOKUP(L151, LiaisonList!$A$1:$C$8, 2, FALSE)","v":"781-338-3127"},{"$f":"VLOOKUP(L151, LiaisonList!$A$1:$C$8, 3, FALSE)","v":"djwalker@doe.mass.edu"},6,602]
[152,"06750000","Hamilton-Wenham","Public School District","Superintendent","Michael Harvey","5 School Street",null,"Wenham","MA","01984","Sue Mazzarella",{"$f":"VLOOKUP(L152, LiaisonList!$A$1:$C$8, 2, FALSE)","v":"781-338-3587"},{"$f":"VLOOKUP(L152, LiaisonList!$A$1:$C$8, 3, FALSE)","v":"smazzarella@doe.mass.edu"},8,1735]
[153,"04990000","Hampden Charter School of Science East (District)","Charter District","Charter School Leader","Tarkan Topcuoglu","20 Johnson Road",null,"Chicopee","MA","01022","Beth O'Connell",{"$f":"VLOOKUP(L153, LiaisonList!$A$1:$C$8, 2, FALSE)","v":"781-338-3132"},{"$f":"VLOOKUP(L153, LiaisonList!$A$1:$C$8, 3, FALSE)","v":"EO'Connell@doe.mass.edu"},16,487]
[154,"35160000","Hampden Charter School of Science West (District)","Charter District","Charter School Leader","Tarkan Topcuoglu","20 Johnson Road",null,"Chicopee","MA","01022","Beth O'Connell",{"$f":"VLOOKUP(L154, LiaisonList!$A$1:$C$8, 2, FALSE)","v":"781-338-3132"},{"$f":"VLOOKUP(L154, LiaisonList!$A$1:$C$8, 3, FALSE)","v":"EO'Connell@doe.mass.edu"},0,0]
[155,"06800000","Hampden-Wilbraham","Public School District","Superintendent","Albert Ganem","621 Main Street",null,"Wilbraham","MA","01095","Alex Lilley",{"$f":"VLOOKUP(L155, LiaisonList!$A$1:$C$8, 2, FALSE)","v":"781-338-6212"},{"$f":"VLOOKUP(L155, LiaisonList!$A$1:$C$8, 3, FALSE)","v":"alilley@doe.mass.edu"},21,2982]
[156,"06830000","Hampshire","Public School District","Superintendent","Craig Jurgensen","19 Stage Rd",null,"Westhampton","MA","01027","Deb Walker",{"$f":"VLOOKUP(L156, LiaisonList!$A$1:$C$8, 2, FALSE)","v":"781-338-3127"},{"$f":"VLOOKUP(L156, LiaisonList!$A$1:$C$8, 3, FALSE)","v":"djwalker@doe.mass.edu"},7,703]
[157,"01210000","Hancock","Public School District","Superintendent","Peter Dillon","1831 STATE ROAD",null,"RICHMOND","MA","01254","Julia Foodman",{"$f":"VLOOKUP(L157, LiaisonList!$A$1:$C$8, 2, FALSE)","v":"781-338-3577"},{"$f":"VLOOKUP(L157, LiaisonList!$A$1:$C$8, 3, FALSE)","v":"jfoodman@doe.mass.edu"},0,33]
[158,"01220000","Hanover","Public School District","Superintendent","Matthew Ferron","188 Broadway Street",null,"Hanover","MA","02339","Beth O'Connell",{"$f":"VLOOKUP(L158, LiaisonList!$A$1:$C$8, 2, FALSE)","v":"781-338-3132"},{"$f":"VLOOKUP(L158, LiaisonList!$A$1:$C$8, 3, FALSE)","v":"EO'Connell@doe.mass.edu"},22,2546]
[159,"01250000","Harvard","Public School District","Superintendent","Linda Dwight","39 Massachusetts Avenue",null,"Harvard","MA","01451","Sue Mazzarella",{"$f":"VLOOKUP(L159, LiaisonList!$A$1:$C$8, 2, FALSE)","v":"781-338-3587"},{"$f":"VLOOKUP(L159, LiaisonList!$A$1:$C$8, 3, FALSE)","v":"smazzarella@doe.mass.edu"},19,1097]
[160,"01270000","Hatfield","Public School District","Superintendent","John Robert","34 School Street",null,"Hatfield","MA","01038","Alex Lilley",{"$f":"VLOOKUP(L160, LiaisonList!$A$1:$C$8, 2, FALSE)","v":"781-338-6212"},{"$f":"VLOOKUP(L160, LiaisonList!$A$1:$C$8, 3, FALSE)","v":"alilley@doe.mass.edu"},0,406]
[161,"01280000","Haverhill","Public School District","Superintendent","James Scully","4 Summer Street",null,"Haverhill","MA","01830","Ellie Rounds-Bloom",{"$f":"VLOOKUP(L161, LiaisonList!$A$1:$C$8, 2, FALSE)","v":"781-338-3128"},{"$f":"VLOOKUP(L161, LiaisonList!$A$1:$C$8, 3, FALSE)","v":"erounds-bloom@doe.mass.edu"},790,7311]
[162,"06850000","Hawlemont","Public School District","Superintendent","Michael Buoniconti","24 Ashfield Rd",null,"Shelburne Falls","MA","01370","Alex Lilley",{"$f":"VLOOKUP(L162, LiaisonList!$A$1:$C$8, 2, FALSE)","v":"781-338-6212"},{"$f":"VLOOKUP(L162, LiaisonList!$A$1:$C$8, 3, FALSE)","v":"alilley@doe.mass.edu"},0,138]
[163,"04190000","Helen Y. Davis Leadership Academy Charter Public (District)","Charter District","Charter School Leader","Chris Coblyn","23 Leonard Street",null,"Boston","MA","02122","Alex Lilley",{"$f":"VLOOKUP(L163, LiaisonList!$A$1:$C$8, 2, FALSE)","v":"781-338-6212"},{"$f":"VLOOKUP(L163, LiaisonList!$A$1:$C$8, 3, FALSE)","v":"alilley@doe.mass.edu"},18,214]
[164,"04550000","Hill View Montessori Charter Public (District)","Charter District","Charter School Leader","Jeanne Schultz","75 Foundation Ave","Ward Hill Business Park","Haverhill","MA","01835","Ellie Rounds-Bloom",{"$f":"VLOOKUP(L164, LiaisonList!$A$1:$C$8, 2, FALSE)","v":"781-338-3128"},{"$f":"VLOOKUP(L164, LiaisonList!$A$1:$C$8, 3, FALSE)","v":"erounds-bloom@doe.mass.edu"},21,301]
[165,"04500000","Hilltown Cooperative Charter Public (District)","Charter District","Charter School Leader","Daniel Klatz","1 Industrial Parkway",null,"Easthampton","MA","01039","Beth O'Connell",{"$f":"VLOOKUP(L165, LiaisonList!$A$1:$C$8, 2, FALSE)","v":"781-338-3132"},{"$f":"VLOOKUP(L165, LiaisonList!$A$1:$C$8, 3, FALSE)","v":"EO'Connell@doe.mass.edu"},0,218]
[166,"01310000","Hingham","Public School District","Superintendent","Dorothy Galo","220 Central Street",null,"Hingham","MA","02043","Ellie Rounds-Bloom",{"$f":"VLOOKUP(L166, LiaisonList!$A$1:$C$8, 2, FALSE)","v":"781-338-3128"},{"$f":"VLOOKUP(L166, LiaisonList!$A$1:$C$8, 3, FALSE)","v":"erounds-bloom@doe.mass.edu"},15,4223]
[167,"01330000","Holbrook","Public School District","Superintendent","Julie Hamilton","245 So. Franklin Street",null,"Holbrook","MA","02343","Deb Walker",{"$f":"VLOOKUP(L167, LiaisonList!$A$1:$C$8, 2, FALSE)","v":"781-338-3127"},{"$f":"VLOOKUP(L167, LiaisonList!$A$1:$C$8, 3, FALSE)","v":"djwalker@doe.mass.edu"},90,1163]
[168,"01350000","Holland","Public School District","Superintendent","Erin Nosek","320 Brookfield Rd",null,"Fiskdale","MA","01518","Russ Fleming",{"$f":"VLOOKUP(L168, LiaisonList!$A$1:$C$8, 2, FALSE)","v":"781-338-6529"},{"$f":"VLOOKUP(L168, LiaisonList!$A$1:$C$8, 3, FALSE)","v":"RFleming@doe.mass.edu"},0,211]
[169,"01360000","Holliston","Public School District","Superintendent","Bradford Jackson","370 Hollis Street",null,"Holliston","MA","01746","Julia Foodman",{"$f":"VLOOKUP(L169, LiaisonList!$A$1:$C$8, 2, FALSE)","v":"781-338-3577"},{"$f":"VLOOKUP(L169, LiaisonList!$A$1:$C$8, 3, FALSE)","v":"jfoodman@doe.mass.edu"},74,2808]
[170,"01370000","Holyoke","Public School District","Superintendent","Stephen Zrike","57 Suffolk Street",null,"Holyoke","MA","01040","Alex Lilley",{"$f":"VLOOKUP(L170, LiaisonList!$A$1:$C$8, 2, FALSE)","v":"781-338-6212"},{"$f":"VLOOKUP(L170, LiaisonList!$A$1:$C$8, 3, FALSE)","v":"alilley@doe.mass.edu"},1285,5141]
[171,"04530000","Holyoke Community Charter (District)","Charter District","Charter School Leader","Sonia Pope","2200 Northampton Street",null,"Holyoke","MA","01040","Alex Lilley",{"$f":"VLOOKUP(L171, LiaisonList!$A$1:$C$8, 2, FALSE)","v":"781-338-6212"},{"$f":"VLOOKUP(L171, LiaisonList!$A$1:$C$8, 3, FALSE)","v":"alilley@doe.mass.edu"},108,702]
[172,"01380000","Hopedale","Public School District","Superintendent","Karen Crebase","25 Adin Street",null,"Hopedale","MA","01747","Sue Mazzarella",{"$f":"VLOOKUP(L172, LiaisonList!$A$1:$C$8, 2, FALSE)","v":"781-338-3587"},{"$f":"VLOOKUP(L172, LiaisonList!$A$1:$C$8, 3, FALSE)","v":"smazzarella@doe.mass.edu"},16,1054]
[173,"01390000","Hopkinton","Public School District","Superintendent","Carol Cavanaugh","89 Hayden Rowe Street",null,"Hopkinton","MA","01748","Alex Lilley",{"$f":"VLOOKUP(L173, LiaisonList!$A$1:$C$8, 2, FALSE)","v":"781-338-6212"},{"$f":"VLOOKUP(L173, LiaisonList!$A$1:$C$8, 3, FALSE)","v":"alilley@doe.mass.edu"},135,3509]
[174,"01410000","Hudson","Public School District","Superintendent","Marco Rodrigues","155 Apsley Street",null,"Hudson","MA","01749","Ellie Rounds-Bloom",{"$f":"VLOOKUP(L174, LiaisonList!$A$1:$C$8, 2, FALSE)","v":"781-338-3128"},{"$f":"VLOOKUP(L174, LiaisonList!$A$1:$C$8, 3, FALSE)","v":"erounds-bloom@doe.mass.edu"},248,2601]
[175,"01420000","Hull","Public School District","Superintendent","Michael Devine","180 Harborview Road",null,"Hull","MA","02045","Aneesh Sahni",{"$f":"VLOOKUP(L175, LiaisonList!$A$1:$C$8, 2, FALSE)","v":"781-338-3532"},{"$f":"VLOOKUP(L175, LiaisonList!$A$1:$C$8, 3, FALSE)","v":"aneesh.sahni@doe.mass.edu"},4,842]
[176,"04350000","Innovation Academy Charter (District)","Charter District","Charter School Leader","Gregory Orpen","72 Tyng Road",null,"Tyngsborough","MA","01879","Aneesh Sahni",{"$f":"VLOOKUP(L176, LiaisonList!$A$1:$C$8, 2, FALSE)","v":"781-338-3532"},{"$f":"VLOOKUP(L176, LiaisonList!$A$1:$C$8, 3, FALSE)","v":"aneesh.sahni@doe.mass.edu"},15,798]
[177,"03700000","Institutional Schools","Public School District","Superintendent","Mary Lou Chapman","75 Pleasant Street","Room 4-429","Malden","MA","02148",{"$error":"#N/A"},{"$f":"VLOOKUP(L177, LiaisonList!$A$1:$C$8, 2, FALSE)","v":{"$error":"#N/A"}},{"$f":"VLOOKUP(L177, LiaisonList!$A$1:$C$8, 3, FALSE)","v":{"$error":"#N/A"}},0,0]
[178,"01440000","Ipswich","Public School District","Superintendent","Brian Blake","1 Lord Square",null,"Ipswich","MA","01938","Deb Walker",{"$f":"VLOOKUP(L178, LiaisonList!$A$1:$C$8, 2, FALSE)","v":"781-338-3127"},{"$f":"VLOOKUP(L178, LiaisonList!$A$1:$C$8, 3, FALSE)","v":"djwalker@doe.mass.edu"},32,1689]
[179,"06900000","King Philip","Public School District","Superintendent","Elizabeth Zielinski","18 King Street",null,"Norfolk","MA","02056","Deb Walker",{"$f":"VLOOKUP(L179, LiaisonList!$A$1:$C$8, 2, FALSE)","v":"781-338-3127"},{"$f":"VLOOKUP(L179, LiaisonList!$A$1:$C$8, 3, FALSE)","v":"djwalker@doe.mass.edu"},11,2040]
[180,"01450000","Kingston","Public School District","Superintendent","Joy Blackwood","250 Pembroke Street",null,"Kingston","MA","02364","Deb Walker",{"$f":"VLOOKUP(L180, LiaisonList!$A$1:$C$8, 2, FALSE)","v":"781-338-3127"},{"$f":"VLOOKUP(L180, LiaisonList!$A$1:$C$8, 3, FALSE)","v":"djwalker@doe.mass.edu"},18,1022]
[181,"04630000","KIPP Academy Boston Charter School (District)","Charter District","Charter School Leader","Caleb Dolan","37 Babson Street","KIPP Academy Boston","Mattapan","MA","02126","Beth O'Connell",{"$f":"VLOOKUP(L181, LiaisonList!$A$1:$C$8, 2, FALSE)","v":"781-338-3132"},{"$f":"VLOOKUP(L181, LiaisonList!$A$1:$C$8, 3, FALSE)","v":"EO'Connell@doe.mass.edu"},172,556]
[182,"04290000","KIPP Academy Lynn Charter (District)","Charter District","Charter School Leader","Caleb Dolan","90 High Rock Street",null,"Lynn","MA","01902","Beth O'Connell",{"$f":"VLOOKUP(L182, LiaisonList!$A$1:$C$8, 2, FALSE)","v":"781-338-3132"},{"$f":"VLOOKUP(L182, LiaisonList!$A$1:$C$8, 3, FALSE)","v":"EO'Connell@doe.mass.edu"},374,1333]
[183,"01480000","Lanesborough","Public School District","Superintendent","Kimberley Grady","188 Summer Street",null,"Lanesborough","MA","01237","Russ Fleming",{"$f":"VLOOKUP(L183, LiaisonList!$A$1:$C$8, 2, FALSE)","v":"781-338-6529"},{"$f":"VLOOKUP(L183, LiaisonList!$A$1:$C$8, 3, FALSE)","v":"RFleming@doe.mass.edu"},0,194]
[184,"01490000","Lawrence","Public School District","Superintendent","Mary Bergeron","237 Essex Street",null,"Lawrence","MA","01840","Russ Fleming",{"$f":"VLOOKUP(L184, LiaisonList!$A$1:$C$8, 2, FALSE)","v":"781-338-6529"},{"$f":"VLOOKUP(L184, LiaisonList!$A$1:$C$8, 3, FALSE)","v":"RFleming@doe.mass.edu"},4786,13587]
[185,"04540000","Lawrence Family Development Charter (District)","Charter District","Charter School Leader","Ralph Carrero","34 West Street",null,"Lawrence","MA","01841","Ellie Rounds-Bloom",{"$f":"VLOOKUP(L185, LiaisonList!$A$1:$C$8, 2, FALSE)","v":"781-338-3128"},{"$f":"VLOOKUP(L185, LiaisonList!$A$1:$C$8, 3, FALSE)","v":"erounds-bloom@doe.mass.edu"},165,653]
[186,"01500000","Lee","Public School District","Superintendent","H. Eberwein","300A Greylock St",null,"Lee","MA","01238","Sue Mazzarella",{"$f":"VLOOKUP(L186, LiaisonList!$A$1:$C$8, 2, FALSE)","v":"781-338-3587"},{"$f":"VLOOKUP(L186, LiaisonList!$A$1:$C$8, 3, FALSE)","v":"smazzarella@doe.mass.edu"},27,673]
[187,"01510000","Leicester","Public School District","Superintendent","Marilyn Tencza","1078 Main Street",null,"Leicester","MA","01524","Aneesh Sahni",{"$f":"VLOOKUP(L187, LiaisonList!$A$1:$C$8, 2, FALSE)","v":"781-338-3532"},{"$f":"VLOOKUP(L187, LiaisonList!$A$1:$C$8, 3, FALSE)","v":"aneesh.sahni@doe.mass.edu"},43,1490]
[188,"01520000","Lenox","Public School District","Superintendent","Timothy Lee","6 Walker Street",null,"Lenox","MA","01240","Ellie Rounds-Bloom",{"$f":"VLOOKUP(L188, LiaisonList!$A$1:$C$8, 2, FALSE)","v":"781-338-3128"},{"$f":"VLOOKUP(L188, LiaisonList!$A$1:$C$8, 3, FALSE)","v":"erounds-bloom@doe.mass.edu"},19,725]
[189,"01530000","Leominster","Public School District","Superintendent","Paula Deacon","24 Church Street",null,"Leominster","MA","01453","Aneesh Sahni",{"$f":"VLOOKUP(L189, LiaisonList!$A$1:$C$8, 2, FALSE)","v":"781-338-3532"},{"$f":"VLOOKUP(L189, LiaisonList!$A$1:$C$8, 3, FALSE)","v":"aneesh.sahni@doe.mass.edu"},663,5927]
[190,"01540000","Leverett","Public School District","Superintendent","Jennifer Haggerty","18 Pleasant Street",null,"Erving","MA","01344","Deb Walker",{"$f":"VLOOKUP(L190, LiaisonList!$A$1:$C$8, 2, FALSE)","v":"781-338-3127"},{"$f":"VLOOKUP(L190, LiaisonList!$A$1:$C$8, 3, FALSE)","v":"djwalker@doe.mass.edu"},0,111]
[191,"01550000","Lexington","Public School District","Superintendent","Mary Czajkowski","146 Maple Street",null,"Lexington","MA","02420","Russ Fleming",{"$f":"VLOOKUP(L191, LiaisonList!$A$1:$C$8, 2, FALSE)","v":"781-338-6529"},{"$f":"VLOOKUP(L191, LiaisonList!$A$1:$C$8, 3, FALSE)","v":"RFleming@doe.mass.edu"},536,7211]
[192,"35140000","Libertas Academy Charter School (District)","Charter District","Charter School Leader","Modesto Montero","146 Chestnut Street",null,"Springfield","MA","01103","Ellie Rounds-Bloom",{"$f":"VLOOKUP(L192, LiaisonList!$A$1:$C$8, 2, FALSE)","v":"781-338-3128"},{"$f":"VLOOKUP(L192, LiaisonList!$A$1:$C$8, 3, FALSE)","v":"erounds-bloom@doe.mass.edu"},40,88]
[193,"01570000","Lincoln","Public School District","Superintendent","Rebecca McFall","1 Ballfield Road",null,"Lincoln","MA","01773","Julia Foodman",{"$f":"VLOOKUP(L193, LiaisonList!$A$1:$C$8, 2, FALSE)","v":"781-338-3577"},{"$f":"VLOOKUP(L193, LiaisonList!$A$1:$C$8, 3, FALSE)","v":"jfoodman@doe.mass.edu"},53,1081]
[194,"06950000","Lincoln-Sudbury","Public School District","Superintendent","Bella Wong","390 Lincoln Rd",null,"Sudbury","MA","01776","Russ Fleming",{"$f":"VLOOKUP(L194, LiaisonList!$A$1:$C$8, 2, FALSE)","v":"781-338-6529"},{"$f":"VLOOKUP(L194, LiaisonList!$A$1:$C$8, 3, FALSE)","v":"RFleming@doe.mass.edu"},4,1519]
[195,"01580000","Littleton","Public School District","Superintendent","Kelly Clenchy","PO Box 1486",null,"Littleton","MA","01460","Beth O'Connell",{"$f":"VLOOKUP(L195, LiaisonList!$A$1:$C$8, 2, FALSE)","v":"781-338-3132"},{"$f":"VLOOKUP(L195, LiaisonList!$A$1:$C$8, 3, FALSE)","v":"EO'Connell@doe.mass.edu"},24,1604]
[196,"01590000","Longmeadow","Public School District","Superintendent","Maurice O'shea","535 Bliss Road",null,"Longmeadow","MA","01106","Sue Mazzarella",{"$f":"VLOOKUP(L196, LiaisonList!$A$1:$C$8, 2, FALSE)","v":"781-338-3587"},{"$f":"VLOOKUP(L196, LiaisonList!$A$1:$C$8, 3, FALSE)","v":"smazzarella@doe.mass.edu"},24,2821]
[197,"01600000","Lowell","Public School District","Superintendent","Salah Khelfaoui","155 Merrimack Street",null,"Lowell","MA","01852","Deb Walker",{"$f":"VLOOKUP(L197, LiaisonList!$A$1:$C$8, 2, FALSE)","v":"781-338-3127"},{"$f":"VLOOKUP(L197, LiaisonList!$A$1:$C$8, 3, FALSE)","v":"djwalker@doe.mass.edu"},3606,14004]
[198,"04560000","Lowell Community Charter Public (District)","Charter District","Charter School Leader","Nicholas Leonardos","206 Jackson Street",null,"Lowell","MA","01852","Deb Walker",{"$f":"VLOOKUP(L198, LiaisonList!$A$1:$C$8, 2, FALSE)","v":"781-338-3127"},{"$f":"VLOOKUP(L198, LiaisonList!$A$1:$C$8, 3, FALSE)","v":"djwalker@doe.mass.edu"},402,760]
[199,"04580000","Lowell Middlesex Academy Charter (District)","Charter District","Charter School Leader","Margaret McDevitt","67 Middle St",null,"Lowell","MA","01852","Russ Fleming",{"$f":"VLOOKUP(L199, LiaisonList!$A$1:$C$8, 2, FALSE)","v":"781-338-6529"},{"$f":"VLOOKUP(L199, LiaisonList!$A$1:$C$8, 3, FALSE)","v":"RFleming@doe.mass.edu"},5,99]
[200,"01610000","Ludlow","Public School District","Superintendent","Todd Gazda","63 Chestnut Street",null,"Ludlow","MA","01056","Ellie Rounds-Bloom",{"$f":"VLOOKUP(L200, LiaisonList!$A$1:$C$8, 2, FALSE)","v":"781-338-3128"},{"$f":"VLOOKUP(L200, LiaisonList!$A$1:$C$8, 3, FALSE)","v":"erounds-bloom@doe.mass.edu"},70,2546]
[201,"01620000","Lunenburg","Public School District","Superintendent","Loxi Jo Calmes","1025 Mass Avenue",null,"Lunenburg","MA","01462","Aneesh Sahni",{"$f":"VLOOKUP(L201, LiaisonList!$A$1:$C$8, 2, FALSE)","v":"781-338-3532"},{"$f":"VLOOKUP(L201, LiaisonList!$A$1:$C$8, 3, FALSE)","v":"aneesh.sahni@doe.mass.edu"},36,1585]
[202,"01630000","Lynn","Public School District","Superintendent","Catherine Latham","100 Bennett St",null,"Lynn","MA","01905","Aneesh Sahni",{"$f":"VLOOKUP(L202, LiaisonList!$A$1:$C$8, 2, FALSE)","v":"781-338-3532"},{"$f":"VLOOKUP(L202, LiaisonList!$A$1:$C$8, 3, FALSE)","v":"aneesh.sahni@doe.mass.edu"},3591,15385]
[203,"01640000","Lynnfield","Public School District","Superintendent","Jane Tremblay","525 Salem Street",null,"Lynnfield","MA","01940","Russ Fleming",{"$f":"VLOOKUP(L203, LiaisonList!$A$1:$C$8, 2, FALSE)","v":"781-338-6529"},{"$f":"VLOOKUP(L203, LiaisonList!$A$1:$C$8, 3, FALSE)","v":"RFleming@doe.mass.edu"},36,2175]
[204,"04680000","Ma Academy for Math and Science","Public School District","Superintendent","Michael Barney","85 Prescott Street",null,"Worcester","MA","01605","Alex Lilley",{"$f":"VLOOKUP(L204, LiaisonList!$A$1:$C$8, 2, FALSE)","v":"781-338-6212"},{"$f":"VLOOKUP(L204, LiaisonList!$A$1:$C$8, 3, FALSE)","v":"alilley@doe.mass.edu"},0,96]
[205,"01650000","Malden","Public School District","Superintendent","John Oteri","77 Salem Street",null,"Malden","MA","02148","Julia Foodman",{"$f":"VLOOKUP(L205, LiaisonList!$A$1:$C$8, 2, FALSE)","v":"781-338-3577"},{"$f":"VLOOKUP(L205, LiaisonList!$A$1:$C$8, 3, FALSE)","v":"jfoodman@doe.mass.edu"},1387,6272]
[206,"06980000","Manchester Essex Regional","Public School District","Superintendent","Pamela Beaudoin","PO BOX 1407",null,"Manchester","MA","01944","Julia Foodman",{"$f":"VLOOKUP(L206, LiaisonList!$A$1:$C$8, 2, FALSE)","v":"781-338-3577"},{"$f":"VLOOKUP(L206, LiaisonList!$A$1:$C$8, 3, FALSE)","v":"jfoodman@doe.mass.edu"},8,1358]
[207,"01670000","Mansfield","Public School District","Superintendent","Teresa Murphy","2 Park Row",null,"Mansfield","MA","02048","Beth O'Connell",{"$f":"VLOOKUP(L207, LiaisonList!$A$1:$C$8, 2, FALSE)","v":"781-338-3132"},{"$f":"VLOOKUP(L207, LiaisonList!$A$1:$C$8, 3, FALSE)","v":"EO'Connell@doe.mass.edu"},86,3776]
[208,"35170000","Map Academy Charter School (District)","Charter District","Charter School Leader","Rachel Babcock","6 Main Street Extension","#3169","Plymouth","MA","02361","Beth O'Connell",{"$f":"VLOOKUP(L208, LiaisonList!$A$1:$C$8, 2, FALSE)","v":"781-338-3132"},{"$f":"VLOOKUP(L208, LiaisonList!$A$1:$C$8, 3, FALSE)","v":"EO'Connell@doe.mass.edu"},0,0]
[209,"01680000","Marblehead","Public School District","Superintendent","Maryann Perry","9 Widger Road",null,"Marblehead","MA","01945","Sue Mazzarella",{"$f":"VLOOKUP(L209, LiaisonList!$A$1:$C$8, 2, FALSE)","v":"781-338-3587"},{"$f":"VLOOKUP(L209, LiaisonList!$A$1:$C$8, 3, FALSE)","v":"smazzarella@doe.mass.edu"},125,3060]
[210,"04640000","Marblehead Community Charter Public (District)","Charter District","Charter School Leader","Helena Cullen-Hamzeh","17 Lime Street",null,"Marblehead","MA","01945","Beth O'Connell",{"$f":"VLOOKUP(L210, LiaisonList!$A$1:$C$8, 2, FALSE)","v":"781-338-3132"},{"$f":"VLOOKUP(L210, LiaisonList!$A$1:$C$8, 3, FALSE)","v":"EO'Connell@doe.mass.edu"},1,230]
[211,"01690000","Marion","Public School District","Superintendent","Douglas White","135 Marion Rd",null,"Mattapoisett","MA","02739","Aneesh Sahni",{"$f":"VLOOKUP(L211, LiaisonList!$A$1:$C$8, 2, FALSE)","v":"781-338-3532"},{"$f":"VLOOKUP(L211, LiaisonList!$A$1:$C$8, 3, FALSE)","v":"aneesh.sahni@doe.mass.edu"},2,425]
[212,"01700000","Marlborough","Public School District","Superintendent","Maureen Greulich","17 Washington Street",null,"Marlborough","MA","01752","Ellie Rounds-Bloom",{"$f":"VLOOKUP(L212, LiaisonList!$A$1:$C$8, 2, FALSE)","v":"781-338-3128"},{"$f":"VLOOKUP(L212, LiaisonList!$A$1:$C$8, 3, FALSE)","v":"erounds-bloom@doe.mass.edu"},1069,4446]
[213,"01710000","Marshfield","Public School District","Superintendent","Jeffrey Granatino","76 South River Street",null,"Marshfield","MA","02050","Aneesh Sahni",{"$f":"VLOOKUP(L213, LiaisonList!$A$1:$C$8, 2, FALSE)","v":"781-338-3532"},{"$f":"VLOOKUP(L213, LiaisonList!$A$1:$C$8, 3, FALSE)","v":"aneesh.sahni@doe.mass.edu"},42,4040]
[214,"07000000","Martha's Vineyard","Public School District","Superintendent","Matthew D'Andrea","4 Pine Street",null,"Vineyard Haven","MA","02568","Sue Mazzarella",{"$f":"VLOOKUP(L214, LiaisonList!$A$1:$C$8, 2, FALSE)","v":"781-338-3587"},{"$f":"VLOOKUP(L214, LiaisonList!$A$1:$C$8, 3, FALSE)","v":"smazzarella@doe.mass.edu"},64,635]
[215,"04660000","Martha's Vineyard Charter (District)","Charter District","Charter School Leader","Robert Moore","PO Box 1150",null,"West Tisbury","MA","02575","Sue Mazzarella",{"$f":"VLOOKUP(L215, LiaisonList!$A$1:$C$8, 2, FALSE)","v":"781-338-3587"},{"$f":"VLOOKUP(L215, LiaisonList!$A$1:$C$8, 3, FALSE)","v":"smazzarella@doe.mass.edu"},9,185]
[216,"04920000","Martin Luther King Jr. Charter School of Excellence (District)","Charter District","Charter School Leader","Alan Katz","285 Dorset Street",null,"Springfield","MA","01108","Aneesh Sahni",{"$f":"VLOOKUP(L216, LiaisonList!$A$1:$C$8, 2, FALSE)","v":"781-338-3532"},{"$f":"VLOOKUP(L216, LiaisonList!$A$1:$C$8, 3, FALSE)","v":"aneesh.sahni@doe.mass.edu"},75,363]
[217,"07050000","Masconomet","Public School District","Superintendent","Kevin Lyons","20 Endicott Rd",null,"Boxford","MA","01921","Sue Mazzarella",{"$f":"VLOOKUP(L217, LiaisonList!$A$1:$C$8, 2, FALSE)","v":"781-338-3587"},{"$f":"VLOOKUP(L217, LiaisonList!$A$1:$C$8, 3, FALSE)","v":"smazzarella@doe.mass.edu"},8,1798]
[218,"01720000","Mashpee","Public School District","Superintendent","Patricia DeBoer","150-A Old Barnstable Road",null,"Mashpee","MA","02649","Deb Walker",{"$f":"VLOOKUP(L218, LiaisonList!$A$1:$C$8, 2, FALSE)","v":"781-338-3127"},{"$f":"VLOOKUP(L218, LiaisonList!$A$1:$C$8, 3, FALSE)","v":"djwalker@doe.mass.edu"},35,1553]
[219,"04690000","MATCH Charter Public School (District)","Charter District","Charter School Leader","Nnenna Ude","1001 Commonwealth Avenue",null,"Boston","MA","02215","Ellie Rounds-Bloom",{"$f":"VLOOKUP(L219, LiaisonList!$A$1:$C$8, 2, FALSE)","v":"781-338-3128"},{"$f":"VLOOKUP(L219, LiaisonList!$A$1:$C$8, 3, FALSE)","v":"erounds-bloom@doe.mass.edu"},344,1162]
[220,"01730000","Mattapoisett","Public School District","Superintendent","Douglas White","135 Marion Rd",null,"Mattapoisett","MA","02739","Aneesh Sahni",{"$f":"VLOOKUP(L220, LiaisonList!$A$1:$C$8, 2, FALSE)","v":"781-338-3532"},{"$f":"VLOOKUP(L220, LiaisonList!$A$1:$C$8, 3, FALSE)","v":"aneesh.sahni@doe.mass.edu"},3,425]
[221,"01740000","Maynard","Public School District","Superintendent","Robert Gerardi","3-R Tiger Drive",null,"Maynard","MA","01754","Julia Foodman",{"$f":"VLOOKUP(L221, LiaisonList!$A$1:$C$8, 2, FALSE)","v":"781-338-3577"},{"$f":"VLOOKUP(L221, LiaisonList!$A$1:$C$8, 3, FALSE)","v":"jfoodman@doe.mass.edu"},64,1331]
[222,"01750000","Medfield","Public School District","Superintendent","Jeffrey Marsden","459 Main St","3rd Fl","Medfield","MA","02052","Beth O'Connell",{"$f":"VLOOKUP(L222, LiaisonList!$A$1:$C$8, 2, FALSE)","v":"781-338-3132"},{"$f":"VLOOKUP(L222, LiaisonList!$A$1:$C$8, 3, FALSE)","v":"EO'Connell@doe.mass.edu"},32,2563]
[223,"01760000","Medford","Public School District","Superintendent","Roy Belson","489 Winthrop Street",null,"Medford","MA","02155","Sue Mazzarella",{"$f":"VLOOKUP(L223, LiaisonList!$A$1:$C$8, 2, FALSE)","v":"781-338-3587"},{"$f":"VLOOKUP(L223, LiaisonList!$A$1:$C$8, 3, FALSE)","v":"smazzarella@doe.mass.edu"},486,4230]
[224,"01770000","Medway","Public School District","Superintendent","Armand Pires","45 Holliston Street",null,"Medway","MA","02053","Alex Lilley",{"$f":"VLOOKUP(L224, LiaisonList!$A$1:$C$8, 2, FALSE)","v":"781-338-6212"},{"$f":"VLOOKUP(L224, LiaisonList!$A$1:$C$8, 3, FALSE)","v":"alilley@doe.mass.edu"},26,2251]
[225,"01780000","Melrose","Public School District","Superintendent","Cyndy Taymore","360 Lynn Fells Pkwy",null,"Melrose","MA","02176","Ellie Rounds-Bloom",{"$f":"VLOOKUP(L225, LiaisonList!$A$1:$C$8, 2, FALSE)","v":"781-338-3128"},{"$f":"VLOOKUP(L225, LiaisonList!$A$1:$C$8, 3, FALSE)","v":"erounds-bloom@doe.mass.edu"},171,3587]
[226,"07100000","Mendon-Upton","Public School District","Superintendent","Joseph Maruszczak","150 North Ave",null,"Mendon","MA","01756","Alex Lilley",{"$f":"VLOOKUP(L226, LiaisonList!$A$1:$C$8, 2, FALSE)","v":"781-338-6212"},{"$f":"VLOOKUP(L226, LiaisonList!$A$1:$C$8, 3, FALSE)","v":"alilley@doe.mass.edu"},21,2220]
[227,"01810000","Methuen","Public School District","Superintendent","Judith Scannell","10 Ditson Place",null,"Methuen","MA","01844","Aneesh Sahni",{"$f":"VLOOKUP(L227, LiaisonList!$A$1:$C$8, 2, FALSE)","v":"781-338-3532"},{"$f":"VLOOKUP(L227, LiaisonList!$A$1:$C$8, 3, FALSE)","v":"aneesh.sahni@doe.mass.edu"},649,6868]
[228,"01820000","Middleborough","Public School District","Superintendent","Brian Lynch","30 Forest Street",null,"Middleborough","MA","02346","Deb Walker",{"$f":"VLOOKUP(L228, LiaisonList!$A$1:$C$8, 2, FALSE)","v":"781-338-3127"},{"$f":"VLOOKUP(L228, LiaisonList!$A$1:$C$8, 3, FALSE)","v":"djwalker@doe.mass.edu"},31,2896]
[229,"01840000","Middleton","Public School District","Superintendent","Scott Morrison","28 Middleton Road",null,"Boxford","MA","01921","Russ Fleming",{"$f":"VLOOKUP(L229, LiaisonList!$A$1:$C$8, 2, FALSE)","v":"781-338-6529"},{"$f":"VLOOKUP(L229, LiaisonList!$A$1:$C$8, 3, FALSE)","v":"RFleming@doe.mass.edu"},4,608]
[230,"01850000","Milford","Public School District","Superintendent","Kevin Mcintyre","31 West Fountain Street",null,"Milford","MA","01757","Julia Foodman",{"$f":"VLOOKUP(L230, LiaisonList!$A$1:$C$8, 2, FALSE)","v":"781-338-3577"},{"$f":"VLOOKUP(L230, LiaisonList!$A$1:$C$8, 3, FALSE)","v":"jfoodman@doe.mass.edu"},683,4081]
[231,"01860000","Millbury","Public School District","Superintendent","Gregory Myers","12 Martin Street",null,"Millbury","MA","01527","Beth O'Connell",{"$f":"VLOOKUP(L231, LiaisonList!$A$1:$C$8, 2, FALSE)","v":"781-338-3132"},{"$f":"VLOOKUP(L231, LiaisonList!$A$1:$C$8, 3, FALSE)","v":"EO'Connell@doe.mass.edu"},61,1657]
[232,"01870000","Millis","Public School District","Superintendent","Nancy Gustafson","245 Plain Street","Central Office","Millis","MA","02054","Sue Mazzarella",{"$f":"VLOOKUP(L232, LiaisonList!$A$1:$C$8, 2, FALSE)","v":"781-338-3587"},{"$f":"VLOOKUP(L232, LiaisonList!$A$1:$C$8, 3, FALSE)","v":"smazzarella@doe.mass.edu"},16,1235]
[233,"01890000","Milton","Public School District","Superintendent","Mary Gormley","25 Gile Road",null,"Milton","MA","02186","Alex Lilley",{"$f":"VLOOKUP(L233, LiaisonList!$A$1:$C$8, 2, FALSE)","v":"781-338-6212"},{"$f":"VLOOKUP(L233, LiaisonList!$A$1:$C$8, 3, FALSE)","v":"alilley@doe.mass.edu"},82,4073]
[234,"08300000","Minuteman Regional Vocational Technical","Public School District","Superintendent","Edward Bouquillon","758 Marrett Rd",null,"Lexington","MA","02421","Julia Foodman",{"$f":"VLOOKUP(L234, LiaisonList!$A$1:$C$8, 2, FALSE)","v":"781-338-3577"},{"$f":"VLOOKUP(L234, LiaisonList!$A$1:$C$8, 3, FALSE)","v":"jfoodman@doe.mass.edu"},8,531]
[235,"07170000","Mohawk Trail","Public School District","Superintendent","Michael Buoniconti","24 Ashfield Rd",null,"Shelburne Falls","MA","01370","Deb Walker",{"$f":"VLOOKUP(L235, LiaisonList!$A$1:$C$8, 2, FALSE)","v":"781-338-3127"},{"$f":"VLOOKUP(L235, LiaisonList!$A$1:$C$8, 3, FALSE)","v":"djwalker@doe.mass.edu"},2,827]
[236,"07120000","Monomoy Regional School District","Public School District","Superintendent","Scott Carpenter","425 Crowell Rd",null,"Chatham","MA","02633","Ellie Rounds-Bloom",{"$f":"VLOOKUP(L236, LiaisonList!$A$1:$C$8, 2, FALSE)","v":"781-338-3128"},{"$f":"VLOOKUP(L236, LiaisonList!$A$1:$C$8, 3, FALSE)","v":"erounds-bloom@doe.mass.edu"},83,1811]
[237,"01910000","Monson","Public School District","Superintendent","Cheryl Clarke","P O Box 159",null,"Monson","MA","01057","Ellie Rounds-Bloom",{"$f":"VLOOKUP(L237, LiaisonList!$A$1:$C$8, 2, FALSE)","v":"781-338-3128"},{"$f":"VLOOKUP(L237, LiaisonList!$A$1:$C$8, 3, FALSE)","v":"erounds-bloom@doe.mass.edu"},7,878]
[238,"08320000","Montachusett Regional Vocational Technical","Public School District","Superintendent","Sheila Harrity","1050 Westminster Street",null,"Fitchburg","MA","01420","Beth O'Connell",{"$f":"VLOOKUP(L238, LiaisonList!$A$1:$C$8, 2, FALSE)","v":"781-338-3132"},{"$f":"VLOOKUP(L238, LiaisonList!$A$1:$C$8, 3, FALSE)","v":"EO'Connell@doe.mass.edu"},8,1395]
[239,"07150000","Mount Greylock","Public School District","Superintendent","Kimberley Grady","1781 Cold Spring Rd",null,"Williamstown","MA","01267","Russ Fleming",{"$f":"VLOOKUP(L239, LiaisonList!$A$1:$C$8, 2, FALSE)","v":"781-338-6529"},{"$f":"VLOOKUP(L239, LiaisonList!$A$1:$C$8, 3, FALSE)","v":"RFleming@doe.mass.edu"},1,535]
[240,"04700000","Mystic Valley Regional Charter (District)","Charter District","Charter School Leader","Alex Dan","4 Laurel Street",null,"Malden","MA","02148","Aneesh Sahni",{"$f":"VLOOKUP(L240, LiaisonList!$A$1:$C$8, 2, FALSE)","v":"781-338-3532"},{"$f":"VLOOKUP(L240, LiaisonList!$A$1:$C$8, 3, FALSE)","v":"aneesh.sahni@doe.mass.edu"},39,1562]
[241,"01960000","Nahant","Public School District","Superintendent","Anthony Pierantozzi","290 Castle Road",null,"Nahant","MA","01908","Aneesh Sahni",{"$f":"VLOOKUP(L241, LiaisonList!$A$1:$C$8, 2, FALSE)","v":"781-338-3532"},{"$f":"VLOOKUP(L241, LiaisonList!$A$1:$C$8, 3, FALSE)","v":"aneesh.sahni@doe.mass.edu"},0,121]
[242,"01970000","Nantucket","Public School District","Superintendent","William Cozort","10 Surfside Road",null,"Nantucket","MA","02554","Deb Walker",{"$f":"VLOOKUP(L242, LiaisonList!$A$1:$C$8, 2, FALSE)","v":"781-338-3127"},{"$f":"VLOOKUP(L242, LiaisonList!$A$1:$C$8, 3, FALSE)","v":"djwalker@doe.mass.edu"},294,1586]
[243,"07200000","Narragansett","Public School District","Superintendent","Christopher Casavant","462 Baldwinville Rd",null,"Baldwinville","MA","01436","Russ Fleming",{"$f":"VLOOKUP(L243, LiaisonList!$A$1:$C$8, 2, FALSE)","v":"781-338-6529"},{"$f":"VLOOKUP(L243, LiaisonList!$A$1:$C$8, 3, FALSE)","v":"RFleming@doe.mass.edu"},10,1351]
[244,"07250000","Nashoba","Public School District","Superintendent","Brooke Clenchy","50 Mechanic Street",null,"Bolton","MA","01740","Julia Foodman",{"$f":"VLOOKUP(L244, LiaisonList!$A$1:$C$8, 2, FALSE)","v":"781-338-3577"},{"$f":"VLOOKUP(L244, LiaisonList!$A$1:$C$8, 3, FALSE)","v":"jfoodman@doe.mass.edu"},65,3204]
[245,"08520000","Nashoba Valley Regional Vocational Technical","Public School District","Superintendent","Denise Pigeon","100 Littleton Road",null,"Westford","MA","01886","Alex Lilley",{"$f":"VLOOKUP(L245, LiaisonList!$A$1:$C$8, 2, FALSE)","v":"781-338-6212"},{"$f":"VLOOKUP(L245, LiaisonList!$A$1:$C$8, 3, FALSE)","v":"alilley@doe.mass.edu"},3,690]
[246,"01980000","Natick","Public School District","Superintendent","Anna Nolin","13 East Central Street",null,"Natick","MA","01760","Russ Fleming",{"$f":"VLOOKUP(L246, LiaisonList!$A$1:$C$8, 2, FALSE)","v":"781-338-6529"},{"$f":"VLOOKUP(L246, LiaisonList!$A$1:$C$8, 3, FALSE)","v":"RFleming@doe.mass.edu"},169,5381]
[247,"06600000","Nauset","Public School District","Superintendent","Thomas Conrad","78 Eldredge Pkwy",null,"Orleans","MA","02653","Julia Foodman",{"$f":"VLOOKUP(L247, LiaisonList!$A$1:$C$8, 2, FALSE)","v":"781-338-3577"},{"$f":"VLOOKUP(L247, LiaisonList!$A$1:$C$8, 3, FALSE)","v":"jfoodman@doe.mass.edu"},29,1487]
[248,"01990000","Needham","Public School District","Superintendent","Daniel Gutekanst","1330 Highland Avenue",null,"Needham","MA","02492","Julia Foodman",{"$f":"VLOOKUP(L248, LiaisonList!$A$1:$C$8, 2, FALSE)","v":"781-338-3577"},{"$f":"VLOOKUP(L248, LiaisonList!$A$1:$C$8, 3, FALSE)","v":"jfoodman@doe.mass.edu"},161,5571]
[249,"04440000","Neighborhood House Charter (District)","Charter District","Charter School Leader","Kate Scott","21 Queen Street",null,"Dorchester","MA","02122","Aneesh Sahni",{"$f":"VLOOKUP(L249, LiaisonList!$A$1:$C$8, 2, FALSE)","v":"781-338-3532"},{"$f":"VLOOKUP(L249, LiaisonList!$A$1:$C$8, 3, FALSE)","v":"aneesh.sahni@doe.mass.edu"},42,521]
[250,"02010000","New Bedford","Public School District","Superintendent","Pia Durkin","455 County Street","C/O Paul Rodrigues Administration Bldg.","New Bedford","MA","02740","Beth O'Connell",{"$f":"VLOOKUP(L250, LiaisonList!$A$1:$C$8, 2, FALSE)","v":"781-338-3132"},{"$f":"VLOOKUP(L250, LiaisonList!$A$1:$C$8, 3, FALSE)","v":"EO'Connell@doe.mass.edu"},3645,12116]
[251,"35130000","New Heights Charter School of Brockton (District)","Charter District","Charter School Leader","Omari Walker","1690 Main Street",null,"Brockton","MA","02301","Alex Lilley",{"$f":"VLOOKUP(L251, LiaisonList!$A$1:$C$8, 2, FALSE)","v":"781-338-6212"},{"$f":"VLOOKUP(L251, LiaisonList!$A$1:$C$8, 3, FALSE)","v":"alilley@doe.mass.edu"},46,421]
[252,"07280000","New Salem-Wendell","Public School District","Superintendent","Jennifer Haggerty","18 Pleasant Street",null,"Erving","MA","01344","Deb Walker",{"$f":"VLOOKUP(L252, LiaisonList!$A$1:$C$8, 2, FALSE)","v":"781-338-3127"},{"$f":"VLOOKUP(L252, LiaisonList!$A$1:$C$8, 3, FALSE)","v":"djwalker@doe.mass.edu"},0,128]
[253,"02040000","Newburyport","Public School District","Superintendent","Susan Viccaro","70 Low Street",null,"Newburyport","MA","01950","Sue Mazzarella",{"$f":"VLOOKUP(L253, LiaisonList!$A$1:$C$8, 2, FALSE)","v":"781-338-3587"},{"$f":"VLOOKUP(L253, LiaisonList!$A$1:$C$8, 3, FALSE)","v":"smazzarella@doe.mass.edu"},36,2180]
[254,"02070000","Newton","Public School District","Superintendent","David Fleishman","100 Walnut Street",null,"Newtonville","MA","02460","Alex Lilley",{"$f":"VLOOKUP(L254, LiaisonList!$A$1:$C$8, 2, FALSE)","v":"781-338-6212"},{"$f":"VLOOKUP(L254, LiaisonList!$A$1:$C$8, 3, FALSE)","v":"alilley@doe.mass.edu"},818,12683]
[255,"02080000","Norfolk","Public School District","Superintendent","Ingrid Allardi","70 Boardman Street",null,"Norfolk","MA","02056","Ellie Rounds-Bloom",{"$f":"VLOOKUP(L255, LiaisonList!$A$1:$C$8, 2, FALSE)","v":"781-338-3128"},{"$f":"VLOOKUP(L255, LiaisonList!$A$1:$C$8, 3, FALSE)","v":"erounds-bloom@doe.mass.edu"},23,892]
[256,"09150000","Norfolk County Agricultural","Public School District","Superintendent","Tammy Quinn","400 Main Street",null,"Walpole","MA","02081","Russ Fleming",{"$f":"VLOOKUP(L256, LiaisonList!$A$1:$C$8, 2, FALSE)","v":"781-338-6529"},{"$f":"VLOOKUP(L256, LiaisonList!$A$1:$C$8, 3, FALSE)","v":"RFleming@doe.mass.edu"},1,538]
[257,"02090000","North Adams","Public School District","Superintendent","Barbara Malkas","37 Main Street","Suite 200","North Adams","MA","01247","Aneesh Sahni",{"$f":"VLOOKUP(L257, LiaisonList!$A$1:$C$8, 2, FALSE)","v":"781-338-3532"},{"$f":"VLOOKUP(L257, LiaisonList!$A$1:$C$8, 3, FALSE)","v":"aneesh.sahni@doe.mass.edu"},11,1316]
[258,"02110000","North Andover","Public School District","Superintendent","Jennifer Price","566 Main Street",null,"North Andover","MA","01845","Russ Fleming",{"$f":"VLOOKUP(L258, LiaisonList!$A$1:$C$8, 2, FALSE)","v":"781-338-6529"},{"$f":"VLOOKUP(L258, LiaisonList!$A$1:$C$8, 3, FALSE)","v":"RFleming@doe.mass.edu"},104,4710]
[259,"02120000","North Attleborough","Public School District","Superintendent","Scott Holcomb","6 Morse Street",null,"No. Attleborough","MA","02760","Julia Foodman",{"$f":"VLOOKUP(L259, LiaisonList!$A$1:$C$8, 2, FALSE)","v":"781-338-3577"},{"$f":"VLOOKUP(L259, LiaisonList!$A$1:$C$8, 3, FALSE)","v":"jfoodman@doe.mass.edu"},118,4135]
[260,"02150000","North Brookfield","Public School District","Superintendent","Richard Lind","10 New School Drive",null,"North Brookfield","MA","01535","Alex Lilley",{"$f":"VLOOKUP(L260, LiaisonList!$A$1:$C$8, 2, FALSE)","v":"781-338-6212"},{"$f":"VLOOKUP(L260, LiaisonList!$A$1:$C$8, 3, FALSE)","v":"alilley@doe.mass.edu"},0,538]
[261,"07350000","North Middlesex","Public School District","Superintendent","Joan Landers","45 Main Street",null,"Pepperell","MA","01463","Alex Lilley",{"$f":"VLOOKUP(L261, LiaisonList!$A$1:$C$8, 2, FALSE)","v":"781-338-6212"},{"$f":"VLOOKUP(L261, LiaisonList!$A$1:$C$8, 3, FALSE)","v":"alilley@doe.mass.edu"},28,2985]
[262,"02170000","North Reading","Public School District","Superintendent","Jon Bernard","189 Park Street",null,"North Reading","MA","01864","Ellie Rounds-Bloom",{"$f":"VLOOKUP(L262, LiaisonList!$A$1:$C$8, 2, FALSE)","v":"781-338-3128"},{"$f":"VLOOKUP(L262, LiaisonList!$A$1:$C$8, 3, FALSE)","v":"erounds-bloom@doe.mass.edu"},19,2432]
[263,"02100000","Northampton","Public School District","Superintendent","John Provost","212 Main Street",null,"Northampton","MA","01060","Deb Walker",{"$f":"VLOOKUP(L263, LiaisonList!$A$1:$C$8, 2, FALSE)","v":"781-338-3127"},{"$f":"VLOOKUP(L263, LiaisonList!$A$1:$C$8, 3, FALSE)","v":"djwalker@doe.mass.edu"},91,2577]
[264,"04060000","Northampton-Smith Vocational Agricultural","Public School District","Superintendent","Andrew Linkenhoker","80 Locust Street",null,"Northampton","MA","01060","Julia Foodman",{"$f":"VLOOKUP(L264, LiaisonList!$A$1:$C$8, 2, FALSE)","v":"781-338-3577"},{"$f":"VLOOKUP(L264, LiaisonList!$A$1:$C$8, 3, FALSE)","v":"jfoodman@doe.mass.edu"},6,491]
[265,"07300000","Northboro-Southboro","Public School District","Superintendent","Christine Johnson","53 Parkerville Road",null,"Southborough","MA","01772","Beth O'Connell",{"$f":"VLOOKUP(L265, LiaisonList!$A$1:$C$8, 2, FALSE)","v":"781-338-3132"},{"$f":"VLOOKUP(L265, LiaisonList!$A$1:$C$8, 3, FALSE)","v":"EO'Connell@doe.mass.edu"},22,1461]
[266,"02130000","Northborough","Public School District","Superintendent","Christine Johnson","53 Parkerville Road",null,"Southborough","MA","01772","Beth O'Connell",{"$f":"VLOOKUP(L266, LiaisonList!$A$1:$C$8, 2, FALSE)","v":"781-338-3132"},{"$f":"VLOOKUP(L266, LiaisonList!$A$1:$C$8, 3, FALSE)","v":"EO'Connell@doe.mass.edu"},76,1641]
[267,"02140000","Northbridge","Public School District","Superintendent","Catherine Stickney","87 Linwood Avenue",null,"Whitinsville","MA","01588","Sue Mazzarella",{"$f":"VLOOKUP(L267, LiaisonList!$A$1:$C$8, 2, FALSE)","v":"781-338-3587"},{"$f":"VLOOKUP(L267, LiaisonList!$A$1:$C$8, 3, FALSE)","v":"smazzarella@doe.mass.edu"},58,2091]
[268,"08530000","Northeast Metropolitan Regional Vocational Technical","Public School District","Superintendent","David DiBarri","100 Hemlock Rd",null,"Wakefield","MA","01880","Ellie Rounds-Bloom",{"$f":"VLOOKUP(L268, LiaisonList!$A$1:$C$8, 2, FALSE)","v":"781-338-3128"},{"$f":"VLOOKUP(L268, LiaisonList!$A$1:$C$8, 3, FALSE)","v":"erounds-bloom@doe.mass.edu"},45,1231]
[269,"08510000","Northern Berkshire Regional Vocational Technical","Public School District","Superintendent","James Brosnan","70 Hodges Cross Rd",null,"North Adams","MA","01247","Sue Mazzarella",{"$f":"VLOOKUP(L269, LiaisonList!$A$1:$C$8, 2, FALSE)","v":"781-338-3587"},{"$f":"VLOOKUP(L269, LiaisonList!$A$1:$C$8, 3, FALSE)","v":"smazzarella@doe.mass.edu"},0,486]
[270,"02180000","Norton","Public School District","Superintendent","Joseph Baeta","64 West Main Street",null,"Norton","MA","02766","Aneesh Sahni",{"$f":"VLOOKUP(L270, LiaisonList!$A$1:$C$8, 2, FALSE)","v":"781-338-3532"},{"$f":"VLOOKUP(L270, LiaisonList!$A$1:$C$8, 3, FALSE)","v":"aneesh.sahni@doe.mass.edu"},26,2388]
[271,"02190000","Norwell","Public School District","Superintendent","Matthew Keegan","322 Main Street",null,"Norwell","MA","02061","Deb Walker",{"$f":"VLOOKUP(L271, LiaisonList!$A$1:$C$8, 2, FALSE)","v":"781-338-3127"},{"$f":"VLOOKUP(L271, LiaisonList!$A$1:$C$8, 3, FALSE)","v":"djwalker@doe.mass.edu"},1,2146]
[272,"02200000","Norwood","Public School District","Superintendent","David Thomson","275 Prospect Street","PO BOX 67","Norwood","MA","02062","Aneesh Sahni",{"$f":"VLOOKUP(L272, LiaisonList!$A$1:$C$8, 2, FALSE)","v":"781-338-3532"},{"$f":"VLOOKUP(L272, LiaisonList!$A$1:$C$8, 3, FALSE)","v":"aneesh.sahni@doe.mass.edu"},356,3304]
[273,"02210000","Oak Bluffs","Public School District","Superintendent","Matthew D'Andrea","4 Pine Street",null,"Vineyard Haven","MA","02568","Sue Mazzarella",{"$f":"VLOOKUP(L273, LiaisonList!$A$1:$C$8, 2, FALSE)","v":"781-338-3587"},{"$f":"VLOOKUP(L273, LiaisonList!$A$1:$C$8, 3, FALSE)","v":"smazzarella@doe.mass.edu"},74,403]
[274,"08550000","Old Colony Regional Vocational Technical","Public School District","Superintendent","Aaron Polansky","476 North Avenue",null,"Rochester","MA","02770","Aneesh Sahni",{"$f":"VLOOKUP(L274, LiaisonList!$A$1:$C$8, 2, FALSE)","v":"781-338-3532"},{"$f":"VLOOKUP(L274, LiaisonList!$A$1:$C$8, 3, FALSE)","v":"aneesh.sahni@doe.mass.edu"},1,531]
[275,"07400000","Old Rochester","Public School District","Superintendent","Douglas White","135 Marion Rd",null,"Mattapoisett","MA","02739","Aneesh Sahni",{"$f":"VLOOKUP(L275, LiaisonList!$A$1:$C$8, 2, FALSE)","v":"781-338-3532"},{"$f":"VLOOKUP(L275, LiaisonList!$A$1:$C$8, 3, FALSE)","v":"aneesh.sahni@doe.mass.edu"},0,1253]
[276,"35150000","Old Sturbridge Academy Charter Public School (District)","Charter District","Charter School Leader","Lisa DeTora","2 Old Sturbridge Village Road",null,"Sturbridge","MA","01566","Aneesh Sahni",{"$f":"VLOOKUP(L276, LiaisonList!$A$1:$C$8, 2, FALSE)","v":"781-338-3532"},{"$f":"VLOOKUP(L276, LiaisonList!$A$1:$C$8, 3, FALSE)","v":"aneesh.sahni@doe.mass.edu"},9,159]
[277,"02230000","Orange","Public School District","Superintendent","Tari Thomas","507 S. Main Street","P.O. Box 680","Orange","MA","01364","Julia Foodman",{"$f":"VLOOKUP(L277, LiaisonList!$A$1:$C$8, 2, FALSE)","v":"781-338-3577"},{"$f":"VLOOKUP(L277, LiaisonList!$A$1:$C$8, 3, FALSE)","v":"jfoodman@doe.mass.edu"},7,531]
[278,"02240000","Orleans","Public School District","Superintendent","Thomas Conrad","78 Eldredge Pkwy",null,"Orleans","MA","02653","Julia Foodman",{"$f":"VLOOKUP(L278, LiaisonList!$A$1:$C$8, 2, FALSE)","v":"781-338-3577"},{"$f":"VLOOKUP(L278, LiaisonList!$A$1:$C$8, 3, FALSE)","v":"jfoodman@doe.mass.edu"},17,228]
[279,"02260000","Oxford","Public School District","Superintendent","Kristine Nash","4 Maple Road",null,"Oxford","MA","01540","Alex Lilley",{"$f":"VLOOKUP(L279, LiaisonList!$A$1:$C$8, 2, FALSE)","v":"781-338-6212"},{"$f":"VLOOKUP(L279, LiaisonList!$A$1:$C$8, 3, FALSE)","v":"alilley@doe.mass.edu"},6,1632]
[280,"02270000","Palmer","Public School District","Superintendent","Patricia Gardner","24 Converse Street","c/o Suite 1","Palmer","MA","01069","Ellie Rounds-Bloom",{"$f":"VLOOKUP(L280, LiaisonList!$A$1:$C$8, 2, FALSE)","v":"781-338-3128"},{"$f":"VLOOKUP(L280, LiaisonList!$A$1:$C$8, 3, FALSE)","v":"erounds-bloom@doe.mass.edu"},34,1368]
[281,"08600000","Pathfinder Regional Vocational Technical","Public School District","Superintendent","Gerald Paist","240 Sykes Street",null,"Palmer","MA","01069","Deb Walker",{"$f":"VLOOKUP(L281, LiaisonList!$A$1:$C$8, 2, FALSE)","v":"781-338-3127"},{"$f":"VLOOKUP(L281, LiaisonList!$A$1:$C$8, 3, FALSE)","v":"djwalker@doe.mass.edu"},0,620]
[282,"35010000","Paulo Freire Social Justice Charter School (District)","Charter District","Charter School Leader","Isabelina Rodriguez","161 Lower Westfield ROad",null,"Holyoke","MA","01040","Julia Foodman",{"$f":"VLOOKUP(L282, LiaisonList!$A$1:$C$8, 2, FALSE)","v":"781-338-3577"},{"$f":"VLOOKUP(L282, LiaisonList!$A$1:$C$8, 3, FALSE)","v":"jfoodman@doe.mass.edu"},42,299]
[283,"02290000","Peabody","Public School District","Superintendent","Herbert Levine","27 Lowell Street",null,"Peabody","MA","01960","Sue Mazzarella",{"$f":"VLOOKUP(L283, LiaisonList!$A$1:$C$8, 2, FALSE)","v":"781-338-3587"},{"$f":"VLOOKUP(L283, LiaisonList!$A$1:$C$8, 3, FALSE)","v":"smazzarella@doe.mass.edu"},436,5655]
[284,"02300000","Pelham","Public School District","Superintendent","Michael Morris","170 Chestnut Street","Business Office","Amherst","MA","01002","Ellie Rounds-Bloom",{"$f":"VLOOKUP(L284, LiaisonList!$A$1:$C$8, 2, FALSE)","v":"781-338-3128"},{"$f":"VLOOKUP(L284, LiaisonList!$A$1:$C$8, 3, FALSE)","v":"erounds-bloom@doe.mass.edu"},1,127]
[285,"02310000","Pembroke","Public School District","Superintendent","Erin Obey","72 Pilgrim Road","Office of the Superintendent","Pembroke","MA","02359","Russ Fleming",{"$f":"VLOOKUP(L285, LiaisonList!$A$1:$C$8, 2, FALSE)","v":"781-338-6529"},{"$f":"VLOOKUP(L285, LiaisonList!$A$1:$C$8, 3, FALSE)","v":"RFleming@doe.mass.edu"},16,2808]
[286,"07450000","Pentucket","Public School District","Superintendent","Jeffrey Mulqueen","22 Main Street",null,"West Newbury","MA","01985","Aneesh Sahni",{"$f":"VLOOKUP(L286, LiaisonList!$A$1:$C$8, 2, FALSE)","v":"781-338-3532"},{"$f":"VLOOKUP(L286, LiaisonList!$A$1:$C$8, 3, FALSE)","v":"aneesh.sahni@doe.mass.edu"},4,2383]
[287,"02340000","Petersham","Public School District","Superintendent","Tari Thomas","P O Box 148",null,"Petersham","MA","01366","Julia Foodman",{"$f":"VLOOKUP(L287, LiaisonList!$A$1:$C$8, 2, FALSE)","v":"781-338-3577"},{"$f":"VLOOKUP(L287, LiaisonList!$A$1:$C$8, 3, FALSE)","v":"jfoodman@doe.mass.edu"},1,114]
[288,"35180000","Phoenix Academy Public Charter High School Lawrence (District)","Charter District","Charter School Leader","Beth Anderson","15 Union Street",null,"Lawrence","MA","01840","Ellie Rounds-Bloom",{"$f":"VLOOKUP(L288, LiaisonList!$A$1:$C$8, 2, FALSE)","v":"781-338-3128"},{"$f":"VLOOKUP(L288, LiaisonList!$A$1:$C$8, 3, FALSE)","v":"erounds-bloom@doe.mass.edu"},{"$error":"#N/A"},{"$error":"#N/A"}]
[289,"35080000","Phoenix Academy Public Charter High School Springfield (District)","Charter District","Charter School Leader","Beth Anderson","65 Lincoln Street",null,"Springfield","MA","01105","Ellie Rounds-Bloom",{"$f":"VLOOKUP(L289, LiaisonList!$A$1:$C$8, 2, FALSE)","v":"781-338-3128"},{"$f":"VLOOKUP(L289, LiaisonList!$A$1:$C$8, 3, FALSE)","v":"erounds-bloom@doe.mass.edu"},30,196]
[290,"04930000","Phoenix Charter Academy (District)","Charter District","Charter School Leader","Beth Anderson","175 Hawthorne Street",null,"Chelsea","MA","02150","Ellie Rounds-Bloom",{"$f":"VLOOKUP(L290, LiaisonList!$A$1:$C$8, 2, FALSE)","v":"781-338-3128"},{"$f":"VLOOKUP(L290, LiaisonList!$A$1:$C$8, 3, FALSE)","v":"erounds-bloom@doe.mass.edu"},117,192]
[291,"04940000","Pioneer Charter School of Science (District)","Charter District","Charter School Leader","Barish Icin","51-59 Summer Street",null,"Everett","MA","02149","Aneesh Sahni",{"$f":"VLOOKUP(L291, LiaisonList!$A$1:$C$8, 2, FALSE)","v":"781-338-3532"},{"$f":"VLOOKUP(L291, LiaisonList!$A$1:$C$8, 3, FALSE)","v":"aneesh.sahni@doe.mass.edu"},180,663]
[292,"35060000","Pioneer Charter School of Science II (PCSS-II) (District)","Charter District","Charter School Leader","Barish Icin","97 Main Street",null,"Saugus","MA","01906","Aneesh Sahni",{"$f":"VLOOKUP(L292, LiaisonList!$A$1:$C$8, 2, FALSE)","v":"781-338-3532"},{"$f":"VLOOKUP(L292, LiaisonList!$A$1:$C$8, 3, FALSE)","v":"aneesh.sahni@doe.mass.edu"},78,356]
[293,"07500000","Pioneer Valley","Public School District","Superintendent","Ruth Miller","97 F Sumner Turner Road",null,"Northfield","MA","01360","Deb Walker",{"$f":"VLOOKUP(L293, LiaisonList!$A$1:$C$8, 2, FALSE)","v":"781-338-3127"},{"$f":"VLOOKUP(L293, LiaisonList!$A$1:$C$8, 3, FALSE)","v":"djwalker@doe.mass.edu"},2,759]
[294,"04970000","Pioneer Valley Chinese Immersion Charter (District)","Charter District","Charter School Leader","Kathleen Wang","317 Russell Street",null,"Hadley","MA","01035","Beth O'Connell",{"$f":"VLOOKUP(L294, LiaisonList!$A$1:$C$8, 2, FALSE)","v":"781-338-3132"},{"$f":"VLOOKUP(L294, LiaisonList!$A$1:$C$8, 3, FALSE)","v":"EO'Connell@doe.mass.edu"},14,494]
[295,"04790000","Pioneer Valley Performing Arts Charter Public (District)","Charter District","Charter School Leader","Marc Kenen","15 Mulligan Drive",null,"South Hadley","MA","01075","Beth O'Connell",{"$f":"VLOOKUP(L295, LiaisonList!$A$1:$C$8, 2, FALSE)","v":"781-338-3132"},{"$f":"VLOOKUP(L295, LiaisonList!$A$1:$C$8, 3, FALSE)","v":"EO'Connell@doe.mass.edu"},2,400]
[296,"02360000","Pittsfield","Public School District","Superintendent","Jason Mccandless","269 First Street",null,"Pittsfield","MA","01201","Beth O'Connell",{"$f":"VLOOKUP(L296, LiaisonList!$A$1:$C$8, 2, FALSE)","v":"781-338-3132"},{"$f":"VLOOKUP(L296, LiaisonList!$A$1:$C$8, 3, FALSE)","v":"EO'Connell@doe.mass.edu"},215,5333]
[297,"02380000","Plainville","Public School District","Superintendent","David Raiche","68 Messenger Street",null,"Plainville","MA","02762","Sue Mazzarella",{"$f":"VLOOKUP(L297, LiaisonList!$A$1:$C$8, 2, FALSE)","v":"781-338-3587"},{"$f":"VLOOKUP(L297, LiaisonList!$A$1:$C$8, 3, FALSE)","v":"smazzarella@doe.mass.edu"},24,654]
[298,"02390000","Plymouth","Public School District","Superintendent","Gary Maestas","253 South Meadow Rd",null,"Plymouth","MA","02360","Sue Mazzarella",{"$f":"VLOOKUP(L298, LiaisonList!$A$1:$C$8, 2, FALSE)","v":"781-338-3587"},{"$f":"VLOOKUP(L298, LiaisonList!$A$1:$C$8, 3, FALSE)","v":"smazzarella@doe.mass.edu"},91,7364]
[299,"02400000","Plympton","Public School District","Superintendent","Joy Blackwood","250 Pembroke Street",null,"Kingston","MA","02364","Deb Walker",{"$f":"VLOOKUP(L299, LiaisonList!$A$1:$C$8, 2, FALSE)","v":"781-338-3127"},{"$f":"VLOOKUP(L299, LiaisonList!$A$1:$C$8, 3, FALSE)","v":"djwalker@doe.mass.edu"},0,204]
[300,"04870000","Prospect Hill Academy Charter (District)","Charter District","Charter School Leader","Angela Allen","50 Essex Street",null,"Cambridge","MA","02139","Alex Lilley",{"$f":"VLOOKUP(L300, LiaisonList!$A$1:$C$8, 2, FALSE)","v":"781-338-6212"},{"$f":"VLOOKUP(L300, LiaisonList!$A$1:$C$8, 3, FALSE)","v":"alilley@doe.mass.edu"},127,1154]
[301,"02420000","Provincetown","Public School District","Superintendent","Beth Singer","12 Winslow Street",null,"Provincetown","MA","02657","Aneesh Sahni",{"$f":"VLOOKUP(L301, LiaisonList!$A$1:$C$8, 2, FALSE)","v":"781-338-3532"},{"$f":"VLOOKUP(L301, LiaisonList!$A$1:$C$8, 3, FALSE)","v":"aneesh.sahni@doe.mass.edu"},23,104]
[302,"07530000","Quabbin","Public School District","Superintendent","Maureen Marshall","872 South Street",null,"Barre","MA","01005","Russ Fleming",{"$f":"VLOOKUP(L302, LiaisonList!$A$1:$C$8, 2, FALSE)","v":"781-338-6529"},{"$f":"VLOOKUP(L302, LiaisonList!$A$1:$C$8, 3, FALSE)","v":"RFleming@doe.mass.edu"},3,2144]
[303,"07780000","Quaboag Regional","Public School District","Superintendent","Brett Kustigian","284 Old West Brookfield Road","PO Box 1538","Warren","MA","01083","Sue Mazzarella",{"$f":"VLOOKUP(L303, LiaisonList!$A$1:$C$8, 2, FALSE)","v":"781-338-3587"},{"$f":"VLOOKUP(L303, LiaisonList!$A$1:$C$8, 3, FALSE)","v":"smazzarella@doe.mass.edu"},21,1264]
[304,"02430000","Quincy","Public School District","Superintendent","Richard Decristofaro","34 Coddington Street",null,"Quincy","MA","02169","Deb Walker",{"$f":"VLOOKUP(L304, LiaisonList!$A$1:$C$8, 2, FALSE)","v":"781-338-3127"},{"$f":"VLOOKUP(L304, LiaisonList!$A$1:$C$8, 3, FALSE)","v":"djwalker@doe.mass.edu"},1544,9048]
[305,"07550000","Ralph C Mahar","Public School District","Superintendent","Tari Thomas","507 South Main Street",null,"Orange","MA","01364","Julia Foodman",{"$f":"VLOOKUP(L305, LiaisonList!$A$1:$C$8, 2, FALSE)","v":"781-338-3577"},{"$f":"VLOOKUP(L305, LiaisonList!$A$1:$C$8, 3, FALSE)","v":"jfoodman@doe.mass.edu"},7,785]
[306,"02440000","Randolph","Public School District","Superintendent","Thomas Anderson","40 Highland Avenue",null,"Randolph","MA","02368","Russ Fleming",{"$f":"VLOOKUP(L306, LiaisonList!$A$1:$C$8, 2, FALSE)","v":"781-338-6529"},{"$f":"VLOOKUP(L306, LiaisonList!$A$1:$C$8, 3, FALSE)","v":"RFleming@doe.mass.edu"},464,2759]
[307,"02460000","Reading","Public School District","Superintendent","John Doherty","82 Oakland Road",null,"Reading","MA","01867","Julia Foodman",{"$f":"VLOOKUP(L307, LiaisonList!$A$1:$C$8, 2, FALSE)","v":"781-338-3577"},{"$f":"VLOOKUP(L307, LiaisonList!$A$1:$C$8, 3, FALSE)","v":"jfoodman@doe.mass.edu"},42,4106]
[308,"02480000","Revere","Public School District","Superintendent","Dianne Kelly","101 School Street",null,"Revere","MA","02151","Beth O'Connell",{"$f":"VLOOKUP(L308, LiaisonList!$A$1:$C$8, 2, FALSE)","v":"781-338-3132"},{"$f":"VLOOKUP(L308, LiaisonList!$A$1:$C$8, 3, FALSE)","v":"EO'Connell@doe.mass.edu"},1635,7371]
[309,"02490000","Richmond","Public School District","Superintendent","Peter Dillon","1831 State Road",null,"Richmond","MA","01254","Julia Foodman",{"$f":"VLOOKUP(L309, LiaisonList!$A$1:$C$8, 2, FALSE)","v":"781-338-3577"},{"$f":"VLOOKUP(L309, LiaisonList!$A$1:$C$8, 3, FALSE)","v":"jfoodman@doe.mass.edu"},0,164]
[310,"04830000","Rising Tide Charter Public (District)","Charter District","Charter School Leader","Jill Crafts","59 Armstrong Road",null,"Plymouth","MA","02360","Aneesh Sahni",{"$f":"VLOOKUP(L310, LiaisonList!$A$1:$C$8, 2, FALSE)","v":"781-338-3532"},{"$f":"VLOOKUP(L310, LiaisonList!$A$1:$C$8, 3, FALSE)","v":"aneesh.sahni@doe.mass.edu"},0,658]
[311,"04820000","River Valley Charter (District)","Charter District","Charter School Leader","Andrew Willemsen","2 Perry Way",null,"Newburyport","MA","01950","Ellie Rounds-Bloom",{"$f":"VLOOKUP(L311, LiaisonList!$A$1:$C$8, 2, FALSE)","v":"781-338-3128"},{"$f":"VLOOKUP(L311, LiaisonList!$A$1:$C$8, 3, FALSE)","v":"erounds-bloom@doe.mass.edu"},0,288]
[312,"02500000","Rochester","Public School District","Superintendent","Douglas White","135 Marion Rd",null,"Mattapoisett","MA","02739","Aneesh Sahni",{"$f":"VLOOKUP(L312, LiaisonList!$A$1:$C$8, 2, FALSE)","v":"781-338-3532"},{"$f":"VLOOKUP(L312, LiaisonList!$A$1:$C$8, 3, FALSE)","v":"aneesh.sahni@doe.mass.edu"},2,476]
[313,"02510000","Rockland","Public School District","Superintendent","Alan Cron","34 MacKinlay Way",null,"Rockland","MA","02370","Ellie Rounds-Bloom",{"$f":"VLOOKUP(L313, LiaisonList!$A$1:$C$8, 2, FALSE)","v":"781-338-3128"},{"$f":"VLOOKUP(L313, LiaisonList!$A$1:$C$8, 3, FALSE)","v":"erounds-bloom@doe.mass.edu"},124,2138]
[314,"02520000","Rockport","Public School District","Superintendent","Robert Liebow","24 Jerdens Lane",null,"Rockport","MA","01966","Aneesh Sahni",{"$f":"VLOOKUP(L314, LiaisonList!$A$1:$C$8, 2, FALSE)","v":"781-338-3532"},{"$f":"VLOOKUP(L314, LiaisonList!$A$1:$C$8, 3, FALSE)","v":"aneesh.sahni@doe.mass.edu"},10,890]
[315,"02530000","Rowe","Public School District","Superintendent","Jon Lev","86 Pond Road",null,"Rowe","MA","01367","Sue Mazzarella",{"$f":"VLOOKUP(L315, LiaisonList!$A$1:$C$8, 2, FALSE)","v":"781-338-3587"},{"$f":"VLOOKUP(L315, LiaisonList!$A$1:$C$8, 3, FALSE)","v":"smazzarella@doe.mass.edu"},0,56]
[316,"04840000","Roxbury Preparatory Charter (District)","Charter District","Charter School Leader","Anna Hall","120 Fisher Avenue",null,"Roxbury","MA","02120","Deb Walker",{"$f":"VLOOKUP(L316, LiaisonList!$A$1:$C$8, 2, FALSE)","v":"781-338-3127"},{"$f":"VLOOKUP(L316, LiaisonList!$A$1:$C$8, 3, FALSE)","v":"djwalker@doe.mass.edu"},288,1396]
[317,"04410000","Sabis International Charter (District)","Charter District","Charter School Leader","Karen Reuter","160 Joan Street",null,"Springfield","MA","01129","Alex Lilley",{"$f":"VLOOKUP(L317, LiaisonList!$A$1:$C$8, 2, FALSE)","v":"781-338-6212"},{"$f":"VLOOKUP(L317, LiaisonList!$A$1:$C$8, 3, FALSE)","v":"alilley@doe.mass.edu"},91,1574]
[318,"02580000","Salem","Public School District","Superintendent","Margarita Ruiz","29 Highland Avenue",null,"Salem","MA","01970","Aneesh Sahni",{"$f":"VLOOKUP(L318, LiaisonList!$A$1:$C$8, 2, FALSE)","v":"781-338-3532"},{"$f":"VLOOKUP(L318, LiaisonList!$A$1:$C$8, 3, FALSE)","v":"aneesh.sahni@doe.mass.edu"},488,3646]
[319,"04850000","Salem Academy Charter (District)","Charter District","Charter School Leader","Kathy Egmont","45 Congress Street","c/o Shetland Pk","Salem","MA","01970","Aneesh Sahni",{"$f":"VLOOKUP(L319, LiaisonList!$A$1:$C$8, 2, FALSE)","v":"781-338-3532"},{"$f":"VLOOKUP(L319, LiaisonList!$A$1:$C$8, 3, FALSE)","v":"aneesh.sahni@doe.mass.edu"},20,473]
[320,"02610000","Sandwich","Public School District","Superintendent","Pamela Gould","33 Water Street",null,"Sandwich","MA","02563","Julia Foodman",{"$f":"VLOOKUP(L320, LiaisonList!$A$1:$C$8, 2, FALSE)","v":"781-338-3577"},{"$f":"VLOOKUP(L320, LiaisonList!$A$1:$C$8, 3, FALSE)","v":"jfoodman@doe.mass.edu"},31,2529]
[321,"02620000","Saugus","Public School District","Superintendent","David DeRuosi","23 Main Street",null,"Saugus","MA","01906","Beth O'Connell",{"$f":"VLOOKUP(L321, LiaisonList!$A$1:$C$8, 2, FALSE)","v":"781-338-3132"},{"$f":"VLOOKUP(L321, LiaisonList!$A$1:$C$8, 3, FALSE)","v":"EO'Connell@doe.mass.edu"},156,2515]
[322,"02630000","Savoy","Public School District","Superintendent","Jon Lev","26 Chapel Road",null,"Savoy","MA","01256","Sue Mazzarella",{"$f":"VLOOKUP(L322, LiaisonList!$A$1:$C$8, 2, FALSE)","v":"781-338-3587"},{"$f":"VLOOKUP(L322, LiaisonList!$A$1:$C$8, 3, FALSE)","v":"smazzarella@doe.mass.edu"},0,48]
[323,"02640000","Scituate","Public School District","Superintendent","Ronald Griffin","606 C J Cushing Hwy",null,"Scituate","MA","02066","Alex Lilley",{"$f":"VLOOKUP(L323, LiaisonList!$A$1:$C$8, 2, FALSE)","v":"781-338-6212"},{"$f":"VLOOKUP(L323, LiaisonList!$A$1:$C$8, 3, FALSE)","v":"alilley@doe.mass.edu"},18,2899]
[324,"02650000","Seekonk","Public School District","Superintendent","Arlene Bosco","25 Water Lane",null,"Seekonk","MA","02771","Ellie Rounds-Bloom",{"$f":"VLOOKUP(L324, LiaisonList!$A$1:$C$8, 2, FALSE)","v":"781-338-3128"},{"$f":"VLOOKUP(L324, LiaisonList!$A$1:$C$8, 3, FALSE)","v":"erounds-bloom@doe.mass.edu"},69,1977]
[325,"04860000","Seven Hills Charter Public (District)","Charter District","Charter School Leader","Leo Flanagan","51 Gage Street",null,"Worcester","MA","01605","Julia Foodman",{"$f":"VLOOKUP(L325, LiaisonList!$A$1:$C$8, 2, FALSE)","v":"781-338-3577"},{"$f":"VLOOKUP(L325, LiaisonList!$A$1:$C$8, 3, FALSE)","v":"jfoodman@doe.mass.edu"},192,660]
[326,"02660000","Sharon","Public School District","Superintendent","Victoria Greer","75 Mountain Street",null,"Sharon","MA","02067","Aneesh Sahni",{"$f":"VLOOKUP(L326, LiaisonList!$A$1:$C$8, 2, FALSE)","v":"781-338-3532"},{"$f":"VLOOKUP(L326, LiaisonList!$A$1:$C$8, 3, FALSE)","v":"aneesh.sahni@doe.mass.edu"},154,3491]
[327,"08710000","Shawsheen Valley Regional Vocational Technical","Public School District","Superintendent","Timothy Broadrick","100 Cook Street",null,"Billerica","MA","01821","Russ Fleming",{"$f":"VLOOKUP(L327, LiaisonList!$A$1:$C$8, 2, FALSE)","v":"781-338-6529"},{"$f":"VLOOKUP(L327, LiaisonList!$A$1:$C$8, 3, FALSE)","v":"RFleming@doe.mass.edu"},0,1311]
[328,"02690000","Sherborn","Public School District","Superintendent","Andrew Keough","157 Farm Street",null,"Dover","MA","02030","Beth O'Connell",{"$f":"VLOOKUP(L328, LiaisonList!$A$1:$C$8, 2, FALSE)","v":"781-338-3132"},{"$f":"VLOOKUP(L328, LiaisonList!$A$1:$C$8, 3, FALSE)","v":"EO'Connell@doe.mass.edu"},7,391]
[329,"02710000","Shrewsbury","Public School District","Superintendent","Joseph Sawyer","100 Maple Avenue",null,"Shrewsbury","MA","01545","Russ Fleming",{"$f":"VLOOKUP(L329, LiaisonList!$A$1:$C$8, 2, FALSE)","v":"781-338-6529"},{"$f":"VLOOKUP(L329, LiaisonList!$A$1:$C$8, 3, FALSE)","v":"RFleming@doe.mass.edu"},197,5971]
[330,"02720000","Shutesbury","Public School District","Superintendent","Jennifer Haggerty","18 Pleasant Street",null,"Erving","MA","01344","Deb Walker",{"$f":"VLOOKUP(L330, LiaisonList!$A$1:$C$8, 2, FALSE)","v":"781-338-3127"},{"$f":"VLOOKUP(L330, LiaisonList!$A$1:$C$8, 3, FALSE)","v":"djwalker@doe.mass.edu"},0,108]
[331,"04770000","Silver Hill Horace Mann Charter (District)","Charter District","Charter School Leader","Margaret Shepherd","675 Washington Street",null,"Haverhill","MA","01832","Russ Fleming",{"$f":"VLOOKUP(L331, LiaisonList!$A$1:$C$8, 2, FALSE)","v":"781-338-6529"},{"$f":"VLOOKUP(L331, LiaisonList!$A$1:$C$8, 3, FALSE)","v":"RFleming@doe.mass.edu"},42,557]
[332,"07600000","Silver Lake","Public School District","Superintendent","Joy Blackwood","250 Pembroke Street",null,"Kingston","MA","02364","Deb Walker",{"$f":"VLOOKUP(L332, LiaisonList!$A$1:$C$8, 2, FALSE)","v":"781-338-3127"},{"$f":"VLOOKUP(L332, LiaisonList!$A$1:$C$8, 3, FALSE)","v":"djwalker@doe.mass.edu"},5,1737]
[333,"04740000","Sizer School: A North Central Charter Essential (District)","Charter District","Charter School Leader","Courtney Harter","500 Rindge Road",null,"Fitchburg","MA","01420","Deb Walker",{"$f":"VLOOKUP(L333, LiaisonList!$A$1:$C$8, 2, FALSE)","v":"781-338-3127"},{"$f":"VLOOKUP(L333, LiaisonList!$A$1:$C$8, 3, FALSE)","v":"djwalker@doe.mass.edu"},4,348]
[334,"02730000","Somerset","Public School District","Superintendent","Jeffrey Schoonover","580 Whetstone Hill Road",null,"Somerset","MA","02726","Russ Fleming",{"$f":"VLOOKUP(L334, LiaisonList!$A$1:$C$8, 2, FALSE)","v":"781-338-6529"},{"$f":"VLOOKUP(L334, LiaisonList!$A$1:$C$8, 3, FALSE)","v":"RFleming@doe.mass.edu"},19,1717]
[335,"07630000","Somerset Berkley Regional School District","Public School District","Superintendent","Jeffrey Schoonover","580 Whetstone Hill",null,"Somerset","MA","02726","Russ Fleming",{"$f":"VLOOKUP(L335, LiaisonList!$A$1:$C$8, 2, FALSE)","v":"781-338-6529"},{"$f":"VLOOKUP(L335, LiaisonList!$A$1:$C$8, 3, FALSE)","v":"RFleming@doe.mass.edu"},1,1002]
[336,"02740000","Somerville","Public School District","Superintendent","Mary Skipper","8 Bonair Street",null,"Somerville","MA","02145","Aneesh Sahni",{"$f":"VLOOKUP(L336, LiaisonList!$A$1:$C$8, 2, FALSE)","v":"781-338-3532"},{"$f":"VLOOKUP(L336, LiaisonList!$A$1:$C$8, 3, FALSE)","v":"aneesh.sahni@doe.mass.edu"},896,4544]
[337,"02780000","South Hadley","Public School District","Superintendent","Nicholas Young","116 Main Street",null,"South Hadley","MA","01075","Deb Walker",{"$f":"VLOOKUP(L337, LiaisonList!$A$1:$C$8, 2, FALSE)","v":"781-338-3127"},{"$f":"VLOOKUP(L337, LiaisonList!$A$1:$C$8, 3, FALSE)","v":"djwalker@doe.mass.edu"},74,1835]
[338,"08290000","South Middlesex Regional Vocational Technical","Public School District","Superintendent","Jonathan Evans","750 Winter Street",null,"Framingham","MA","01702","Russ Fleming",{"$f":"VLOOKUP(L338, LiaisonList!$A$1:$C$8, 2, FALSE)","v":"781-338-6529"},{"$f":"VLOOKUP(L338, LiaisonList!$A$1:$C$8, 3, FALSE)","v":"RFleming@doe.mass.edu"},69,720]
[339,"04880000","South Shore Charter Public (District)","Charter District","Charter School Leader","Alicia Savage","100 Longwater Circle",null,"Norwell","MA","02061","Sue Mazzarella",{"$f":"VLOOKUP(L339, LiaisonList!$A$1:$C$8, 2, FALSE)","v":"781-338-3587"},{"$f":"VLOOKUP(L339, LiaisonList!$A$1:$C$8, 3, FALSE)","v":"smazzarella@doe.mass.edu"},129,920]
[340,"08730000","South Shore Regional Vocational Technical","Public School District","Superintendent","Thomas Hickey","476 Webster Street",null,"Hanover","MA","02339","Beth O'Connell",{"$f":"VLOOKUP(L340, LiaisonList!$A$1:$C$8, 2, FALSE)","v":"781-338-3132"},{"$f":"VLOOKUP(L340, LiaisonList!$A$1:$C$8, 3, FALSE)","v":"EO'Connell@doe.mass.edu"},0,636]
[341,"02750000","Southampton","Public School District","Superintendent","Craig Jurgensen","19 Stage Rd",null,"Westhampton","MA","01027","Deb Walker",{"$f":"VLOOKUP(L341, LiaisonList!$A$1:$C$8, 2, FALSE)","v":"781-338-3127"},{"$f":"VLOOKUP(L341, LiaisonList!$A$1:$C$8, 3, FALSE)","v":"djwalker@doe.mass.edu"},11,475]
[342,"02760000","Southborough","Public School District","Superintendent","Christine Johnson","53 Parkerville Road",null,"Southborough","MA","01772","Beth O'Connell",{"$f":"VLOOKUP(L342, LiaisonList!$A$1:$C$8, 2, FALSE)","v":"781-338-3132"},{"$f":"VLOOKUP(L342, LiaisonList!$A$1:$C$8, 3, FALSE)","v":"EO'Connell@doe.mass.edu"},76,1238]
[343,"02770000","Southbridge","Public School District","Superintendent","Jeffrey Villar","25 Cole Avenue",null,"Southbridge","MA","01550","Ellie Rounds-Bloom",{"$f":"VLOOKUP(L343, LiaisonList!$A$1:$C$8, 2, FALSE)","v":"781-338-3128"},{"$f":"VLOOKUP(L343, LiaisonList!$A$1:$C$8, 3, FALSE)","v":"erounds-bloom@doe.mass.edu"},531,2014]
[344,"08720000","Southeastern Regional Vocational Technical","Public School District","Superintendent","Luis Lopes","250 Foundry Street",null,"South Easton","MA","02375","Julia Foodman",{"$f":"VLOOKUP(L344, LiaisonList!$A$1:$C$8, 2, FALSE)","v":"781-338-3577"},{"$f":"VLOOKUP(L344, LiaisonList!$A$1:$C$8, 3, FALSE)","v":"jfoodman@doe.mass.edu"},15,1409]
[345,"07650000","Southern Berkshire","Public School District","Superintendent","Beth Regulbuto","PO BOX 339",null,"Sheffield","MA","01257","Alex Lilley",{"$f":"VLOOKUP(L345, LiaisonList!$A$1:$C$8, 2, FALSE)","v":"781-338-6212"},{"$f":"VLOOKUP(L345, LiaisonList!$A$1:$C$8, 3, FALSE)","v":"alilley@doe.mass.edu"},11,646]
[346,"08760000","Southern Worcester County Regional Vocational Technical","Public School District","Superintendent","John LaFleche","57 Old Muggett Hill Road",null,"Charlton","MA","01507","Sue Mazzarella",{"$f":"VLOOKUP(L346, LiaisonList!$A$1:$C$8, 2, FALSE)","v":"781-338-3587"},{"$f":"VLOOKUP(L346, LiaisonList!$A$1:$C$8, 3, FALSE)","v":"smazzarella@doe.mass.edu"},2,1103]
[347,"07660000","Southwick-Tolland-Granville Regional School District","Public School District","Superintendent","Jennifer Willard","86 Powder Mill Road",null,"Southwick","MA","01077","Ellie Rounds-Bloom",{"$f":"VLOOKUP(L347, LiaisonList!$A$1:$C$8, 2, FALSE)","v":"781-338-3128"},{"$f":"VLOOKUP(L347, LiaisonList!$A$1:$C$8, 3, FALSE)","v":"erounds-bloom@doe.mass.edu"},39,1458]
[348,"07670000","Spencer-E Brookfield","Public School District","Superintendent","Jodi Bourassa","306 Main Street",null,"Spencer","MA","01562","Aneesh Sahni",{"$f":"VLOOKUP(L348, LiaisonList!$A$1:$C$8, 2, FALSE)","v":"781-338-3532"},{"$f":"VLOOKUP(L348, LiaisonList!$A$1:$C$8, 3, FALSE)","v":"aneesh.sahni@doe.mass.edu"},39,1337]
[349,"02810000","Springfield","Public School District","Superintendent","Daniel Warwick","1550 Main Street",null,"Springfield","MA","01103","Alex Lilley",{"$f":"VLOOKUP(L349, LiaisonList!$A$1:$C$8, 2, FALSE)","v":"781-338-6212"},{"$f":"VLOOKUP(L349, LiaisonList!$A$1:$C$8, 3, FALSE)","v":"alilley@doe.mass.edu"},4340,24371]
[350,"35100000","Springfield Preparatory Charter School (District)","Charter District","Charter School Leader","Bill Spirer","370 Pine St.",null,"Springfield","MA","01105","Beth O'Connell",{"$f":"VLOOKUP(L350, LiaisonList!$A$1:$C$8, 2, FALSE)","v":"781-338-3132"},{"$f":"VLOOKUP(L350, LiaisonList!$A$1:$C$8, 3, FALSE)","v":"EO'Connell@doe.mass.edu"},49,213]
[351,"02840000","Stoneham","Public School District","Superintendent","John Macero","149 Franklin Street",null,"Stoneham","MA","02180","Julia Foodman",{"$f":"VLOOKUP(L351, LiaisonList!$A$1:$C$8, 2, FALSE)","v":"781-338-3577"},{"$f":"VLOOKUP(L351, LiaisonList!$A$1:$C$8, 3, FALSE)","v":"jfoodman@doe.mass.edu"},80,2253]
[352,"02850000","Stoughton","Public School District","Superintendent","Marguerite Rizzi","232 Pearl Street",null,"Stoughton","MA","02072","Beth O'Connell",{"$f":"VLOOKUP(L352, LiaisonList!$A$1:$C$8, 2, FALSE)","v":"781-338-3132"},{"$f":"VLOOKUP(L352, LiaisonList!$A$1:$C$8, 3, FALSE)","v":"EO'Connell@doe.mass.edu"},239,3456]
[353,"02870000","Sturbridge","Public School District","Superintendent","Erin Nosek","320 Brookfield Rd",null,"Fiskdale","MA","01518","Russ Fleming",{"$f":"VLOOKUP(L353, LiaisonList!$A$1:$C$8, 2, FALSE)","v":"781-338-6529"},{"$f":"VLOOKUP(L353, LiaisonList!$A$1:$C$8, 3, FALSE)","v":"RFleming@doe.mass.edu"},3,833]
[354,"04890000","Sturgis Charter Public (District)","Charter District","Charter School Leader","Paul Marble","427 Main Street",null,"Hyannis","MA","02601","Alex Lilley",{"$f":"VLOOKUP(L354, LiaisonList!$A$1:$C$8, 2, FALSE)","v":"781-338-6212"},{"$f":"VLOOKUP(L354, LiaisonList!$A$1:$C$8, 3, FALSE)","v":"alilley@doe.mass.edu"},1,822]
[355,"02880000","Sudbury","Public School District","Superintendent","Anne Wilson","40 Fairbank Road",null,"Sudbury","MA","01776","Alex Lilley",{"$f":"VLOOKUP(L355, LiaisonList!$A$1:$C$8, 2, FALSE)","v":"781-338-6212"},{"$f":"VLOOKUP(L355, LiaisonList!$A$1:$C$8, 3, FALSE)","v":"alilley@doe.mass.edu"},44,2650]
[356,"02890000","Sunderland","Public School District","Superintendent","Lynn Carey","113 North Main Street, Office C101",null,"South Deerfield","MA","01373","Alex Lilley",{"$f":"VLOOKUP(L356, LiaisonList!$A$1:$C$8, 2, FALSE)","v":"781-338-6212"},{"$f":"VLOOKUP(L356, LiaisonList!$A$1:$C$8, 3, FALSE)","v":"alilley@doe.mass.edu"},12,210]
[357,"02900000","Sutton","Public School District","Superintendent","Theodore Friend","383 Boston Rd",null,"Sutton","MA","01590","Russ Fleming",{"$f":"VLOOKUP(L357, LiaisonList!$A$1:$C$8, 2, FALSE)","v":"781-338-6529"},{"$f":"VLOOKUP(L357, LiaisonList!$A$1:$C$8, 3, FALSE)","v":"RFleming@doe.mass.edu"},17,1366]
[358,"02910000","Swampscott","Public School District","Superintendent","Pamela Angelakis","207 Forest Avenue",null,"Swampscott","MA","01907","Deb Walker",{"$f":"VLOOKUP(L358, LiaisonList!$A$1:$C$8, 2, FALSE)","v":"781-338-3127"},{"$f":"VLOOKUP(L358, LiaisonList!$A$1:$C$8, 3, FALSE)","v":"djwalker@doe.mass.edu"},83,2158]
[359,"02920000","Swansea","Public School District","Superintendent","John Robidoux","1 Gardners Neck Road",null,"Swansea","MA","02777","Russ Fleming",{"$f":"VLOOKUP(L359, LiaisonList!$A$1:$C$8, 2, FALSE)","v":"781-338-6529"},{"$f":"VLOOKUP(L359, LiaisonList!$A$1:$C$8, 3, FALSE)","v":"RFleming@doe.mass.edu"},4,2014]
[360,"07700000","Tantasqua","Public School District","Superintendent","Erin Nosek","320A Brookfield Rd",null,"Fiskdale","MA","01518","Russ Fleming",{"$f":"VLOOKUP(L360, LiaisonList!$A$1:$C$8, 2, FALSE)","v":"781-338-6529"},{"$f":"VLOOKUP(L360, LiaisonList!$A$1:$C$8, 3, FALSE)","v":"RFleming@doe.mass.edu"},4,1775]
[361,"02930000","Taunton","Public School District","Superintendent","Julie Hackett","215 Harris Street",null,"Taunton","MA","02780","Julia Foodman",{"$f":"VLOOKUP(L361, LiaisonList!$A$1:$C$8, 2, FALSE)","v":"781-338-3577"},{"$f":"VLOOKUP(L361, LiaisonList!$A$1:$C$8, 3, FALSE)","v":"jfoodman@doe.mass.edu"},366,7755]
[362,"39020000","TEC Connections Academy Commonwealth Virtual School District","Public School District","Superintendent","Adam Goldberg","141 Mansion Drive",null,"East Walpole","MA","02032","Russ Fleming",{"$f":"VLOOKUP(L362, LiaisonList!$A$1:$C$8, 2, FALSE)","v":"781-338-6529"},{"$f":"VLOOKUP(L362, LiaisonList!$A$1:$C$8, 3, FALSE)","v":"RFleming@doe.mass.edu"},27,1855]
[363,"02950000","Tewksbury","Public School District","Superintendent","Christopher Malone","139 Pleasant Street",null,"Tewksbury","MA","01876","Beth O'Connell",{"$f":"VLOOKUP(L363, LiaisonList!$A$1:$C$8, 2, FALSE)","v":"781-338-3132"},{"$f":"VLOOKUP(L363, LiaisonList!$A$1:$C$8, 3, FALSE)","v":"EO'Connell@doe.mass.edu"},66,3286]
[364,"02960000","Tisbury","Public School District","Superintendent","Matthew D'Andrea","4 Pine Street",null,"Vineyard Haven","MA","02568","Sue Mazzarella",{"$f":"VLOOKUP(L364, LiaisonList!$A$1:$C$8, 2, FALSE)","v":"781-338-3587"},{"$f":"VLOOKUP(L364, LiaisonList!$A$1:$C$8, 3, FALSE)","v":"smazzarella@doe.mass.edu"},67,299]
[365,"02980000","Topsfield","Public School District","Superintendent","Scott Morrison","28 Middleton Road",null,"Boxford","MA","01921","Russ Fleming",{"$f":"VLOOKUP(L365, LiaisonList!$A$1:$C$8, 2, FALSE)","v":"781-338-6529"},{"$f":"VLOOKUP(L365, LiaisonList!$A$1:$C$8, 3, FALSE)","v":"RFleming@doe.mass.edu"},2,591]
[366,"08780000","Tri-County Regional Vocational Technical","Public School District","Superintendent","Stephen Dockray","147 Pond Street",null,"Franklin","MA","02038","Alex Lilley",{"$f":"VLOOKUP(L366, LiaisonList!$A$1:$C$8, 2, FALSE)","v":"781-338-6212"},{"$f":"VLOOKUP(L366, LiaisonList!$A$1:$C$8, 3, FALSE)","v":"alilley@doe.mass.edu"},3,975]
[367,"07730000","Triton","Public School District","Superintendent","Brian Forget","112 Elm Street",null,"Byfield","MA","01922","Russ Fleming",{"$f":"VLOOKUP(L367, LiaisonList!$A$1:$C$8, 2, FALSE)","v":"781-338-6529"},{"$f":"VLOOKUP(L367, LiaisonList!$A$1:$C$8, 3, FALSE)","v":"RFleming@doe.mass.edu"},27,2407]
[368,"03000000","Truro","Public School District","Superintendent","Michael Gradone","P O Box 2029",null,"Truro","MA","02666","Ellie Rounds-Bloom",{"$f":"VLOOKUP(L368, LiaisonList!$A$1:$C$8, 2, FALSE)","v":"781-338-3128"},{"$f":"VLOOKUP(L368, LiaisonList!$A$1:$C$8, 3, FALSE)","v":"erounds-bloom@doe.mass.edu"},0,87]
[369,"03010000","Tyngsborough","Public School District","Superintendent","Michael Flanagan","50 Norris Rd",null,"Tyngsborough","MA","01879","Aneesh Sahni",{"$f":"VLOOKUP(L369, LiaisonList!$A$1:$C$8, 2, FALSE)","v":"781-338-3532"},{"$f":"VLOOKUP(L369, LiaisonList!$A$1:$C$8, 3, FALSE)","v":"aneesh.sahni@doe.mass.edu"},35,1626]
[370,"04800000","UP Academy Charter School of Boston (District)","Charter District","Charter School Leader","Katy Buckland","215 Dorchester Street",null,"Boston","MA","02127","Ellie Rounds-Bloom",{"$f":"VLOOKUP(L370, LiaisonList!$A$1:$C$8, 2, FALSE)","v":"781-338-3128"},{"$f":"VLOOKUP(L370, LiaisonList!$A$1:$C$8, 3, FALSE)","v":"erounds-bloom@doe.mass.edu"},129,498]
[371,"35050000","UP Academy Charter School of Dorchester (District)","Charter District","Charter School Leader","Brittany Morse","35 Westville Street",null,"Boston","MA","02124","Ellie Rounds-Bloom",{"$f":"VLOOKUP(L371, LiaisonList!$A$1:$C$8, 2, FALSE)","v":"781-338-3128"},{"$f":"VLOOKUP(L371, LiaisonList!$A$1:$C$8, 3, FALSE)","v":"erounds-bloom@doe.mass.edu"},189,677]
[372,"07740000","Up-Island Regional","Public School District","Superintendent","Matthew D'Andrea","4 Pine Street",null,"Vineyard Haven","MA","02568","Sue Mazzarella",{"$f":"VLOOKUP(L372, LiaisonList!$A$1:$C$8, 2, FALSE)","v":"781-338-3587"},{"$f":"VLOOKUP(L372, LiaisonList!$A$1:$C$8, 3, FALSE)","v":"smazzarella@doe.mass.edu"},16,379]
[373,"08790000","Upper Cape Cod Regional Vocational Technical","Public School District","Superintendent","Robert Dutch","220 Sandwich Rd",null,"Bourne","MA","02532","Ellie Rounds-Bloom",{"$f":"VLOOKUP(L373, LiaisonList!$A$1:$C$8, 2, FALSE)","v":"781-338-3128"},{"$f":"VLOOKUP(L373, LiaisonList!$A$1:$C$8, 3, FALSE)","v":"erounds-bloom@doe.mass.edu"},0,698]
[374,"03040000","Uxbridge","Public School District","Superintendent","Kevin Carney","9 North Main Street",null,"Uxbridge","MA","01569","Deb Walker",{"$f":"VLOOKUP(L374, LiaisonList!$A$1:$C$8, 2, FALSE)","v":"781-338-3127"},{"$f":"VLOOKUP(L374, LiaisonList!$A$1:$C$8, 3, FALSE)","v":"djwalker@doe.mass.edu"},29,1671]
[375,"04980000","Veritas Preparatory Charter School (District)","Charter District","Charter School Leader","Ashley Martin","370 Pine Street",null,"Springfield","MA","01105","Sue Mazzarella",{"$f":"VLOOKUP(L375, LiaisonList!$A$1:$C$8, 2, FALSE)","v":"781-338-3587"},{"$f":"VLOOKUP(L375, LiaisonList!$A$1:$C$8, 3, FALSE)","v":"smazzarella@doe.mass.edu"},30,316]
[376,"07750000","Wachusett","Public School District","Superintendent","Darryll McCall","1745 Main Street","c/o Jefferson School","Jefferson","MA","01522","Beth O'Connell",{"$f":"VLOOKUP(L376, LiaisonList!$A$1:$C$8, 2, FALSE)","v":"781-338-3132"},{"$f":"VLOOKUP(L376, LiaisonList!$A$1:$C$8, 3, FALSE)","v":"EO'Connell@doe.mass.edu"},116,7062]
[377,"03050000","Wakefield","Public School District","Superintendent","Kimberly Smith","60 Farm Street",null,"Wakefield","MA","01880","Russ Fleming",{"$f":"VLOOKUP(L377, LiaisonList!$A$1:$C$8, 2, FALSE)","v":"781-338-6529"},{"$f":"VLOOKUP(L377, LiaisonList!$A$1:$C$8, 3, FALSE)","v":"RFleming@doe.mass.edu"},68,3389]
[378,"03060000","Wales","Public School District","Superintendent","Erin Nosek","320 Brookfield Rd",null,"Fiskdale","MA","01518","Russ Fleming",{"$f":"VLOOKUP(L378, LiaisonList!$A$1:$C$8, 2, FALSE)","v":"781-338-6529"},{"$f":"VLOOKUP(L378, LiaisonList!$A$1:$C$8, 3, FALSE)","v":"RFleming@doe.mass.edu"},0,146]
[379,"03070000","Walpole","Public School District","Superintendent","Lincoln Lynch","135 School Street",null,"Walpole","MA","02081","Beth O'Connell",{"$f":"VLOOKUP(L379, LiaisonList!$A$1:$C$8, 2, FALSE)","v":"781-338-3132"},{"$f":"VLOOKUP(L379, LiaisonList!$A$1:$C$8, 3, FALSE)","v":"EO'Connell@doe.mass.edu"},104,3727]
[380,"03080000","Waltham","Public School District","Superintendent","Drew Echelson","617 Lexington Street",null,"Waltham","MA","02452","Sue Mazzarella",{"$f":"VLOOKUP(L380, LiaisonList!$A$1:$C$8, 2, FALSE)","v":"781-338-3587"},{"$f":"VLOOKUP(L380, LiaisonList!$A$1:$C$8, 3, FALSE)","v":"smazzarella@doe.mass.edu"},1260,5447]
[381,"03090000","Ware","Public School District","Superintendent","Marlene Di Leo","P O Box 240",null,"Ware","MA","01082","Alex Lilley",{"$f":"VLOOKUP(L381, LiaisonList!$A$1:$C$8, 2, FALSE)","v":"781-338-6212"},{"$f":"VLOOKUP(L381, LiaisonList!$A$1:$C$8, 3, FALSE)","v":"alilley@doe.mass.edu"},13,1151]
[382,"03100000","Wareham","Public School District","Superintendent","Kimberly Shaver-Hood","48 Marion Road",null,"Wareham","MA","02571","Ellie Rounds-Bloom",{"$f":"VLOOKUP(L382, LiaisonList!$A$1:$C$8, 2, FALSE)","v":"781-338-3128"},{"$f":"VLOOKUP(L382, LiaisonList!$A$1:$C$8, 3, FALSE)","v":"erounds-bloom@doe.mass.edu"},25,2217]
[383,"03140000","Watertown","Public School District","Superintendent","Deanne Galdston","30 Common Street",null,"Watertown","MA","02472","Aneesh Sahni",{"$f":"VLOOKUP(L383, LiaisonList!$A$1:$C$8, 2, FALSE)","v":"781-338-3532"},{"$f":"VLOOKUP(L383, LiaisonList!$A$1:$C$8, 3, FALSE)","v":"aneesh.sahni@doe.mass.edu"},317,2453]
[384,"03150000","Wayland","Public School District","Superintendent","Arthur Unobskey","41 Cochituate Rd",null,"Wayland","MA","01778","Deb Walker",{"$f":"VLOOKUP(L384, LiaisonList!$A$1:$C$8, 2, FALSE)","v":"781-338-3127"},{"$f":"VLOOKUP(L384, LiaisonList!$A$1:$C$8, 3, FALSE)","v":"djwalker@doe.mass.edu"},99,2736]
[385,"03160000","Webster","Public School District","Superintendent","Ruthann Petruno-Goguen","77 Poland Street",null,"Webster","MA","01570","Russ Fleming",{"$f":"VLOOKUP(L385, LiaisonList!$A$1:$C$8, 2, FALSE)","v":"781-338-6529"},{"$f":"VLOOKUP(L385, LiaisonList!$A$1:$C$8, 3, FALSE)","v":"RFleming@doe.mass.edu"},146,1807]
[386,"03170000","Wellesley","Public School District","Superintendent","David Lussier","40 Kingsbury Street",null,"Wellesley","MA","02481","Julia Foodman",{"$f":"VLOOKUP(L386, LiaisonList!$A$1:$C$8, 2, FALSE)","v":"781-338-3577"},{"$f":"VLOOKUP(L386, LiaisonList!$A$1:$C$8, 3, FALSE)","v":"jfoodman@doe.mass.edu"},116,4896]
[387,"03180000","Wellfleet","Public School District","Superintendent","Thomas Conrad","78 Eldredge Pkwy",null,"Orleans","MA","02653","Julia Foodman",{"$f":"VLOOKUP(L387, LiaisonList!$A$1:$C$8, 2, FALSE)","v":"781-338-3577"},{"$f":"VLOOKUP(L387, LiaisonList!$A$1:$C$8, 3, FALSE)","v":"jfoodman@doe.mass.edu"},2,100]
[388,"03220000","West Boylston","Public School District","Superintendent","Elizabeth Schaper","125 Crescent Street",null,"West Boylston","MA","01583","Alex Lilley",{"$f":"VLOOKUP(L388, LiaisonList!$A$1:$C$8, 2, FALSE)","v":"781-338-6212"},{"$f":"VLOOKUP(L388, LiaisonList!$A$1:$C$8, 3, FALSE)","v":"alilley@doe.mass.edu"},30,880]
[389,"03230000","West Bridgewater","Public School District","Superintendent","Patricia Oakley","2 Spring Street",null,"West Bridgewater","MA","02379","Ellie Rounds-Bloom",{"$f":"VLOOKUP(L389, LiaisonList!$A$1:$C$8, 2, FALSE)","v":"781-338-3128"},{"$f":"VLOOKUP(L389, LiaisonList!$A$1:$C$8, 3, FALSE)","v":"erounds-bloom@doe.mass.edu"},17,1235]
[390,"03320000","West Springfield","Public School District","Superintendent","Michael Richard","26 Central Street",null,"West Springfield","MA","01089","Alex Lilley",{"$f":"VLOOKUP(L390, LiaisonList!$A$1:$C$8, 2, FALSE)","v":"781-338-6212"},{"$f":"VLOOKUP(L390, LiaisonList!$A$1:$C$8, 3, FALSE)","v":"alilley@doe.mass.edu"},517,4086]
[391,"03210000","Westborough","Public School District","Superintendent","Amber Bock","45 West Main Street",null,"Westborough","MA","01581","Sue Mazzarella",{"$f":"VLOOKUP(L391, LiaisonList!$A$1:$C$8, 2, FALSE)","v":"781-338-3587"},{"$f":"VLOOKUP(L391, LiaisonList!$A$1:$C$8, 3, FALSE)","v":"smazzarella@doe.mass.edu"},381,3800]
[392,"03250000","Westfield","Public School District","Superintendent","Stefan Czaporowski","94 North Elm Street","Suite 101","Westfield","MA","01085","Alex Lilley",{"$f":"VLOOKUP(L392, LiaisonList!$A$1:$C$8, 2, FALSE)","v":"781-338-6212"},{"$f":"VLOOKUP(L392, LiaisonList!$A$1:$C$8, 3, FALSE)","v":"alilley@doe.mass.edu"},317,5256]
[393,"03260000","Westford","Public School District","Superintendent","Everett Olsen","23 Depot Street",null,"Westford","MA","01886","Deb Walker",{"$f":"VLOOKUP(L393, LiaisonList!$A$1:$C$8, 2, FALSE)","v":"781-338-3127"},{"$f":"VLOOKUP(L393, LiaisonList!$A$1:$C$8, 3, FALSE)","v":"djwalker@doe.mass.edu"},86,4978]
[394,"03270000","Westhampton","Public School District","Superintendent","Craig Jurgensen","19 Stage Rd",null,"Westhampton","MA","01027","Deb Walker",{"$f":"VLOOKUP(L394, LiaisonList!$A$1:$C$8, 2, FALSE)","v":"781-338-3127"},{"$f":"VLOOKUP(L394, LiaisonList!$A$1:$C$8, 3, FALSE)","v":"djwalker@doe.mass.edu"},0,107]
[395,"03300000","Weston","Public School District","Superintendent","Midge Connolly","89 Wellesley Street",null,"Weston","MA","02493","Julia Foodman",{"$f":"VLOOKUP(L395, LiaisonList!$A$1:$C$8, 2, FALSE)","v":"781-338-3577"},{"$f":"VLOOKUP(L395, LiaisonList!$A$1:$C$8, 3, FALSE)","v":"jfoodman@doe.mass.edu"},64,2063]
[396,"03310000","Westport","Public School District","Superintendent","Ann Marie Dargon","17 Main Rd",null,"Westport","MA","02790","Beth O'Connell",{"$f":"VLOOKUP(L396, LiaisonList!$A$1:$C$8, 2, FALSE)","v":"781-338-3132"},{"$f":"VLOOKUP(L396, LiaisonList!$A$1:$C$8, 3, FALSE)","v":"EO'Connell@doe.mass.edu"},14,1389]
[397,"03350000","Westwood","Public School District","Superintendent","Emily Parks","220 Nahatan Street",null,"Westwood","MA","02090","Alex Lilley",{"$f":"VLOOKUP(L397, LiaisonList!$A$1:$C$8, 2, FALSE)","v":"781-338-6212"},{"$f":"VLOOKUP(L397, LiaisonList!$A$1:$C$8, 3, FALSE)","v":"alilley@doe.mass.edu"},33,3086]
[398,"03360000","Weymouth","Public School District","Superintendent","Jennifer Curtis-Whipple","111 Middle Street",null,"Weymouth","MA","02189","Ellie Rounds-Bloom",{"$f":"VLOOKUP(L398, LiaisonList!$A$1:$C$8, 2, FALSE)","v":"781-338-3128"},{"$f":"VLOOKUP(L398, LiaisonList!$A$1:$C$8, 3, FALSE)","v":"erounds-bloom@doe.mass.edu"},232,5813]
[399,"03370000","Whately","Public School District","Superintendent","Lynn Carey","113 North Main Street, Office C101",null,"South Deerfield","MA","01373","Alex Lilley",{"$f":"VLOOKUP(L399, LiaisonList!$A$1:$C$8, 2, FALSE)","v":"781-338-6212"},{"$f":"VLOOKUP(L399, LiaisonList!$A$1:$C$8, 3, FALSE)","v":"alilley@doe.mass.edu"},4,119]
[400,"07800000","Whitman-Hanson","Public School District","Public School District","Superintendent","Jeffrey Szymaniak","610 Franklin Street","Whitman","MA","02382","Alex Lilley","781-338-6212","alilley@doe.mass.edu",737,3914]
[401,"08850000","Whittier Regional Vocational Technical","Public School District","Superintendent","Maureen Lynch","115 Amesbury Line Rd",null,"Haverhill","MA","01830","Aneesh Sahni",{"$f":"VLOOKUP(L401, LiaisonList!$A$1:$C$8, 2, FALSE)","v":"781-338-3532"},{"$f":"VLOOKUP(L401, LiaisonList!$A$1:$C$8, 3, FALSE)","v":"aneesh.sahni@doe.mass.edu"},13,1247]
[402,"03400000","Williamsburg","Public School District","Superintendent","Craig Jurgensen","19 Stage Rd",null,"Westhampton","MA","01027","Deb Walker",{"$f":"VLOOKUP(L402, LiaisonList!$A$1:$C$8, 2, FALSE)","v":"781-338-3127"},{"$f":"VLOOKUP(L402, LiaisonList!$A$1:$C$8, 3, FALSE)","v":"djwalker@doe.mass.edu"},5,153]
[403,"03410000","Williamstown","Public School District","Superintendent","Kimberley Grady","115 Church Street",null,"Williamstown","MA","01267","Russ Fleming",{"$f":"VLOOKUP(L403, LiaisonList!$A$1:$C$8, 2, FALSE)","v":"781-338-6529"},{"$f":"VLOOKUP(L403, LiaisonList!$A$1:$C$8, 3, FALSE)","v":"RFleming@doe.mass.edu"},2,428]
[404,"03420000","Wilmington","Public School District","Superintendent","Paul Ruggiero","161 Church Street",null,"Wilmington","MA","01887","Julia Foodman",{"$f":"VLOOKUP(L404, LiaisonList!$A$1:$C$8, 2, FALSE)","v":"781-338-3577"},{"$f":"VLOOKUP(L404, LiaisonList!$A$1:$C$8, 3, FALSE)","v":"jfoodman@doe.mass.edu"},35,3242]
[405,"03430000","Winchendon","Public School District","Superintendent","Steven Haddad","175 Grove Street",null,"Winchendon","MA","01475","Beth O'Connell",{"$f":"VLOOKUP(L405, LiaisonList!$A$1:$C$8, 2, FALSE)","v":"781-338-3132"},{"$f":"VLOOKUP(L405, LiaisonList!$A$1:$C$8, 3, FALSE)","v":"EO'Connell@doe.mass.edu"},10,1206]
[406,"03440000","Winchester","Public School District","Superintendent","Judith Evans","40 Samoset Road",null,"Winchester","MA","01890","Sue Mazzarella",{"$f":"VLOOKUP(L406, LiaisonList!$A$1:$C$8, 2, FALSE)","v":"781-338-3587"},{"$f":"VLOOKUP(L406, LiaisonList!$A$1:$C$8, 3, FALSE)","v":"smazzarella@doe.mass.edu"},163,4577]
[407,"03460000","Winthrop","Public School District","Superintendent","Lisa Howard","1 Metcalf Square",null,"Winthrop","MA","02152","Alex Lilley",{"$f":"VLOOKUP(L407, LiaisonList!$A$1:$C$8, 2, FALSE)","v":"781-338-6212"},{"$f":"VLOOKUP(L407, LiaisonList!$A$1:$C$8, 3, FALSE)","v":"alilley@doe.mass.edu"},150,1900]
[408,"03470000","Woburn","Public School District","Superintendent","Matthew Crowley","55 Locust Street",null,"Woburn","MA","01801","Ellie Rounds-Bloom",{"$f":"VLOOKUP(L408, LiaisonList!$A$1:$C$8, 2, FALSE)","v":"781-338-3128"},{"$f":"VLOOKUP(L408, LiaisonList!$A$1:$C$8, 3, FALSE)","v":"erounds-bloom@doe.mass.edu"},311,4426]
[409,"03480000","Worcester","Public School District","Superintendent","Maureen Binienda","20 Irving Street",null,"Worcester","MA","01609","Russ Fleming",{"$f":"VLOOKUP(L409, LiaisonList!$A$1:$C$8, 2, FALSE)","v":"781-338-6529"},{"$f":"VLOOKUP(L409, LiaisonList!$A$1:$C$8, 3, FALSE)","v":"RFleming@doe.mass.edu"},7958,24429]
[410,"03490000","Worthington","Public School District","Superintendent","Craig Jurgensen","19 Stage Road",null,"Westhampton","MA","01027","Deb Walker",{"$f":"VLOOKUP(L410, LiaisonList!$A$1:$C$8, 2, FALSE)","v":"781-338-3127"},{"$f":"VLOOKUP(L410, LiaisonList!$A$1:$C$8, 3, FALSE)","v":"djwalker@doe.mass.edu"},0,48]
[411,"03500000","Wrentham","Public School District","Superintendent","Allan Cameron","120 Taunton Street",null,"Wrentham","MA","02093","Russ Fleming",{"$f":"VLOOKUP(L411, LiaisonList!$A$1:$C$8, 2, FALSE)","v":"781-338-6529"},{"$f":"VLOOKUP(L411, LiaisonList!$A$1:$C$8, 3, FALSE)","v":"RFleming@doe.mass.edu"},15,967]

{"sheet":"LiaisonList","index":22,"n_rows":8,"n_cols":3,"rows_kept":8,"cut":false,"hidden":true,"merged":[]}
["Aneesh Sahni","781-338-3532","aneesh.sahni@doe.mass.edu"]
["Alex Lilley","781-338-6212","alilley@doe.mass.edu"]
["Beth O'Connell","781-338-3132","EO'Connell@doe.mass.edu"]
["Deb Walker","781-338-3127","djwalker@doe.mass.edu"]
["Ellie Rounds-Bloom","781-338-3128","erounds-bloom@doe.mass.edu"]
["Julia Foodman","781-338-3577","jfoodman@doe.mass.edu"]
["Russ Fleming","781-338-6529","RFleming@doe.mass.edu"]
["Sue Mazzarella","781-338-3587","smazzarella@doe.mass.edu"]

{"sheet":"dataSchoolInfo","index":23,"n_rows":1848,"n_cols":16,"rows_kept":1848,"cut":false,"hidden":true,"merged":[]}
["ORG_CODE","SCHOOL_NAME","SCHOOL","Total18A","GRADE","Title I Status","Total18C","Eco_dis18A","GradeSpan","Eco_dis18c","Eco_dis18cx1.6","School Level","NP#","NP%","Eco_dis17ax1.6","Total17A"]
["0170","1 LT Charles W. Whitcomb School","01700045",null,"05 - 08","SW",1335,null,"MS",504,806.40000000000009]
["0332","21st Century Skills Academy","03320515",null,"12","NT",13,null,"HS",11,17.600000000000001]
["0163","A Drewicz Elementary","01630016",null,"K  - 05","SW",501,null,"ES",308,492.8]
["0207","A E Angier","02070005",null,"K  - 05","NT",467,null,"ES",20,32]
["0622","A F Maloney","06220015",null,"03 - 05","TA",295,null,"ES",63,100.80000000000001]
["0474","A North Central Charter Essential (District): Sizer School: A North Central Charter Essential School","04740505",null,"07 - 12","SW",348,null,"MSHS/K-12",114,182.4]
["0248","A. C. Whelan Elementary School","02480003",null,"K  - 05","SW",765,null,"ES",362,579.20000000000005]
["0016","A. Irvin Studley Elementary School","00160001",null,"K  - 04","SW",387,null,"ES",151,241.60000000000002]
["0326","Abbot Elementary","03260004",null,"03 - 05","TA",366,null,"ES",25,40]
["0098","Abbott Memorial","00980005",null,"PK - 08","NT",81,null,"ESMS",23,36.800000000000004]
["0445","Abby Kelley Foster Charter Public School","04450105",null,"K  - 12","SW",1425,null,"MSHS/K-12",533,852.80000000000007]
["0336","Abigail Adams Middle School","03360310",null,"05 - 06","TA",906,null,"ES",275,440]
["0001","Abington Early Education Program","00010001",null,"PK","NT",99,null,"EES",20,32]
["0001","Abington High","00010505",null,"09 - 12","NT",512,null,"HS",115,184]
["0001","Abington Middle School","00010405",null,"05 - 08","NT",688,null,"MS",159,254.4]
["0325","Abner Gibbs","03250020",null,"K  - 05","SW",227,null,"ES",114,182.4]
["0163","Aborn","01630011",null,"K  - 05","SW",253,null,"ES",110,176]
["0160","Abraham Lincoln","01600020",null,"PK - 04","SW",509,null,"ES",331,529.6]
["0201","Abraham Lincoln","02010095",null,"K  - 05","SW",723,null,"ES",492,787.2]
["0248","Abraham Lincoln","02480025",null,"PK - 05","SW",698,null,"ES",331,529.6]
["0336","Academy Avenue","03360005",null,"K  - 04","NT",313,null,"ES",87,139.20000000000002]
["0412","Academy Of the Pacific Rim Charter Public School","04120530",null,"05 - 12","SW",526,null,"MSHS/K-12",195,312]
["0600","Acton-Boxborough Regional High","06000505",null,"09 - 12","NT",1824,null,"HS",88,140.80000000000001]
["0003","Acushnet Elementary School","00030025",null,"PK - 04","TA",554,null,"ES",139,222.4]
["0093","Adams School","00930003",null,"PK","NT",220,null,"EES",103,164.8]
["0162","Advanced Community Experience Program","01620605",null,null,"NT",9,null,"SP",8,12.8]
["0430","Advanced Math and Science Academy Charter School","04300305",null,"06 - 12","NT",989,null,"MSHS/K-12",67,107.2]
["0005","Agawam Early Childhood Center","00050003",null,"PK","NT",181,null,"EES",68,108.80000000000001]
["0005","Agawam High","00050505",null,"09 - 12","NT",1166,null,"HS",258,412.8]
["0005","Agawam Junior High","00050405",null,"07 - 08","NT",572,null,"MS",154,246.4]
["0003","Albert F Ford Middle School","00030305",null,"05 - 08","NT",415,null,"MS",91,145.6]
["0274","Albert F. Argenziano School at Lincoln Park","02740087",null,"PK - 08","SW",602,null,"ESMS",217,347.20000000000005]
["0276","Albert S. Woodward Memorial School","02760050",null,"02 - 03","NT",266,null,"ES",11,17.600000000000001]
["0067","Alcott","00670005",null,"PK - 05","TA",485,null,"ES",44,70.400000000000006]
["0082","Alden School","00820004",null,"03 - 05","TA",680,null,"ES",35,56]
["0149","Alexander B Bruce","01490015",null,"03 - 08","SW",534,null,"ESMS",334,534.4]
["0281","Alfred G. Zanetti Montessori Magnet School","02810095",null,"PK - 08","SW",432,null,"ESMS",156,249.60000000000002]
["0201","Alfred J Gomes","02010063",null,"PK - 05","SW",583,null,"ES",439,702.40000000000009]
["0226","Alfred M Chaffee","02260010",null,"PK - 01","TA",284,null,"EES",95,152]
["0730","Algonquin Regional High","07300505",null,"09 - 12","NT",1461,null,"HS",90,144]
["0331","Alice A Macomber","03310015",null,"PK - 02","TA",388,null,"EES",107,171.20000000000002]
["0281","Alice B Beal Elementary","02810175",null,"K  - 05","SW",267,null,"ES",184,294.40000000000003]
["0246","Alice M Barrows","02460002",null,"K  - 05","NT",377,null,"ES",28,44.800000000000004]
["0236","Allendale","02360010",null,"K  - 05","NT",287,null,"ES",135,216]
["0409","Alma del Mar Charter School","04090205",null,"K  - 08","SW",407,null,"ESMS",223,356.8]
["0344","Ambrose Elementary","03440045",null,"K  - 05","NT",424,null,"ES",5,8]
["0243","Amelio Della Chiesa Early Childhood Center","02430005",null,"PK","SW",224,null,"EES",86,137.6]
["0007","Amesbury Elementary","00070005",null,"PK - 04","TA",403,null,"ES",87,139.20000000000002]
["0007","Amesbury High","00070505",null,"09 - 12","NT",580,null,"HS",76,121.60000000000001]
["0007","Amesbury Innovation High School","00070515",null,"09 - 12","NT",42,null,"HS",27,43.2]
["0007","Amesbury Middle","00070013",null,"05 - 08","NT",675,null,"MS",161,257.60000000000002]
["0605","Amherst Regional High","06050505",null,"09 - 12","NT",930,null,"HS",211,337.6]
["0605","Amherst Regional Middle School","06050405",null,"07 - 08","NT",404,null,"MS",118,188.8]
["0049","Amigos School","00490006",null,"PK - 08","NT",394,null,"ESMS",76,121.60000000000001]
["0212","Amvet Boulevard","02120007",null,"K  - 05","NT",392,null,"ES",27,43.2]
["0009","Andover High","00090505",null,"09 - 12","NT",1775,null,"HS",124,198.4]
["0009","Andover West Middle","00090310",null,"06 - 08","TA",524,null,"MS",43,68.8]
["0072","Andrew B. Cushman School","00720005",null,"PK - K","NT",149,null,"EES",41,65.600000000000009]
["0238","Anna Ware Jackson","02380010",null,"PK - 03","TA",413,null,"ES",63,100.80000000000001]
["0340","Anne T. Dunphy School","03400020",null,"PK - 06","TA",167,null,"ES",35,56]
["0321","Annie E Fales","03210010",null,"K  - 03","NT",338,null,"ES",22,35.200000000000003]
["0211","Annie L Sargent School","02110018",null,"K  - 05","NT",566,null,"ES",42,67.2]
["0101","Annie Sullivan Middle School","01010040",null,"06 - 08","NT",443,null,"MS",36,57.6]
["0035","Another Course To College","00350541",null,"09 - 12","SW",228,null,"HS",132,211.20000000000002]
["0665","Apponequet Regional High","06650505",null,"09 - 12","NT",778,null,"HS",84,134.4]
["0040","Archie T Morrison","00400033",null,"K  - 05","SW",425,null,"ES",129,206.4]
["3509","Argosy Collegiate Charter School","35090305",null,"06 - 09","SW",400,null,"MS",217,347.20000000000005]
["0010","Arlington High","00100505",null,"09 - 12","NT",1318,null,"HS",127,203.20000000000002]
["0149","Arlington Middle School","01490017",null,"05 - 08","SW",596,null,"MS",388,620.80000000000007]
["0274","Arthur D Healey","02740075",null,"PK - 08","SW",445,null,"ESMS",234,374.40000000000003]
["0097","Arthur M Longsjo Middle School","00970315",null,"05 - 08","SW",575,null,"MS",367,587.20000000000005]
["0281","Arthur T Talmadge","02810165",null,"K  - 05","SW",251,null,"ES",196,313.60000000000002]
["0346","Arthur T. Cummings Elementary School","03460020",null,"03 - 05","TA",450,null,"ES",116,185.60000000000002]
["0246","Arthur W Coolidge Middle","02460305",null,"06 - 08","NT",476,null,"MS",36,57.6]
["0735","Ashby Elementary","07350010",null,"K  - 04","TA",182,null,"ES",54,86.4]
["0044","Ashfield Middle School","00440421",null,"06 - 08","NT",500,null,"MS",234,374.40000000000003]
["0014","Ashland High","00140505",null,"09 - 12","NT",768,null,"HS",86,137.6]
["0014","Ashland Middle","00140405",null,"06 - 08","TA",603,null,"MS",79,126.4]
["0801","Assabet Valley Vocational High School","08010605",null,"09 - 12","TA",1103,null,"HS",251,401.6]
["0665","Assawompset Elementary School","06650002",null,"K  - 03","TA",439,null,"ES",87,139.20000000000002]
["0243","Atherton Hough","02430040",null,"K  - 05","NT",257,null,"ES",71,113.60000000000001]
["0615","Athol Community Elementary School","06150020",null,"PK - 04","SW",618,null,"ES",337,539.20000000000005]
["0615","Athol High","06150505",null,"09 - 12","SW",361,null,"HS",159,254.4]
["0615","Athol-Royalston Middle School","06150305",null,"05 - 08","SW",388,null,"MS",180,288]
["0211","Atkinson","02110001",null,"PK - 05","TA",579,null,"ES",166,265.60000000000002]
["0243","Atlantic Middle","02430305",null,"06 - 08","NT",502,null,"MS",164,262.40000000000003]
["0491","Atlantis Charter School","04910550",null,"K  - 12","SW",1212,null,"MSHS/K-12",503,804.80000000000007]
["0016","Attleboro Community Academy","00160515",null,"09 - 12","NT",76,null,"HS",31,49.6]
["0016","Attleboro High","00160505",null,"09 - 12","NT",1689,null,"HS",438,700.80000000000007]
["0017","Auburn Middle","00170305",null,"06 - 08","TA",633,null,"MS",106,169.60000000000002]
["0017","Auburn Senior High","00170505",null,"PK,09 - 12","NT",789,null,"HS",112,179.20000000000002]
["0073","Avery","00730010",null,"01 - 05","TA",326,null,"ES",129,206.4]
["0018","Avon Middle High School","00180510",null,"07 - 12","NT",315,null,"MSHS/K-12",92,147.20000000000002]
["0616","Ayer Shirley Regional High School","06160505",null,"09 - 12","TA",399,null,"HS",88,140.80000000000001]
["0616","Ayer Shirley Regional Middle School","06160305",null,"06 - 08","SW",369,null,"MS",102,163.20000000000002]
["0030","Ayers/Ryal Side School","00300055",null,"K  - 05","SW",499,null,"ES",138,220.8]
["0095","B M C Durfee High","00950505",null,"09 - 12","NT",2076,null,"HS",1199,1918.4]
["0160","B.F. Butler Middle School","01600310",null,"05 - 08","SW",546,null,"MS",290,464]
["0220","Balch","02200005",null,"01 - 05","TA",308,null,"ES",117,187.20000000000002]
["0035","Baldwin Early Learning Center","00350003",null,"PK - 01","SW",170,null,"EES",54,86.4]
["0720","Baldwinville Elementary","07200005",null,"02 - 04","SW",286,null,"ES",81,129.6]
["0281","Balliet Middle School","02810360",null,"06 - 08","SW",65,null,"MS",59,94.4]
["0009","Bancroft Elementary","00090003",null,"K  - 05","TA",586,null,"ES",45,72]
["0100","Barbieri Elementary","01000035",null,"K  - 05","SW",674,null,"ES",313,500.8]
["0427","Barnstable Community Horace Mann Charter Public School","04270010",null,"K  - 03","SW",303,null,"ES",115,184]
["0020","Barnstable High","00200505",null,"08 - 12","NT",1855,null,"MSHS/K-12",495,792]
["0020","Barnstable Intermediate School","00200315",null,"06 - 07","TA",728,null,"MS",239,382.40000000000003]
["0020","Barnstable United Elementary School","00200050",null,"04 - 05","SW",854,null,"ES",320,512]
["0044","Barrett Russell Early Childhood Center","00440008",null,"PK","NT",282,null,"EES",156,249.60000000000002]
["0061","Barry","00610003",null,"K  - 05","SW",417,null,"ES",203,324.8]
["0160","Bartlett Community Partnership","01600090",null,"PK - 08","SW",513,null,"ESMS",301,481.6]
["0316","Bartlett High School","03160505",null,"09 - 12","SW",435,null,"HS",192,307.20000000000005]
["0258","Bates","02580003",null,"K  - 05","SW",361,null,"ES",169,270.40000000000003]
["0876","Bay Path Regional Vocational Technical High School","08760605",null,"09 - 12","TA",1103,null,"HS",255,408]
["3502","Baystate Academy Charter Public School","35020405",null,"06 - 11","SW",441,null,"MSHS/K-12",306,489.6]
["0248","Beachmont Veterans Memorial School","02480013",null,"PK - 05","SW",367,null,"ES",176,281.60000000000002]
["0271","Beal School","02710005",null,"K  - 01","TA",308,null,"EES",37,59.2]
["0238","Beatrice H Wood Elementary","02380005",null,"04 - 06","TA",304,null,"ES",46,73.600000000000009]
["0001","Beaver Brook Elementary","00010020",null,"K  - 02","TA",427,null,"EES",91,145.6]
["0635","Becket Washington School","06350005",null,"PK - 05","TA",123,null,"ES",30,48]
["0023","Bedford High","00230505",null,"PK,09 - 12","TA",857,null,"HS",72,115.2]
["0165","Beebe","01650003",null,"K  - 08","SW",892,null,"ESMS",391,625.6]
["0243","Beechwood Knoll Elementary","02430020",null,"K  - 05","NT",352,null,"ES",109,174.4]
["0107","Beeman Memorial","01070010",null,"K  - 05","SW",338,null,"ES",160,256]
["0035","Beethoven","00350021",null,"PK - 03","SW",331,null,"EES",130,208]
["0061","Belcher","00610010",null,"K  - 02","SW",274,null,"EES",177,283.2]
["0024","Belchertown High","00240505",null,"09 - 12","NT",706,null,"HS",88,140.80000000000001]
["0061","Bellamy Middle","00610305",null,"06 - 08","SW",787,null,"MS",400,640]
["0025","Bellingham Early Childhood Center","00250003",null,"PK","NT",111,null,"EES",25,40]
["0025","Bellingham High School","00250505",null,"08 - 12","NT",761,null,"MSHS/K-12",126,201.60000000000002]
["0025","Bellingham Memorial School","00250315",null,"04 - 07","NT",718,null,"ESMS",126,201.60000000000002]
["0026","Belmont High","00260505",null,"09 - 12","NT",1307,null,"HS",101,161.60000000000002]
["0348","Belmont Street Community","03480020",null,"PK - 06","SW",603,null,"ES",487,779.2]
["0262","Belmonte Saugus Middle","02620305",null,"06 - 08","SW",653,null,"MS",174,278.40000000000003]
["0420","Benjamin Banneker Charter Public School","04200205",null,"PK - 06","SW",350,null,"ES",187,299.2]
["0447","Benjamin Franklin Classical Charter Public School","04470205",null,"K  - 08","TA",446,null,"ESMS",28,44.800000000000004]
["0293","Benjamin Friedman Middle","02930315",null,"05 - 07","NT",767,null,"MS",300,480]
["0274","Benjamin G Brown","02740015",null,"K  - 05","NT",232,null,"ES",34,54.400000000000006]
["0005","Benjamin J Phelps","00050020",null,"K  - 04","SW",389,null,"ES",111,177.60000000000002]
["0153","Bennett","01530003",null,"PK","SW",116,null,"EES",42,67.2]
["0198","Bennett-Hemenway","01980005",null,"K  - 04","NT",592,null,"ES",43,68.8]
["3511","Bentley Academy Charter School","35110205",null,"K  - 05","SW",283,null,"ES",182,291.2]
["0027","Berkley Community School","00270010",null,"PK - 04","TA",529,null,"ES",98,156.80000000000001]
["0027","Berkley Middle School","00270305",null,"05 - 08","NT",392,null,"MS",57,91.2]
["0414","Berkshire Arts and Technology Charter Public School","04140305",null,"06 - 12","SW",349,null,"MSHS/K-12",141,225.60000000000002]
["0028","Berlin Memorial","00280005",null,"PK - 05","TA",190,null,"ES",30,48]
["0750","Bernardston Elementary","07500006",null,"PK - 06","TA",159,null,"ES",44,70.400000000000006]
["0675","Bessie Buker Elementary","06750007",null,"K  - 05","TA",257,null,"ES",22,35.200000000000003]
["0201","Betsey B Winslow","02010140",null,"K  - 05","SW",305,null,"ES",144,230.4]
["0030","Beverly High","00300505",null,"09 - 12","NT",1233,null,"HS",272,435.20000000000005]
["0207","Bigelow Middle","02070305",null,"06 - 08","NT",519,null,"MS",57,91.2]
["0031","Billerica Memorial High School","00310505",null,"PK,09 - 12","NT",1320,null,"HS",176,281.60000000000002]
["0246","Birch Meadow","02460005",null,"K  - 05","NT",369,null,"ES",20,32]
["0087","Birchland Park","00870305",null,"06 - 08","TA",665,null,"MS",129,206.4]
["0307","Bird Middle","03070305",null,"06 - 08","NT",491,null,"MS",48,76.800000000000011]
["0035","Blackstone","00350390",null,"PK - 05","SW",595,null,"ES",444,710.40000000000009]
["0622","Blackstone Millville RHS","06220505",null,"09 - 12","NT",405,null,"HS",78,124.80000000000001]
["0805","Blackstone Valley","08050605",null,"09 - 12","TA",1220,null,"HS",121,193.60000000000002]
["0600","Blanchard Memorial School","06000005",null,"K  - 06","NT",447,null,"ES",18,28.8]
["0326","Blanchard Middle","03260310",null,"06 - 08","NT",589,null,"MS",31,49.6]
["0806","Blue Hills Regional Vocational Technical","08060605",null,"09 - 12","SW",842,null,"HS",189,302.40000000000003]
["0159","Blueberry Hill","01590005",null,"K  - 05","NT",435,null,"ES",28,44.800000000000004]
["0035","Boston Adult Academy","00350548",null,"11 - 12","SW",175,null,"HS",76,121.60000000000001]
["0035","Boston Arts Academy","00350546",null,"09 - 12","SW",457,null,"HS",209,334.40000000000003]
["0035","Boston Collaborative High School","00350755",null,"09 - 12","NT",223,null,"HS",146,233.60000000000002]
["0449","Boston Collegiate Charter School","04490305",null,"05 - 12","SW",700,null,"MSHS/K-12",204,326.40000000000003]
["0035","Boston Community Leadership Academy","00350558",null,"09 - 12","SW",465,null,"HS",281,449.6]
["0424","Boston Day and Evening Academy Charter School","04240505",null,"09 - 12","SW",389,null,"HS",221,353.6]
["0411","Boston Green Academy Horace Mann Charter School","04110305",null,"06 - 12","SW",460,null,"MSHS/K-12",298,476.8]
["0035","Boston International High School","00350507",null,"09 - 12","SW",447,null,"HS",289,462.40000000000003]
["0035","Boston Latin","00350560",null,"07 - 12","SW",2435,null,"MSHS/K-12",401,641.6]
["0035","Boston Latin Academy","00350545",null,"07 - 12","SW",1760,null,"MSHS/K-12",564,902.40000000000009]
["0416","Boston Preparatory Charter Public School","04160305",null,"06 - 12","SW",457,null,"MSHS/K-12",185,296]
["0481","Boston Renaissance Charter Public School","04810550",null,"PK - 06","SW",943,null,"ES",453,724.80000000000007]
["0035","Boston Teachers Union School","00350012",null,"PK - 08","SW",295,null,"ESMS",117,187.20000000000002]
["0036","Bourne High School","00360505",null,"09 - 12","NT",475,null,"HS",112,179.20000000000002]
["0036","Bourne Middle School","00360325",null,"05 - 08","TA",678,null,"MS",154,246.4]
["0036","Bournedale Elementary School","00360005",null,"PK - 04","NT",454,null,"ES",127,203.20000000000002]
["0342","Boutwell","03420005",null,"PK - K","NT",155,null,"EES",10,16]
["0673","Boutwell School","06730001",null,"PK","NT",75,null,"EES",15,24]
["0061","Bowe","00610015",null,"PK - 05","SW",493,null,"ES",350,560]
["0207","Bowen","02070015",null,"K  - 05","NT",425,null,"ES",30,48]
["0061","Bowie","00610020",null,"K  - 05","NT",338,null,"ES",137,219.20000000000002]
["0155","Bowman","01550008",null,"K  - 05","TA",567,null,"ES",33,52.800000000000004]
["0307","Boyden","03070010",null,"K  - 05","TA",356,null,"ES",39,62.400000000000006]
["0039","Boylston Elementary","00390005",null,"PK - 05","TA",303,null,"ES",27,43.2]
["0010","Brackett","00100010",null,"K  - 05","NT",485,null,"ES",19,30.400000000000002]
["0128","Bradford Elementary","01280008",null,"K  - 04","NT",314,null,"ES",105,168]
["0040","Braintree High","00400505",null,"PK,09 - 12","NT",1812,null,"HS",295,472]
["0209","Brayton","02090035",null,"PK - 06","SW",276,null,"ES",185,296]
["0163","Breed Middle School","01630405",null,"06 - 08","SW",1344,null,"MS",814,1302.4000000000001]
["0163","Brickett Elementary","01630020",null,"K  - 05","SW",306,null,"ES",188,300.8]
["0155","Bridge","01550006",null,"K  - 05","NT",577,null,"ES",38,60.800000000000004]
["0417","Bridge Boston Charter School","04170205",null,"PK - 06","SW",312,null,"ES",198,316.8]
["0210","Bridge Street","02100005",null,"PK - 05","SW",287,null,"ES",118,188.8]
["0625","Bridgewater Middle School","06250320",null,"07 - 08","NT",507,null,"MS",68,108.80000000000001]
["0625","Bridgewater-Raynham Regional","06250505",null,"09 - 12","NT",1458,null,"HS",181,289.60000000000002]
["0610","Briggs Elementary","06100025",null,"PK - 05","TA",552,null,"ES",93,148.80000000000001]
["0035","Brighton High","00350505",null,"09 - 12","SW",648,null,"HS",432,691.2]
["0281","Brightwood","02810025",null,"K  - 05","SW",334,null,"ES",314,502.40000000000003]
["0043","Brimfield Elementary","00430005",null,"PK - 06","TA",301,null,"ES",63,100.80000000000001]
["0030","Briscoe Middle","00300305",null,"06 - 08","NT",1002,null,"MS",249,398.40000000000003]
["0910","Bristol County Agricultural High","09100705",null,"09 - 12","TA",457,null,"HS",90,144]
["0810","Bristol-Plymouth Vocational Technical","08100605",null,"09 - 12","TA",1247,null,"HS",311,497.6]
["0243","Broad Meadows Middle","02430310",null,"06 - 08","NT",388,null,"MS",153,244.8]
["0199","Broadmeadow","01990005",null,"K  - 05","NT",545,null,"ES",18,28.8]
["0044","Brockton Champion High School","00440515",null,"09 - 12","NT",178,null,"HS",118,188.8]
["0044","Brockton High","00440505",null,"09 - 12","NT",4082,null,"HS",1901,3041.6000000000004]
["0125","Bromfield","01250505",null,"06 - 12","TA",662,null,"MSHS/K-12",27,43.2]
["0428","Brooke Charter School","04280305",null,"K  - 10","SW",1742,null,"MSHS/K-12",801,1281.6000000000001]
["0044","Brookfield","00440010",null,"K  - 05","SW",666,null,"ES",353,564.80000000000007]
["0045","Brookfield Elementary","00450005",null,"PK - 06","TA",316,null,"ES",91,145.6]
["0046","Brookline Early Education Program at Beacon","00460001",null,"PK","NT",76,null,"EES",7,11.200000000000001]
["0046","Brookline Early Education Program at Putterham","00460002",null,"PK","NT",69,null,"EES",9,14.4]
["0046","Brookline High","00460505",null,"PK,09 - 12","NT",2041,null,"HS",243,388.8]
["0176","Brooks School","01760130",null,"PK - 05","NT",509,null,"ES",67,107.2]
["0185","Brookside","01850065",null,"K  - 02","SW",474,null,"EES",183,292.8]
["0079","Brookside Elementary","00790035",null,"K  - 05","SW",458,null,"ES",118,188.8]
["0100","Brophy","01000006",null,"K  - 05","SW",474,null,"ES",228,364.8]
["0198","Brown","01980010",null,"K  - 04","NT",526,null,"ES",66,105.60000000000001]
["0231","Bryantville Elementary","02310003",null,"K  - 06","TA",500,null,"ES",102,163.20000000000002]
["0017","Bryn Mawr","00170010",null,"K  - 02","TA",303,null,"EES",65,104]
["0717","Buckland-Shelburne Regional","07170005",null,"PK - 06","TA",275,null,"ES",90,144]
["0287","Burgess Elementary","02870005",null,"PK - 06","TA",900,null,"ES",145,232]
["0177","Burke/Memorial Elementary School","01770015",null,"02 - 04","TA",513,null,"ES",55,88]
["0048","Burlington High","00480505",null,"PK,K,09 - 12","NT",1092,null,"HS",122,195.20000000000002]
["0348","Burncoat Middle School","03480405",null,"07 - 08","NT",616,null,"MS",343,548.80000000000007]
["0348","Burncoat Senior High","03480503",null,"09 - 12","NT",1048,null,"HS",581,929.6]
["0348","Burncoat Street","03480035",null,"K  - 06","SW",304,null,"ES",235,376]
["0056","Byam School","00560030",null,"K  - 04","TA",507,null,"ES",74,118.4]
["0141","C A Farley","01410030",null,"PK - 04","TA",456,null,"ES",115,184]
["0207","C C Burr","02070020",null,"K  - 05","NT",389,null,"ES",33,52.800000000000004]
["0600","C.T. Douglas Elementary School","06000020",null,"K  - 06","NT",432,null,"ES",36,57.6]
["0207","Cabot","02070025",null,"K  - 05","NT",395,null,"ES",29,46.400000000000006]
["0128","Caleb Dustin Hunking School","01280030",null,"K  - 08","NT",1032,null,"ESMS",342,547.20000000000005]
["0271","Calvin Coolidge","02710015",null,"K  - 04","TA",409,null,"ES",67,107.2]
["0049","Cambridge Rindge and Latin","00490506",null,"09 - 12","NT",1954,null,"HS",557,891.2]
["0049","Cambridge Street Upper School","00490305",null,"06 - 08","NT",253,null,"MS",111,177.60000000000002]
["0049","Cambridgeport","00490007",null,"PK - 05","SW",342,null,"ES",92,147.20000000000002]
["0100","Cameron Middle School","01000302",null,"06 - 08","NT",535,null,"MS",204,326.40000000000003]
["0348","Canterbury","03480045",null,"PK - 06","SW",379,null,"ES",285,456]
["0050","Canton High","00500505",null,"09 - 12","NT",979,null,"HS",126,201.60000000000002]
["0432","Cape Cod Lighthouse Charter School","04320530",null,"06 - 08","TA",242,null,"MS",38,60.800000000000004]
["0815","Cape Cod Region Vocational Technical","08150605",null,"09 - 12","SW",580,null,"HS",204,326.40000000000003]
["0163","Capt William G Shoemaker","01630090",null,"PK - 05","SW",332,null,"ES",140,224]
["0229","Captain Samuel Brown","02290005",null,"K  - 05","SW",362,null,"ES",98,156.80000000000001]
["0274","Capuano Early Childhood Center","02740005",null,"PK - K","SW",313,null,"EES",119,190.4]
["0051","Carlisle School","00510025",null,"PK - 08","NT",618,null,"ESMS",24,38.400000000000006]
["0201","Carlos Pacheco","02010105",null,"K  - 05","SW",355,null,"ES",266,425.6]
["0258","Carlton","02580015",null,"K  - 05","SW",261,null,"ES",122,195.20000000000002]
["0095","Carlton M. Viveiros Elementary School","00950009",null,"K  - 05","SW",746,null,"ES",563,900.80000000000007]
["0600","Carol Huebner Early Childhood Program","06000001",null,"PK","NT",121,null,"EES",13,20.8]
["0035","Carter Developmental Center","00350036",null,"07 - 12","SW",29,null,"MSHS/K-12",25,40]
["0052","Carver Elementary School","00520015",null,"PK - 05","TA",790,null,"ES",192,307.20000000000005]
["0052","Carver Middle/High School","00520405",null,"06 - 12","NT",786,null,"MSHS/K-12",161,257.60000000000002]
["0201","Casimir Pulaski","02010123",null,"PK - 05","SW",759,null,"ES",340,544]
["0122","Cedar Elementary","01220004",null,"PK - 04","NT",425,null,"ES",34,54.400000000000006]
["0139","Center","01390005",null,"K  - 01","NT",468,null,"EES",22,35.200000000000003]
["0159","Center","01590010",null,"K  - 05","TA",409,null,"ES",27,43.2]
["0173","Center","01730005",null,"PK - 03","NT",245,null,"ES",46,73.600000000000009]
["0229","Center","02290015",null,"K  - 05","SW",395,null,"ES",125,200]
["0122","Center Elementary","01220005",null,"K  - 02","NT",336,null,"EES",18,28.8]
["0056","Center Elementary School","00560005",null,"K  - 04","TA",455,null,"ES",62,99.2]
["0153","Center For Technical Education Innovation","01530605",null,"09 - 12","SW",662,null,"HS",227,363.20000000000005]
["0086","Center School","00860005",null,"K  - 04","TA",205,null,"ES",63,100.80000000000001]
["0088","Center School","00880003",null,"PK - 02","NT",271,null,"EES",46,73.600000000000009]
["0725","Center School","07250020",null,"PK - 05","NT",564,null,"ES",27,43.2]
["0020","Centerville Elementary","00200010",null,"K  - 03","NT",259,null,"ES",68,108.80000000000001]
["0030","Centerville Elementary","00300010",null,"K  - 05","SW",368,null,"ES",114,182.4]
["0083","Central","00830005",null,"PK - 02","TA",599,null,"EES",99,158.4]
["0243","Central Middle","02430315",null,"06 - 08","NT",629,null,"MS",139,222.4]
["0775","Central Tree Middle","07750310",null,"06 - 08","NT",373,null,"MS",40,64]
["0273","Chace Street","02730005",null,"PK - 05","TA",418,null,"ES",108,172.8]
["0082","Chandler Elementary","00820006",null,"PK - 02","TA",606,null,"EES",41,65.600000000000009]
["0348","Chandler Elementary Community","03480050",null,"K  - 06","SW",485,null,"ES",394,630.40000000000009]
["0348","Chandler Magnet","03480052",null,"PK - 06","SW",451,null,"ES",301,481.6]
["0161","Chapin Street Elementary School","01610020",null,"02 - 03","TA",325,null,"ES",109,174.4]
["0243","Charles A Bernazzani Elementary","02430025",null,"K  - 05","NT",336,null,"ES",74,118.4]
["0007","Charles C Cashman Elementary","00070010",null,"PK - 04","TA",451,null,"ES",133,212.8]
["0056","Charles D Harrington","00560025",null,"K  - 04","TA",497,null,"ES",93,148.80000000000001]
["0207","Charles E Brown Middle","02070310",null,"06 - 08","NT",751,null,"MS",56,89.600000000000009]
["0350","Charles E Roderick","03500010",null,"04 - 06","NT",471,null,"ES",45,72]
["0035","Charles H Taylor","00350054",null,"PK - 05","SW",549,null,"ES",364,582.4]
["0220","Charles J Prescott","02200025",null,"K  - 05","NT",237,null,"ES",24,38.400000000000006]
["0170","Charles Jaworek School","01700030",null,"K  - 04","SW",770,null,"ES",263,420.8]
["0851","Charles McCann Vocational Technical","08510605",null,"09 - 12","SW",486,null,"HS",148,236.8]
["0201","Charles S Ashley","02010010",null,"K  - 05","SW",283,null,"ES",159,254.4]
["0189","Charles S Pierce Middle","01890410",null,"06 - 08","NT",908,null,"MS",98,156.80000000000001]
["0035","Charles Sumner","00350052",null,"PK - 05","SW",573,null,"ES",330,528]
["0099","Charles Taylor Elementary","00990050",null,"K  - 04","NT",238,null,"ES",25,40]
["0160","Charles W Morey","01600030",null,"PK - 04","SW",527,null,"ES",223,356.8]
["0035","Charlestown High","00350515",null,"09 - 12","SW",905,null,"HS",577,923.2]
["0100","Charlotte A Dunning","01000007",null,"K  - 05","NT",469,null,"ES",87,139.20000000000002]
["0160","Charlotte M Murkland Elementary","01600080",null,"PK - 04","SW",517,null,"ES",353,564.80000000000007]
["0658","Charlton Elementary","06580020",null,"PK - 01","TA",346,null,"EES",67,107.2]
["0658","Charlton Middle School","06580310",null,"05 - 08","NT",691,null,"MS",120,192]
["0277","Charlton Street","02770005",null,"02 - 05","SW",315,null,"ES",216,345.6]
["0712","Chatham Elementary School","07120001",null,"PK - 04","SW",250,null,"ES",79,126.4]
["0056","Chelmsford High","00560505",null,"09 - 12","NT",1475,null,"HS",129,206.4]
["0057","Chelsea High","00570505",null,"09 - 12","SW",1503,null,"HS",898,1436.8000000000002]
["0672","Chester Elementary","06720059",null,"PK - 05","TA",124,null,"ES",48,76.800000000000011]
["0281","Chestnut Academy","02810365",null,"06 - 08","SW",426,null,"MS",382,611.20000000000005]
["0281","Chestnut Accelerated Middle School (Talented and Gifted)","02810367",null,"06 - 08","SW",315,null,"MS",216,345.6]
["0024","Chestnut Hill Community School","00240006",null,"04 - 06","NT",552,null,"ES",111,177.60000000000002]
["0078","Chickering","00780005",null,"PK - 05","TA",492,null,"ES",11,17.600000000000001]
["0061","Chicopee Academy","00610021",null,"06 - 12","NT",79,null,"MSHS/K-12",64,102.4]
["0061","Chicopee Comprehensive High School","00610510",null,"09 - 12","NT",1316,null,"HS",521,833.6]
["0061","Chicopee High","00610505",null,"09 - 12","NT",934,null,"HS",452,723.2]
["0774","Chilmark Elementary","07740010",null,"K  - 05","NT",50,null,"ES",9,14.4]
["0775","Chocksett Middle School","07750315",null,"05 - 08","NT",370,null,"MS",39,62.400000000000006]
["0418","Christa McAuliffe Charter Public School","04180305",null,"06 - 08","TA",394,null,"MS",74,118.4]
["0176","Christopher Columbus","01760140",null,"PK - 05","TA",399,null,"ES",158,252.8]
["0437","City on a Hill Charter Public School Circuit Street","04370505",null,"09 - 12","SW",271,null,"HS",150,240]
["3504","City on a Hill Charter Public School Dudley Square","35040505",null,"09 - 12","SW",261,null,"HS",148,236.8]
["3507","City on a Hill Charter Public School New Bedford","35070505",null,"09 - 12","SW",224,null,"HS",153,244.8]
["0348","City View","03480053",null,"PK - 06","SW",495,null,"ES",376,601.6]
["0226","Clara Barton","02260005",null,"02 - 04","TA",381,null,"ES",121,193.60000000000002]
["0348","Claremont Academy","03480350",null,"07 - 12","NT",555,null,"MSHS/K-12",388,620.80000000000007]
["0035","Clarence R Edwards Middle","00350430",null,"06 - 08","SW",305,null,"MS",221,353.6]
["0057","Clark Avenue School","00570050",null,"05 - 08","SW",549,null,"MS",328,524.80000000000007]
["0348","Clark St Community","03480055",null,"PK - 06","SW",274,null,"ES",218,348.8]
["0291","Clarke","02910005",null,"K  - 04","TA",191,null,"ES",29,46.400000000000006]
["0063","Clarksburg Elementary","00630010",null,"K  - 08","TA",190,null,"ESMS",61,97.600000000000009]
["0163","Classical High","01630505",null,"09 - 12","SW",1708,null,"HS",872,1395.2]
["0315","Claypit Hill School","03150005",null,"K  - 05","NT",549,null,"ES",24,38.400000000000006]
["0243","Clifford H Marshall Elementary","02430055",null,"K  - 04","SW",544,null,"ES",231,369.6]
["0005","Clifford M Granger","00050010",null,"K  - 04","SW",282,null,"ES",98,156.80000000000001]
["0064","Clinton Elementary","00640050",null,"PK - 03","SW",693,null,"ES",256,409.6]
["0064","Clinton Middle School","00640305",null,"04 - 08","SW",745,null,"ESMS",275,440]
["0064","Clinton Senior High","00640505",null,"PK,09 - 12","NT",453,null,"HS",135,216]
["0187","Clyde F Brown","01870005",null,"PK - 04","TA",503,null,"ES",53,84.800000000000011]
["0347","Clyde Reeves","03470040",null,"PK - 05","NT",428,null,"ES",80,128]
["0163","Cobbet Elementary","01630035",null,"K  - 05","SW",625,null,"ES",472,755.2]
["0438","Codman Academy Charter Public School","04380505",null,"PK - 12","SW",341,null,"MSHS/K-12",176,281.60000000000002]
["0065","Cohasset Middle/High School","00650505",null,"06 - 12","NT",840,null,"MSHS/K-12",42,67.2]
["0326","Col John Robinson","03260025",null,"K  - 02","NT",292,null,"EES",16,25.6]
["0056","Col Moses Parker School","00560305",null,"05 - 08","NT",720,null,"MS",82,131.20000000000002]
["0024","Cold Spring","00240005",null,"PK - K","TA",195,null,"EES",44,70.400000000000006]
["0239","Cold Spring","02390005",null,"K  - 05","SW",258,null,"ES",85,136]
["0209","Colegrove Park Elementary","02090008",null,"PK - 06","SW",346,null,"ES",213,340.8]
["3503","Collegiate Charter School of Lowell","35030205",null,"K  - 07","SW",754,null,"ESMS",286,457.6]
["0189","Collicot","01890005",null,"PK - 05","NT",724,null,"ES",40,64]
["0258","Collins Middle","02580305",null,"06 - 08","SW",547,null,"MS",258,412.8]
["0284","Colonial Park","02840005",null,"PK - 04","NT",280,null,"ES",34,54.400000000000006]
["0717","Colrain Central","07170010",null,"PK - 06","SW",109,null,"ES",38,60.800000000000004]
["0348","Columbus Park","03480060",null,"PK - 06","SW",537,null,"ES",386,617.6]
["0212","Community","02120030",null,"K  - 05","TA",309,null,"ES",131,209.60000000000002]
["0035","Community Academy","00350518",null,"09 - 12","SW",71,null,"HS",56,89.600000000000009]
["0035","Community Academy of Science and Health","00350581",null,"09 - 12","SW",366,null,"HS",259,414.40000000000003]
["0436","Community Charter School of Cambridge","04360305",null,"06 - 12","SW",356,null,"MSHS/K-12",122,195.20000000000002]
["0149","Community Day Arlington","01490009",null,"K  - 04","SW",615,null,"ES",423,676.80000000000007]
["0426","Community Day Charter Public School - Gateway","04260205",null,"PK - 06","SW",320,null,"ES",149,238.4]
["0440","Community Day Charter Public School - Prospect","04400205",null,"PK - 08","SW",400,null,"ESMS",199,318.40000000000003]
["0431","Community Day Charter Public School - R. Kingman Webster","04310205",null,"PK - 06","SW",320,null,"ES",162,259.2]
["0056","Community Education Center","00560001",null,"PK","NT",147,null,"EES",27,43.2]
["0181","Comprehensive Grammar School","01810050",null,"PK - 08","NT",1109,null,"ESMS",336,537.6]
["0640","Concord Carlisle High","06400505",null,"09 - 12","TA",1258,null,"HS",72,115.2]
["0067","Concord Middle","00670305",null,"06 - 08","NT",725,null,"MS",49,78.400000000000006]
["0128","Consentino Annex at Bartlett School","01280005",null,"K  - 02","SW",118,null,"EES",73,116.80000000000001]
["0128","Consentino Middle School","01280100",null,"03 - 08","SW",977,null,"ESMS",526,841.6]
["0439","Conservatory Lab Charter School","04390050",null,"PK - 08","SW",449,null,"ESMS",206,329.6]
["0281","Conservatory of the Arts","02810475",null,"06 - 12","SW",359,null,"MSHS/K-12",272,435.20000000000005]
["0068","Conway Grammar","00680005",null,"PK - 06","NT",139,null,"ES",35,56]
["0220","Cornelius M Callahan","02200010",null,"01 - 05","TA",214,null,"ES",72,115.2]
["0266","Cottage Street","02660005",null,"K  - 05","NT",519,null,"ES",28,44.800000000000004]
["0330","Country","03300010",null,"PK - 03","NT",304,null,"ES",19,30.400000000000002]
["0207","Countryside","02070040",null,"K  - 05","TA",420,null,"ES",49,78.400000000000006]
["0030","Cove Elementary","00300015",null,"K  - 05","SW",482,null,"ES",124,198.4]
["0332","Cowing Early Childhood","03320001",null,"PK","NT",140,null,"EES",88,140.80000000000001]
["0635","Craneville","06350025",null,"K  - 05","TA",409,null,"ES",145,232]
["0097","Crocker Elementary","00970016",null,"PK - 04","SW",690,null,"ES",433,692.80000000000007]
["0008","Crocker Farm Elementary","00080009",null,"PK - 06","TA",420,null,"ES",139,222.4]
["0236","Crosby","02360065",null,"PK - 05","SW",452,null,"ES",330,528]
["0128","Crowell","01280020",null,"K","SW",109,null,"EES",67,107.2]
["0314","Cunniff","03140015",null,"PK - 05","NT",305,null,"ES",67,107.2]
["0189","Cunningham School","01890007",null,"K  - 05","NT",532,null,"ES",35,56]
["0035","Curley K-8 School","00350020",null,"PK - 08","SW",965,null,"ESMS",529,846.40000000000009]
["0035","Curtis Guild","00350062",null,"PK - 05","SW",292,null,"ES",185,296]
["0176","Curtis-Tufts","01760510",null,"09 - 12","NT",26,null,"HS",12,19.200000000000003]
["0264","Cushing Elementary","02640007",null,"K  - 05","NT",312,null,"ES",25,40]
["0675","Cutler School","06750010",null,"K  - 05","TA",289,null,"ES",17,27.200000000000003]
["0109","Cuttyhunk Elementary","01090005",null,"07 - 08","NT",2,null,"MS",0,0]
["0016","Cyril K. Brennan Middle School","00160315",null,"05 - 08","NT",590,null,"MS",204,326.40000000000003]
["0010","Cyrus E Dallin","00100025",null,"K  - 05","NT",482,null,"ES",24,38.400000000000006]
["0197","Cyrus Peirce","01970010",null,"06 - 08","NT",352,null,"MS",85,136]
["0175","Dale Street","01750005",null,"04 - 05","NT",366,null,"ES",11,17.600000000000001]
["0281","Daniel B Brunton","02810035",null,"K  - 05","SW",453,null,"ES",348,556.80000000000007]
["0026","Daniel Butler","00260015",null,"K  - 04","TA",393,null,"ES",40,64]
["0307","Daniel Feeney Preschool Center","03070002",null,"PK","NT",77,null,"EES",10,16]
["0347","Daniel L Joyce Middle School","03470410",null,"06 - 08","NT",518,null,"MS",110,176]
["0347","Daniel P Hurld","03470020",null,"K  - 05","NT",215,null,"ES",28,44.800000000000004]
["0171","Daniel Webster","01710015",null,"PK - 05","TA",411,null,"ES",67,107.2]
["0035","Dante Alighieri Montessori School","00350066",null,"PK - 05","SW",92,null,"ES",27,43.2]
["0071","Danvers High","00710505",null,"09 - 12","NT",944,null,"HS",118,188.8]
["0072","Dartmouth High","00720505",null,"09 - 12","NT",1069,null,"HS",160,256]
["0072","Dartmouth Middle","00720050",null,"06 - 08","NT",965,null,"MS",205,328]
["0035","David A Ellis","00350072",null,"PK - 05","SW",449,null,"ES",363,580.80000000000007]
["0141","David J. Quinn Middle School","01410410",null,"05 - 07","NT",649,null,"MS",143,228.8]
["0014","David Mindess","00140015",null,"03 - 05","TA",648,null,"ES",79,126.4]
["0767","David Prouty High","07670505",null,"09 - 12","TA",299,null,"HS",104,166.4]
["0775","Davis Hill Elementary","07750018",null,"K  - 05","NT",472,null,"ES",56,89.600000000000009]
["0101","Davis Thayer","01010035",null,"K  - 05","TA",226,null,"ES",46,73.600000000000009]
["0775","Dawson","07750020",null,"K  - 05","NT",489,null,"ES",42,67.2]
["0326","Day Elementary","03260007",null,"03 - 05","TA",361,null,"ES",25,40]
["0050","Dean S Luce","00500020",null,"K  - 05","TA",498,null,"ES",76,121.60000000000001]
["0035","Dearborn","00350074",null,"06 - 12","SW",341,null,"MSHS/K-12",207,331.20000000000005]
["0073","Dedham High","00730505",null,"09 - 12","NT",749,null,"HS",149,238.4]
["0073","Dedham Middle School","00730305",null,"06 - 08","NT",611,null,"MS",130,208]
["0065","Deer Hill","00650005",null,"03 - 05","TA",389,null,"ES",22,35.200000000000003]
["0074","Deerfield Elementary","00740015",null,"PK - 06","TA",410,null,"ES",78,124.80000000000001]
["0335","Deerfield School","03350010",null,"K  - 05","NT",201,null,"ES",7,11.200000000000001]
["0350","Delaney","03500003",null,"PK - 03","TA",578,null,"ES",65,104]
["0240","Dennett Elementary","02400010",null,"K  - 06","TA",204,null,"ES",36,57.6]
["0035","Dennis C Haley","00350077",null,"PK - 08","SW",457,null,"ESMS",186,297.60000000000002]
["0645","Dennis-Yarmouth Regional High","06450505",null,"08 - 12","NT",1034,null,"MSHS/K-12",356,569.6]
["0093","Devens School","00930030",null,"01 - 12","NT",62,null,"MSHS/K-12",44,70.400000000000006]
["0223","Dexter Park","02230010",null,"03 - 06","SW",312,null,"ES",164,262.40000000000003]
["0650","Dighton Elementary","06500005",null,"K  - 04","TA",470,null,"ES",78,124.80000000000001]
["0650","Dighton Middle School","06500305",null,"05 - 08","NT",401,null,"MS",70,112]
["0650","Dighton-Rehoboth Regional High School","06500505",null,"PK,09 - 12","NT",909,null,"HS",111,177.60000000000002]
["0821","Diman Regional Vocational Technical High","08210605",null,"09 - 12","SW",1377,null,"HS",496,793.6]
["0114","Discovery School at Four Corners","01140025",null,"K  - 04","NT",252,null,"ES",62,99.2]
["0348","Doherty Memorial High","03480512",null,"09 - 12","NT",1564,null,"HS",667,1067.2]
["0009","Doherty Middle","00090305",null,"06 - 08","NT",554,null,"MS",33,52.800000000000004]
["0305","Dolbeare","03050005",null,"K  - 04","NT",445,null,"ES",43,68.8]
["0035","Donald Mckay","00350080",null,"PK - 08","SW",774,null,"ESMS",461,737.6]
["0181","Donald P Timony Grammar","01810060",null,"PK - 08","TA",1376,null,"ESMS",575,920]
["0040","Donald Ross","00400050",null,"K  - 05","SW",276,null,"ES",86,137.6]
["0035","Dorchester Academy","00350651",null,"09 - 12","SW",21,null,"HS",13,20.8]
["0650","Dorothy L Beckwith","06500310",null,"05 - 08","NT",585,null,"MS",95,152]
["0077","Douglas Elementary School","00770015",null,"02 - 05","TA",365,null,"ES",57,91.2]
["0077","Douglas High School","00770505",null,"09 - 12","NT",387,null,"HS",46,73.600000000000009]
["0308","Douglas MacArthur Elementary School","03080032",null,"K  - 05","SW",435,null,"ES",83,132.80000000000001]
["0077","Douglas Middle School","00770305",null,"06 - 08","NT",345,null,"MS",58,92.800000000000011]
["0077","Douglas Primary School","00770005",null,"PK - 01","TA",229,null,"EES",40,64]
["0262","Douglas Waybright","02620067",null,"PK - 05","SW",246,null,"ES",62,99.2]
["0655","Dover-Sherborn Regional High","06550505",null,"09 - 12","NT",672,null,"HS",38,60.800000000000004]
["0655","Dover-Sherborn Regional Middle School","06550405",null,"06 - 08","TA",524,null,"MS",14,22.400000000000002]
["0044","Downey","00440110",null,"K  - 05","SW",643,null,"ES",399,638.40000000000009]
["0335","Downey","03350012",null,"K  - 05","NT",257,null,"ES",23,36.800000000000004]
["0160","Dr An Wang School","01600345",null,"05 - 08","SW",702,null,"MS",358,572.80000000000007]
["0745","Dr Frederick N Sweetsir","07450020",null,"PK - 02","TA",225,null,"EES",36,57.6]
["0160","Dr Gertrude Bailey","01600002",null,"PK - 04","SW",501,null,"ES",220,352]
["0745","Dr John C Page School","07450015",null,"PK - 06","NT",344,null,"ES",26,41.6]
["0128","Dr Paul Nettle","01280050",null,"05 - 08","SW",509,null,"MS",256,409.6]
["0044","Dr W Arnone Community School","00440001",null,"K  - 05","SW",716,null,"ES",459,734.40000000000009]
["0035","Dr. Catherine Ellison-Rosa Parks Early Ed School","00350008",null,"PK - 03","SW",199,null,"ES",135,216]
["0265","Dr. Kevin M. Hurley Middle School","02650405",null,"06 - 08","TA",511,null,"MS",66,105.60000000000001]
["0220","Dr. Philip O. Coakley Middle School","02200305",null,"06 - 08","NT",742,null,"MS",184,294.40000000000003]
["0035","Dr. William Henderson Lower","00350266",null,"PK - 01","SW",216,null,"EES",86,137.6]
["0035","Dr. William Henderson Upper","00350426",null,"02 - 12","SW",636,null,"MSHS/K-12",335,536]
["0079","Dracut Senior High","00790505",null,"09 - 12","NT",835,null,"HS",123,196.8]
["0209","Drury High","02090505",null,"07 - 12","NT",521,null,"MSHS/K-12",267,427.20000000000005]
["0658","Dudley Elementary","06580005",null,"02 - 04","SW",394,null,"ES",107,171.20000000000002]
["0658","Dudley Middle School","06580305",null,"05 - 08","TA",583,null,"MS",135,216]
["0407","Dudley Street Neighborhood Charter School","04070405",null,"PK - 05","SW",287,null,"ES",163,260.8]
["0061","Dupont Middle","00610310",null,"06 - 08","SW",748,null,"MS",407,651.20000000000005]
["0082","Duxbury High","00820505",null,"09 - 12","NT",1049,null,"HS",54,86.4]
["0082","Duxbury Middle","00820305",null,"06 - 08","NT",742,null,"MS",47,75.2]
["0217","E Ethel Little School","02170003",null,"PK - 05","TA",333,null,"ES",40,64]
["0163","E J Harrington","01630045",null,"PK - 05","SW",635,null,"ES",468,748.80000000000007]
["0137","E N White Elementary","01370045",null,"PK - 08","SW",524,null,"ESMS",387,619.20000000000005]
["0274","E Somerville Community","02740111",null,"K  - 08","SW",705,null,"ESMS",364,582.4]
["0335","E W Thurston Middle","03350305",null,"06 - 08","NT",792,null,"MS",33,52.800000000000004]
["0171","Eames Way School","01710005",null,"K  - 05","TA",243,null,"ES",16,25.6]
["0073","Early Childhood Center","00730005",null,"PK - K","TA",281,null,"EES",65,104]
["0163","Early Childhood Center","01630004",null,"PK - 05","SW",314,null,"EES",201,321.60000000000002]
["0170","Early Childhood Center","01700006",null,"PK","NT",206,null,"EES",59,94.4]
["0178","Early Childhood Center","01780003",null,"PK","NT",323,null,"EES",25,40]
["0775","Early Childhood Center","07750001",null,"PK","NT",183,null,"EES",30,48]
["0305","Early Childhood Center at the Doyle School","03050001",null,"PK","NT",138,null,"EES",20,32]
["0281","Early Childhood Education Center","02810001",null,"PK","NT",190,null,"EES",150,240]
["0016","Early Learning Center","00160008",null,"PK","NT",202,null,"EES",77,123.2]
["0035","East Boston Early Childhood Center","00350009",null,"PK - 01","SW",195,null,"EES",108,172.8]
["0035","East Boston High","00350530",null,"09 - 12","SW",1351,null,"HS",759,1214.4000000000001]
["0083","East Bridgewater JR./SR. High School","00830505",null,"07 - 12","NT",1033,null,"MSHS/K-12",146,233.60000000000002]
["0767","East Brookfield Elementary","07670008",null,"PK - 06","TA",246,null,"ES",72,115.2]
["0266","East Elementary","02660010",null,"K  - 05","NT",494,null,"ES",39,62.400000000000006]
["0131","East Elementary School","01310005",null,"PK - 05","TA",535,null,"ES",29,46.400000000000006]
["0094","East Fairhaven","00940010",null,"PK - 05","TA",421,null,"ES",146,233.60000000000002]
["0096","East Falmouth Elementary","00960005",null,"K  - 04","SW",260,null,"ES",117,187.20000000000002]
["0107","East Gloucester Elementary","01070020",null,"K  - 05","TA",215,null,"ES",71,113.60000000000001]
["0087","East Longmeadow High","00870505",null,"09 - 12","NT",835,null,"HS",124,198.4]
["0111","East Meadow","01110004",null,"04 - 06","TA",148,null,"ES",32,51.2]
["0040","East Middle School","00400305",null,"06 - 08","NT",722,null,"MS",157,251.20000000000002]
["0044","East Middle School","00440405",null,"06 - 08","NT",498,null,"MS",294,470.40000000000003]
["0161","East Street Elementary School","01610010",null,"PK - 01","TA",415,null,"EES",145,232]
["0293","East Taunton Elementary","02930010",null,"K  - 04","SW",622,null,"ES",220,352]
["0277","Eastford Road","02770010",null,"PK - 01","SW",406,null,"EES",309,494.40000000000003]
["0085","Eastham Elementary","00850005",null,"PK - 05","TA",184,null,"ES",36,57.6]
["0086","Easthampton High","00860505",null,"09 - 12","NT",464,null,"HS",115,184]
["0088","Easton Middle School","00880405",null,"06 - 08","TA",890,null,"MS",112,179.20000000000002]
["0041","Eddy Elementary","00410010",null,"03 - 05","TA",240,null,"ES",52,83.2]
["0057","Edgar A Hooks Elementary","00570030",null,"01 - 04","SW",568,null,"ES",385,616]
["0044","Edgar B Davis","00440023",null,"K  - 08","SW",1031,null,"ESMS",569,910.40000000000009]
["0089","Edgartown Elementary","00890005",null,"PK - 08","TA",342,null,"ESMS",96,153.60000000000002]
["0044","Edison Academy","00440520",null,"09 - 12","NT",232,null,"HS",145,232]
["0035","Edison K-8","00350375",null,"PK - 08","SW",651,null,"ESMS",404,646.40000000000009]
["0046","Edith C Baker","00460005",null,"K  - 08","NT",753,null,"ESMS",65,104]
["0293","Edmund Hatch Bennett","02930007",null,"K  - 04","SW",327,null,"ES",99,158.4]
["0163","Edward A Sisson","01630095",null,"K  - 05","SW",436,null,"ES",174,278.40000000000003]
["0046","Edward Devotion","00460015",null,"K  - 08","TA",812,null,"ESMS",98,156.80000000000001]
["0035","Edward Everett","00350088",null,"PK - 05","SW",270,null,"ES",174,278.40000000000003]
["0293","Edward F. Leddy Preschool","02930005",null,"PK","NT",383,null,"EES",175,280]
["0149","Edward F. Parthum","01490053",null,"K  - 04","SW",661,null,"ES",407,651.20000000000005]
["0204","Edward G. Molin Elementary School","02040030",null,"04 - 05","NT",321,null,"ES",31,49.6]
["0452","Edward M. Kennedy Academy for Health Careers (Horace Mann Charter School)","04520505",null,"09 - 12","SW",359,null,"HS",200,320]
["0281","Edward P. Boland School","02810010",null,"PK - 05","SW",794,null,"ES",654,1046.4000000000001]
["0285","Edwin A Jones Early Childhood Center","02850012",null,"PK","NT",111,null,"EES",24,38.400000000000006]
["0236","Egremont","02360035",null,"K  - 05","NT",436,null,"ES",192,307.20000000000005]
["0168","Elbridge Gerry","01680015",null,"K  - 01","NT",137,null,"EES",24,38.400000000000006]
["0035","ELC - West Zone","00350006",null,"PK - 01","SW",125,null,"EES",60,96]
["0307","Eleanor N Johnson Middle","03070310",null,"06 - 08","NT",444,null,"MS",29,46.400000000000006]
["0281","Elias Brookings","02810030",null,"PK - 05","SW",362,null,"ES",311,497.6]
["0035","Eliot Elementary","00350096",null,"PK - 08","SW",637,null,"ESMS",137,219.20000000000002]
["0201","Elizabeth Carter Brooks","02010015",null,"PK - 05","SW",303,null,"ES",199,318.40000000000003]
["0244","Elizabeth G Lyons Elementary","02440020",null,"K  - 05","SW",307,null,"ES",130,208]
["0293","Elizabeth Pole","02930027",null,"K  - 04","SW",604,null,"ES",337,539.20000000000005]
["0292","Elizabeth S Brown","02920006",null,"03 - 05","TA",279,null,"ES",59,94.4]
["0201","Ellen R Hathaway","02010075",null,"PK - 05","SW",314,null,"ES",222,355.20000000000005]
["0035","Ellis Mendell","00350100",null,"PK - 05","SW",263,null,"ES",91,145.6]
["0348","Elm Park Community","03480095",null,"K  - 06","SW",501,null,"ES",384,614.40000000000009]
["0103","Elm Street School","01030001",null,"02 - 04","SW",554,null,"ES",291,465.6]
["0307","Elm Street School","03070005",null,"K  - 05","TA",439,null,"ES",45,72]
["0745","Elmer S Bagnall","07450005",null,"PK - 06","NT",511,null,"ES",63,100.80000000000001]
["0139","Elmwood","01390010",null,"02 - 03","NT",513,null,"ES",17,27.200000000000003]
["0186","Elmwood Street","01860017",null,"PK - 03","TA",584,null,"ES",167,267.2]
["0321","Elsie A Hastings Elementary","03210025",null,"PK - 03","NT",510,null,"ES",57,91.2]
["0201","Elwyn G Campbell","02010020",null,"PK - 05","SW",281,null,"ES",152,243.20000000000002]
["0149","Emily G Wetherbee","01490080",null,"K  - 08","SW",706,null,"ESMS",461,737.6]
["0263","Emma L Miller Elementary School","02630010",null,"PK - 05","TA",57,null,"ES",23,36.800000000000004]
["0020","Enoch Cobb Early Learning Center","00200001",null,"PK","NT",171,null,"EES",60,96]
["0288","Ephraim Curtis Middle","02880305",null,"06 - 08","TA",938,null,"MS",46,73.600000000000009]
["0317","Ernest F Upham","03170050",null,"K  - 05","NT",238,null,"ES",12,19.200000000000003]
["0091","Erving Elementary","00910030",null,"PK - 06","TA",145,null,"ES",41,65.600000000000009]
["0698","Essex Elementary","06980020",null,"K  - 05","TA",223,null,"ES",23,36.800000000000004]
["0817","Essex Technical High School","08170505",null,"09 - 12","TA",1367,null,"HS",241,385.6]
["0031","Eugene C Vining","00310030",null,"K  - 05","TA",195,null,"ES",44,70.400000000000006]
["0057","Eugene Wright Science and Technology Academy","00570045",null,"05 - 08","SW",528,null,"MS",345,552]
["0093","Everett High","00930505",null,"09 - 12","NT",1976,null,"HS",835,1336]
["0167","Everett W Robinson","01670007",null,"K  - 02","TA",732,null,"EES",109,174.4]
["0410","Excel Academy Charter School","04100205",null,"05 - 11","SW",1127,null,"MSHS/K-12",470,752]
["0035","Excel High School","00350522",null,"09 - 12","SW",523,null,"HS",345,552]
["0645","Ezra H Baker Innovation School","06450005",null,"PK - 04","SW",345,null,"ES",155,248]
["0220","F A Cleveland","02200015",null,"01 - 05","NT",335,null,"ES",59,94.4]
["0207","F A Day Middle","02070315",null,"06 - 08","NT",977,null,"MS",87,139.20000000000002]
["0094","Fairhaven High","00940505",null,"09 - 12","NT",648,null,"HS",138,220.8]
["0061","Fairview Elementary","00610050",null,"K  - 05","SW",459,null,"ES",320,512]
["0153","Fall Brook","01530007",null,"K  - 05","SW",654,null,"ES",222,355.20000000000005]
["0095","Fall River Gateway to College @ BCC","00950515",null,"12","NT",1,null,"HS",0,0]
["0212","Falls","02120010",null,"K  - 05","NT",274,null,"ES",46,73.600000000000009]
["0096","Falmouth High","00960505",null,"09 - 12","NT",825,null,"HS",193,308.8]
["0213","Fannie E Proctor","02130015",null,"K  - 05","TA",249,null,"ES",34,54.400000000000006]
["0662","Farmington River Elementary","06620020",null,"PK - 06","TA",125,null,"ES",40,64]
["0163","Fecteau-Leary Junior/Senior High School","01630525",null,"07 - 12","SW",108,null,"MSHS/K-12",79,126.4]
["0239","Federal Furnace School","02390011",null,"K  - 05","SW",391,null,"ES",133,212.8]
["0114","Federal Street School","01140010",null,"K  - 04","SW",252,null,"ES",154,246.4]
["0035","Fenway High School","00350540",null,"09 - 12","SW",361,null,"HS",195,312]
["0165","Ferryway","01650013",null,"K  - 08","SW",893,null,"ESMS",414,662.40000000000009]
["0330","Field Elementary School","03300012",null,"04 - 05","NT",327,null,"ES",18,28.8]
["0307","Fisher","03070015",null,"K  - 05","NT",452,null,"ES",37,59.2]
["0223","Fisher Hill","02230015",null,"PK - 02","SW",273,null,"EES",160,256]
["0155","Fiske","01550015",null,"K  - 05","NT",503,null,"ES",22,35.200000000000003]
["0097","Fitchburg High","00970505",null,"PK,09 - 12","SW",1184,null,"HS",641,1025.6000000000001]
["0348","Flagg Street","03480090",null,"K  - 06","NT",398,null,"ES",105,168]
["0049","Fletcher/Maynard Academy","00490090",null,"PK - 05","SW",296,null,"ES",126,201.60000000000002]
["0271","Floral Street School","02710020",null,"01 - 04","TA",749,null,"ES",73,116.80000000000001]
["0673","Florence Roche School","06730010",null,"K  - 04","NT",521,null,"ES",46,73.600000000000009]
["0725","Florence Sawyer School","07250025",null,"PK - 08","NT",770,null,"ESMS",43,68.8]
["0141","Forest Avenue Elementary","01410015",null,"K  - 04","TA",362,null,"ES",83,132.80000000000001]
["0348","Forest Grove Middle","03480415",null,"07 - 08","NT",1002,null,"MS",468,748.80000000000007]
["0281","Forest Park Middle","02810325",null,"06 - 08","SW",729,null,"MS",593,948.80000000000007]
["0165","Forestdale","01650027",null,"K  - 08","SW",571,null,"ESMS",220,352]
["0261","Forestdale School","02610002",null,"PK - 02","TA",660,null,"EES",146,233.60000000000002]
["0325","Fort Meadow Early Childhood Center","03250003",null,"PK","NT",229,null,"EES",112,179.20000000000002]
["0008","Fort River Elementary","00080020",null,"K  - 06","TA",332,null,"ES",123,196.8]
["0413","Four Rivers Charter Public School","04130505",null,"07 - 12","TA",220,null,"MSHS/K-12",57,91.2]
["0174","Fowler School","01740305",null,"04 - 08","TA",521,null,"ESMS",90,144]
["0048","Fox Hill","00480007",null,"K  - 05","NT",398,null,"ES",31,49.6]
["0099","Foxborough High","00990505",null,"09 - 12","NT",809,null,"HS",120,192]
["0446","Foxborough Regional Charter School","04460550",null,"K  - 12","TA",1464,null,"MSHS/K-12",280,448]
["0100","Framingham High School","01000515",null,"09 - 12","NT",2169,null,"HS",570,912]
["0153","Frances Drake School","01530010",null,"K  - 05","SW",561,null,"ES",278,444.8]
["0170","Francis J Kane","01700008",null,"K  - 04","SW",613,null,"ES",191,305.60000000000002]
["0348","Francis J McGrath Elementary","03480177",null,"K  - 06","SW",232,null,"ES",122,195.20000000000002]
["0149","Francis M Leahy","01490040",null,"K  - 05","SW",513,null,"ES",356,569.6]
["0204","Francis T Bresnahan Elementary","02040005",null,"PK - 03","TA",615,null,"ES",57,91.2]
["0243","Francis W Parker","02430075",null,"K  - 05","SW",317,null,"ES",136,217.60000000000002]
["0478","Francis W. Parker Charter Essential School","04780505",null,"07 - 12","NT",397,null,"MSHS/K-12",27,43.2]
["0048","Francis Wyman Elementary","00480035",null,"K  - 05","TA",531,null,"ES",63,100.80000000000001]
["0281","Frank H Freedman","02810075",null,"K  - 05","SW",355,null,"ES",276,441.6]
["0057","Frank M Sokolowski Elementary","00570040",null,"01 - 04","SW",570,null,"ES",403,644.80000000000007]
["0207","Franklin","02070055",null,"K  - 05","NT",427,null,"ES",33,52.800000000000004]
["0211","Franklin","02110010",null,"K  - 05","NT",458,null,"ES",36,57.6]
["0325","Franklin Ave","03250015",null,"K  - 05","SW",244,null,"ES",160,256]
["0818","Franklin County Technical","08180605",null,"09 - 12","SW",476,null,"HS",167,267.2]
["0035","Franklin D Roosevelt","00350116",null,"PK - 08","SW",448,null,"ESMS",194,310.40000000000003]
["0101","Franklin Early Childhood Development Center","01010003",null,"PK","NT",114,null,"EES",13,20.8]
["0101","Franklin High","01010505",null,"09 - 12","NT",1780,null,"HS",115,184]
["0336","Frederick C Murphy","03360050",null,"K  - 04","TA",247,null,"ES",67,107.2]
["0044","Frederick Douglass Academy","00440080",null,"07 - 11","NT",61,null,"MSHS/K-12",48,76.800000000000011]
["0281","Frederick Harris","02810080",null,"PK - 05","SW",639,null,"ES",450,720]
["0031","Frederick J Dutile","00310007",null,"K  - 05","TA",277,null,"ES",47,75.2]
["0622","Frederick W. Hartnett Middle School","06220405",null,"06 - 08","TA",423,null,"MS",71,113.60000000000001]
["0208","Freeman-Kennedy School","02080005",null,"03 - 06","NT",488,null,"ES",23,36.800000000000004]
["0665","Freetown Elementary School","06650001",null,"PK - 03","TA",426,null,"ES",101,161.60000000000002]
["0665","Freetown-Lakeville Middle School","06650305",null,"06 - 08","NT",745,null,"MS",121,193.60000000000002]
["0670","Frontier Regional","06700505",null,"07 - 12","TA",620,null,"MSHS/K-12",119,190.4]
["0149","Frost Middle School","01490525",null,"05 - 08","SW",518,null,"MS",287,459.20000000000005]
["0274","Full Circle High School","02740510",null,"09 - 12","SW",55,null,"HS",38,60.800000000000004]
["0184","Fuller Meadow","01840003",null,"K  - 02","TA",229,null,"EES",20,32]
["0100","Fuller Middle","01000305",null,"06 - 08","SW",540,null,"MS",245,392]
["0171","Furnace Brook Middle","01710310",null,"06 - 08","TA",970,null,"MS",108,172.8]
["0305","Galvin Middle School","03050310",null,"05 - 08","TA",1044,null,"MS",141,225.60000000000002]
["0292","Gardner","02920015",null,"K  - 02","TA",264,null,"EES",55,88]
["0103","Gardner Academy for Learning and Technology","01030515",null,"09 - 12","NT",71,null,"HS",42,67.2]
["0103","Gardner High","01030505",null,"08 - 12","NT",682,null,"MSHS/K-12",289,462.40000000000003]
["0103","Gardner Middle School","01030405",null,"05 - 07","SW",550,null,"MS",282,451.20000000000005]
["0035","Gardner Pilot Academy","00350326",null,"PK - 08","SW",399,null,"ESMS",216,345.6]
["0248","Garfield Elementary School","02480056",null,"PK - 05","SW",774,null,"ES",410,656]
["0248","Garfield Middle School","02480057",null,"06 - 08","SW",544,null,"MS",244,390.40000000000003]
["0348","Gates Lane","03480110",null,"PK - 06","SW",596,null,"ES",355,568]
["0264","Gates Middle School","02640305",null,"06 - 08","TA",718,null,"MS",68,108.80000000000001]
["0672","Gateway Regional High","06720505",null,"09 - 12","NT",207,null,"HS",53,84.800000000000011]
["0672","Gateway Regional Middle School","06720405",null,"06 - 08","NT",196,null,"MS",55,88]
["0304","Gateway to College","03040515",null,"10 - 12","NT",47,null,"HS",10,16]
["0281","Gateway to College at Holyoke Community College","02810575",null,"10 - 12","SW",26,null,"HS",18,28.8]
["0281","Gateway to College at Springfield Technical Community College","02810580",null,"09 - 12","SW",42,null,"HS",31,49.6]
["0061","Gen John J Stefanik","00610090",null,"K  - 05","SW",412,null,"ES",312,499.20000000000005]
["0288","General John Nixon Elementary","02880025",null,"K  - 05","NT",344,null,"ES",24,38.400000000000006]
["0057","George F. Kelly Elementary","00570035",null,"01 - 04","SW",540,null,"ES",326,521.6]
["0220","George F. Willett","02200075",null,"PK - K","TA",387,null,"EES",99,158.4]
["0035","George H Conley","00350122",null,"PK - 05","SW",228,null,"ES",110,176]
["0072","George H Potter","00720030",null,"PK - 05","TA",418,null,"ES",132,211.20000000000002]
["0079","George H. Englesby Elementary School","00790045",null,"K  - 05","SW",521,null,"ES",153,244.8]
["0093","George Keverian School","00930028",null,"K  - 08","SW",878,null,"ESMS",454,726.40000000000009]
["0665","George R Austin Intermediate School","06650015",null,"04 - 05","TA",438,null,"ES",76,121.60000000000001]
["0265","George R Martin","02650007",null,"PK - 05","TA",489,null,"ES",74,118.4]
["0105","Georgetown High School","01050505",null,"09 - 12","NT",399,null,"HS",32,51.2]
["0105","Georgetown Middle School","01050305",null,"07 - 08","NT",228,null,"MS",21,33.6]
["0149","Gerard A. Guilmette","01490022",null,"01 - 04","SW",506,null,"ES",357,571.20000000000005]
["0281","German Gerena Community School","02810195",null,"PK - 05","SW",730,null,"ES",592,947.2]
["0674","Gill Elementary","06740005",null,"K  - 06","NT",132,null,"ES",32,51.2]
["0044","Gilmore Elementary School","00440055",null,"K  - 05","SW",554,null,"ES",360,576]
["0159","Glenbrook Middle","01590017",null,"06 - 08","TA",343,null,"MS",28,44.800000000000004]
["0281","Glenwood","02810065",null,"K  - 05","SW",308,null,"ES",227,363.20000000000005]
["0775","Glenwood Elementary School","07750060",null,"03 - 05","TA",346,null,"ES",48,76.800000000000011]
["0281","Glickman Elementary","02810068",null,"K  - 05","SW",324,null,"ES",249,398.40000000000003]
["0496","Global Learning Charter Public School","04960305",null,"05 - 12","SW",503,null,"MSHS/K-12",257,411.20000000000005]
["0107","Gloucester High","01070505",null,"09 - 12","NT",799,null,"HS",278,444.8]
["0107","Gloucester PreSchool","01070025",null,"PK","NT",129,null,"EES",53,84.800000000000011]
["0168","Glover","01680020",null,"PK - 03","NT",380,null,"ES",26,41.6]
["0189","Glover","01890010",null,"K  - 05","NT",585,null,"ES",22,35.200000000000003]
["0348","Goddard School/Science Technical","03480100",null,"PK - 06","SW",466,null,"ES",327,523.20000000000005]
["0128","Golden Hill","01280026",null,"01 - 04","SW",508,null,"ES",293,468.8]
["0097","Goodrich Academy","00970510",null,"09 - 12","NT",201,null,"HS",119,190.4]
["0347","Goodyear Elementary School","03470005",null,"K  - 05","SW",305,null,"ES",111,177.60000000000002]
["0083","Gordon W Mitchell","00830010",null,"03 - 06","NT",664,null,"ES",113,180.8]
["0171","Gov Edward Winslow","01710020",null,"K  - 05","TA",414,null,"ES",47,75.2]
["0823","Gr Lawrence Regional Vocational Technical","08230605",null,"09 - 12","SW",1492,null,"HS",762,1219.2]
["0828","Gr Lowell Regional Vocational Technical","08280605",null,"09 - 12","SW",2201,null,"HS",950,1520]
["0825","Gr New Bedford Vocational Technical","08250605",null,"09 - 12","SW",2132,null,"HS",805,1288]
["0219","Grace Farrar Cole","02190005",null,"PK - 05","NT",476,null,"ES",25,40]
["0110","Grafton High School","01100505",null,"09 - 12","NT",824,null,"HS",83,132.80000000000001]
["0110","Grafton Middle","01100305",null,"07 - 08","NT",526,null,"MS",42,67.2]
["0348","Grafton Street","03480115",null,"K  - 06","SW",410,null,"ES",309,494.40000000000003]
["0049","Graham and Parks","00490080",null,"PK - 05","SW",395,null,"ES",93,148.80000000000001]
["0111","Granby Jr Sr High School","01110505",null,"07 - 12","NT",342,null,"MSHS/K-12",73,116.80000000000001]
["0191","Granite Valley Middle","01910310",null,"05 - 08","TA",282,null,"MS",65,104]
["0674","Great Falls Middle","06740310",null,"06 - 08","NT",243,null,"MS",102,163.20000000000002]
["0071","Great Oak","00710015",null,"K  - 05","TA",379,null,"ES",63,100.80000000000001]
["0035","Greater Egleston Community High School","00350543",null,"10 - 12","SW",149,null,"HS",96,153.60000000000002]
["0174","Green Meadow","01740010",null,"PK - 03","TA",494,null,"ES",83,132.80000000000001]
["0680","Green Meadows Elementary","06800005",null,"PK - 05","TA",255,null,"ES",49,78.400000000000006]
["0114","Greenfield High","01140505",null,"08 - 12","SW",457,null,"MSHS/K-12",202,323.20000000000005]
["0114","Greenfield Middle","01140305",null,"05 - 07","SW",382,null,"MS",190,304]
["0160","Greenhalge","01600015",null,"PK - 04","SW",508,null,"ES",366,585.6]
["0128","Greenleaf Kindergarten Center","01280027",null,"K","NT",107,null,"EES",72,115.2]
["0073","Greenlodge","00730025",null,"01 - 05","NT",268,null,"ES",21,33.6]
["0079","Greenmont Avenue","00790030",null,"K  - 05","SW",291,null,"ES",87,139.20000000000002]
["0305","Greenwood","03050020",null,"K  - 04","NT",223,null,"ES",17,27.200000000000003]
["0209","Greylock","02090015",null,"PK - 06","SW",294,null,"ES",170,272]
["0673","Groton Dunstable Regional","06730505",null,"09 - 12","NT",784,null,"HS",35,56]
["0673","Groton Dunstable Regional Middle","06730305",null,"05 - 08","NT",766,null,"MS",52,83.2]
["0149","Guilmette Middle School","01490025",null,"05 - 08","SW",491,null,"MS",329,526.4]
["0293","H H Galligan","02930057",null,"K  - 04","SW",238,null,"ES",160,256]
["0208","H Olive Day","02080015",null,"PK - 02","TA",474,null,"EES",28,44.800000000000004]
["0137","H.B. Lawrence School","01370070",null,"K  - 03","SW",276,null,"ES",242,387.20000000000005]
["0291","Hadley","02910010",null,"K  - 04","TA",294,null,"ES",58,92.800000000000011]
["0117","Hadley Elementary","01170015",null,"PK - 06","TA",285,null,"ES",57,91.2]
["0049","Haggerty","00490020",null,"PK - 05","NT",256,null,"ES",67,107.2]
["0031","Hajjar Elementary","00310026",null,"K  - 05","TA",461,null,"ES",94,150.4]
["0725","Hale","07250310",null,"06 - 08","NT",299,null,"MS",14,22.400000000000002]
["0118","Halifax Elementary","01180005",null,"K  - 06","TA",602,null,"ES",110,176]
["0675","Hamilton-Wenham Regional High","06750505",null,"09 - 12","NT",551,null,"HS",27,43.2]
["0499","Hampden Charter School of Science East","04990305",null,"06 - 12","SW",487,null,"MSHS/K-12",189,302.40000000000003]
["0683","Hampshire Regional High","06830505",null,"07 - 12","TA",703,null,"MSHS/K-12",109,174.4]
["0044","Hancock","00440045",null,"K  - 05","SW",660,null,"ES",294,470.40000000000003]
["0121","Hancock Elementary","01210005",null,"PK - 06","TA",44,null,"ES",11,17.600000000000001]
["0030","Hannah Elementary","00300033",null,"K  - 05","NT",401,null,"ES",85,136]
["0122","Hanover High","01220505",null,"09 - 12","NT",798,null,"HS",50,80]
["0122","Hanover Middle","01220305",null,"05 - 08","TA",831,null,"MS",81,129.6]
["0157","Hanscom Middle","01570305",null,"04 - 08","NT",267,null,"ESMS",6,9.6000000000000014]
["0157","Hanscom Primary","01570006",null,"PK - 03","TA",337,null,"ES",6,9.6000000000000014]
["0780","Hanson Middle School","07800315",null,"06 - 08","NT",396,null,"MS",66,105.60000000000001]
["0315","Happy Hollow School","03150015",null,"K  - 05","TA",392,null,"ES",31,49.6]
["0753","Hardwick Elementary","07530005",null,"K  - 06","TA",193,null,"ES",89,142.4]
["0010","Hardy","00100030",null,"K  - 05","TA",454,null,"ES",28,44.800000000000004]
["0167","Harold L Qualters Middle","01670035",null,"06 - 08","NT",942,null,"MS",119,190.4]
["0155","Harrington","01550030",null,"K  - 05","NT",492,null,"ES",29,46.400000000000006]
["0038","Harry Lee Cole","00380005",null,"PK - 02","TA",333,null,"EES",18,28.8]
["0035","Harvard-Kent","00350200",null,"PK - 05","SW",463,null,"ES",307,491.20000000000005]
["0712","Harwich Elementary School","07120002",null,"PK - 04","SW",552,null,"ES",150,240]
["0094","Hastings Middle","00940305",null,"06 - 08","TA",474,null,"MS",119,190.4]
["0127","Hatfield Elementary","01270005",null,"PK - 06","TA",252,null,"ES",39,62.400000000000006]
["0264","Hatherly Elementary","02640010",null,"K  - 05","NT",270,null,"ES",18,28.8]
["0128","Haverhill Alternative School","01280033",null,"06 - 12","NT",48,null,"MSHS/K-12",39,62.400000000000006]
["0128","Haverhill High","01280505",null,"09 - 12","SW",1820,null,"HS",638,1020.8000000000001]
["0685","Hawlemont Regional","06850005",null,"PK - 06","SW",164,null,"ES",85,136]
["0735","Hawthorne Brook","07350030",null,"05 - 08","NT",501,null,"MS",83,132.80000000000001]
["0201","Hayden/McFadden","02010078",null,"PK - 05","SW",691,null,"ES",567,907.2]
["0035","Haynes Early Education Center","00350010",null,"PK - 01","SW",218,null,"EES",147,235.20000000000002]
["0348","Head Start","03480002",null,"PK","NT",631,null,"EES",545,872]
["0348","Heard Street","03480136",null,"K  - 06","SW",294,null,"ES",132,211.20000000000002]
["0046","Heath","00460025",null,"PK - 08","NT",564,null,"ESMS",34,54.400000000000006]
["0295","Heath-Brook","02950010",null,"K  - 02","TA",346,null,"EES",51,81.600000000000009]
["0239","Hedge","02390010",null,"01 - 05","SW",155,null,"ES",80,128]
["0266","Heights Elementary","02660015",null,"K  - 05","TA",526,null,"ES",35,56]
["0285","Helen Hansen Elementary","02850010",null,"K  - 05","NT",227,null,"ES",62,99.2]
["0101","Helen Keller Elementary","01010012",null,"K  - 05","NT",408,null,"ES",37,59.2]
["0745","Helen R Donaghue School","07450010",null,"03 - 06","TA",234,null,"ES",41,65.600000000000009]
["0419","Helen Y. Davis Leadership Academy Charter Public School","04190305",null,"06 - 08","SW",214,null,"MS",121,193.60000000000002]
["0100","Hemenway","01000015",null,"K  - 05","NT",562,null,"ES",106,169.60000000000002]
["0218","Henri A. Yelle","02180060",null,"04 - 05","TA",397,null,"ES",70,112]
["0182","Henry B. Burkland Elementary School","01820008",null,"01 - 05","SW",568,null,"ES",190,304]
["0009","Henry C Sanborn Elementary","00090010",null,"K  - 05","TA",385,null,"ES",32,51.2]
["0014","Henry E Warren Elementary","00140010",null,"K  - 02","TA",619,null,"EES",72,115.2]
["0035","Henry Grew","00350135",null,"PK - 05","SW",248,null,"ES",164,262.40000000000003]
["0160","Henry J Robinson Middle","01600330",null,"05 - 08","SW",655,null,"MS",420,672]
["0095","Henry Lord Community School","00950017",null,"PK - 08","SW",658,null,"ESMS",522,835.2]
["0710","Henry P Clough","07100179",null,"PK - 04","NT",376,null,"ES",29,46.400000000000006]
["0308","Henry Whittemore Elementary School","03080065",null,"K  - 05","SW",445,null,"ES",236,377.6]
["0178","Herbert Clark Hoover","01780017",null,"K  - 05","NT",268,null,"ES",30,48]
["0658","Heritage School","06580030",null,"02 - 04","TA",482,null,"ES",92,147.20000000000002]
["0035","Higginson","00350015",null,"PK - 02","NT",177,null,"EES",152,243.20000000000002]
["0035","Higginson/Lewis K-8","00350377",null,"01 - 08","SW",292,null,"ESMS",236,377.6]
["0009","High Plain Elementary","00090004",null,"K  - 05","NT",516,null,"ES",33,52.800000000000004]
["0199","High Rock School","01990410",null,"06","NT",454,null,"MS",25,40]
["0149","High School Learning Center","01490536",null,"09 - 12","SW",223,null,"HS",133,212.8]
["0281","High School Of Commerce","02810510",null,"09 - 12","SW",1016,null,"HS",795,1272]
["0325","Highland","03250025",null,"K  - 05","SW",388,null,"ES",243,388.8]
["0040","Highlands","00400015",null,"K  - 05","NT",432,null,"ES",51,81.600000000000009]
["0071","Highlands","00710010",null,"K  - 05","TA",373,null,"ES",62,99.2]
["0125","Hildreth Elementary School","01250005",null,"PK - 05","TA",447,null,"ES",19,30.400000000000002]
["0455","Hill View Montessori Charter Public School","04550050",null,"K  - 08","TA",301,null,"ESMS",54,86.4]
["0674","Hillcrest Elementary School","06740015",null,"PK - 01","SW",164,null,"EES",91,145.6]
["0016","Hill-Roberts Elementary School","00160045",null,"K  - 04","NT",457,null,"ES",138,220.8]
["0199","Hillside Elementary","01990035",null,"K  - 05","NT",484,null,"ES",20,32]
["0450","Hilltown Cooperative Charter Public School","04500105",null,"K  - 08","TA",218,null,"ESMS",32,51.2]
["0131","Hingham High","01310505",null,"09 - 12","NT",1249,null,"HS",67,107.2]
["0131","Hingham Middle School","01310410",null,"06 - 08","TA",1073,null,"MS",62,99.2]
["0281","Hiram L Dorman","02810050",null,"K  - 05","SW",312,null,"ES",250,400]
["0231","Hobomock Elementary","02310010",null,"K  - 06","NT",420,null,"ES",32,51.2]
["0133","Holbrook Middle High School","01330505",null,"06 - 12","NT",584,null,"MSHS/K-12",190,304]
["0135","Holland Elementary","01350005",null,"PK - 06","TA",236,null,"ES",65,104]
["0040","Hollis","00400005",null,"K  - 05","NT",441,null,"ES",78,124.80000000000001]
["0136","Holliston High","01360505",null,"09 - 12","NT",797,null,"HS",40,64]
["0071","Holten Richmond Middle School","00710305",null,"06 - 08","NT",823,null,"MS",136,217.60000000000002]
["0453","Holyoke Community Charter School","04530005",null,"K  - 08","SW",702,null,"ESMS",463,740.80000000000007]
["0137","Holyoke High","01370505",null,"09 - 12","SW",1351,null,"HS",889,1422.4]
["0281","Homer Street","02810085",null,"K  - 05","SW",437,null,"ES",369,590.4]
["0163","Hood","01630055",null,"K  - 05","SW",493,null,"ES",303,484.8]
["0603","Hoosac Valley Elementary School","06030020",null,"PK - 03","SW",397,null,"ES",212,339.20000000000005]
["0603","Hoosac Valley High School","06030505",null,"08 - 12","NT",413,null,"MSHS/K-12",166,265.60000000000002]
["0603","Hoosac Valley Middle School","06030315",null,"04 - 07","NT",384,null,"ESMS",194,310.40000000000003]
["0138","Hopedale Jr Sr High","01380505",null,"07 - 12","NT",503,null,"MSHS/K-12",50,80]
["0293","Hopewell","02930035",null,"K  - 04","SW",285,null,"ES",169,270.40000000000003]
["0117","Hopkins Academy","01170505",null,"07 - 12","NT",240,null,"MSHS/K-12",38,60.800000000000004]
["0139","Hopkins Elementary School","01390015",null,"04 - 05","NT",551,null,"ES",31,49.6]
["0139","Hopkinton High","01390505",null,"09 - 12","NT",1162,null,"HS",55,88]
["0139","Hopkinton Middle School","01390305",null,"06 - 08","NT",815,null,"MS",35,56]
["0139","Hopkinton Pre-School","01390003",null,"PK","NT",66,null,"EES",5,8]
["0101","Horace Mann","01010405",null,"06 - 08","NT",468,null,"MS",34,54.400000000000006]
["0178","Horace Mann","01780025",null,"K  - 05","NT",276,null,"ES",7,11.200000000000001]
["0207","Horace Mann","02070075",null,"K  - 05","NT",408,null,"ES",40,64]
["0258","Horace Mann Laboratory","02580030",null,"K  - 05","SW",275,null,"ES",144,230.4]
["0035","Horace Mann School for the Deaf","00350750",null,"PK,K - 03,05 - 12","SW",85,null,"MSHS/K-12",66,105.60000000000001]
["0314","Hosmer","03140020",null,"PK - 05","TA",693,null,"ES",147,235.20000000000002]
["0775","Houghton Elementary","07750027",null,"K  - 04","NT",372,null,"ES",47,75.2]
["0323","Howard School","03230305",null,"04 - 06","TA",284,null,"ES",54,86.4]
["0184","Howe-Manning","01840005",null,"PK,03 - 06","NT",461,null,"ES",41,65.600000000000009]
["0753","Hubbardston Center","07530010",null,"K  - 06","NT",315,null,"ES",55,88]
["0164","Huckleberry Hill","01640010",null,"K  - 04","TA",428,null,"ES",38,60.800000000000004]
["0141","Hudson High","01410505",null,"08 - 12","NT",921,null,"MSHS/K-12",167,267.2]
["0035","Hugh Roe O'Donnell","00350141",null,"PK - 05","SW",258,null,"ES",161,257.60000000000002]
["0142","Hull High","01420505",null,"09 - 12","NT",294,null,"HS",81,129.6]
["0317","Hunnewell","03170025",null,"K  - 05","NT",249,null,"ES",7,11.200000000000001]
["0044","Huntington Therapeutic Day School","00440400",null,"02 - 12","NT",61,null,"MSHS/K-12",42,67.2]
["0020","Hyannis West Elementary","00200025",null,"K  - 03","SW",338,null,"ES",186,297.60000000000002]
["0016","Hyman Fine Elementary School","00160040",null,"K  - 04","SW",478,null,"ES",148,236.8]
["0753","IB School of Quabbin","07530515",null,"11 - 12","NT",13,null,"HS",4,6.4]
["0281","Impact Prep at Chestnut","02810366",null,"06 - 07","SW",235,null,"MS",216,345.6]
["0239","Indian Brook","02390012",null,"K  - 05","NT",576,null,"ES",122,195.20000000000002]
["0780","Indian Head","07800035",null,"03 - 05","NT",320,null,"ES",56,89.600000000000009]
["0281","Indian Orchard Elementary","02810100",null,"PK - 05","SW",667,null,"ES",530,848]
["0163","Ingalls","01630060",null,"K  - 05","SW",657,null,"ES",445,712]
["0435","Innovation Academy Charter School","04350305",null,"05 - 12","TA",798,null,"MSHS/K-12",86,137.6]
["0144","Ipswich High","01440505",null,"09 - 12","NT",515,null,"HS",51,81.600000000000009]
["0144","Ipswich Middle School","01440305",null,"06 - 08","NT",440,null,"MS",53,84.800000000000011]
["0201","Irwin M. Jacobs Elementary School","02010070",null,"PK - 05","SW",370,null,"ES",287,459.20000000000005]
["0288","Israel Loring School","02880015",null,"K  - 05","TA",463,null,"ES",42,67.2]
["0071","Ivan G Smith","00710032",null,"K  - 05","NT",280,null,"ES",43,68.8]
["0218","J C Solmonese","02180015",null,"PK - 03","TA",471,null,"ES",100,160]
["0244","J F Kennedy Elementary","02440018",null,"PK - 05","SW",498,null,"ES",262,419.20000000000005]
["0101","J F Kennedy Memorial","01010013",null,"K  - 05","NT",368,null,"ES",29,46.400000000000006]
["0198","J F Kennedy Middle School","01980305",null,"05 - 08","NT",641,null,"MS",49,78.400000000000006]
["0321","J Harding Armstrong","03210005",null,"K  - 03","NT",420,null,"ES",25,40]
["0229","J Henry Higgins Middle","02290305",null,"06 - 08","NT",1380,null,"MS",374,598.4]
["0217","J Turner Hood","02170010",null,"K  - 05","TA",334,null,"ES",28,44.800000000000004]
["0246","J Warren Killam","02460017",null,"K  - 05","TA",422,null,"ES",43,68.8]
["0024","Jabish Middle School","00240025",null,"07 - 08","NT",403,null,"MS",77,123.2]
["0035","Jackson Mann","00350013",null,"PK - 08","SW",656,null,"ESMS",440,704]
["0210","Jackson Street","02100020",null,"K  - 05","SW",356,null,"ES",95,152]
["0348","Jacob Hiatt Magnet","03480140",null,"PK - 06","SW",403,null,"ES",199,318.40000000000003]
["0201","James B Congdon","02010040",null,"K  - 05","SW",339,null,"ES",249,398.40000000000003]
["0005","James Clark School","00050030",null,"K  - 04","SW",335,null,"ES",95,152]
["0035","James Condon Elementary","00350146",null,"PK - 08","SW",924,null,"ESMS",620,992]
["0149","James F Hennessey","01490020",null,"PK - 02","SW",386,null,"EES",255,408]
["0308","James Fitzgerald Elementary School","03080060",null,"K  - 05","NT",442,null,"ES",114,182.4]
["0035","James J Chittick","00350154",null,"PK - 05","SW",320,null,"ES",231,369.6]
["0072","James M. Quinn School","00720040",null,"K  - 05","TA",635,null,"ES",156,249.60000000000002]
["0035","James Otis","00350156",null,"PK - 05","SW",404,null,"ES",218,348.8]
["0035","James P Timilty Middle","00350485",null,"06 - 08","SW",344,null,"MS",242,387.20000000000005]
["0314","James Russell Lowell","03140025",null,"PK - 05","TA",419,null,"ES",111,177.60000000000002]
["0160","James S Daley Middle School","01600315",null,"05 - 08","SW",693,null,"MS",294,470.40000000000003]
["0160","James Sullivan Middle School","01600340",null,"05 - 08","SW",646,null,"MS",382,611.20000000000005]
["0095","James Tansey","00950140",null,"K  - 05","NT",316,null,"ES",140,224]
["0035","James W Hennigan","00350153",null,"K  - 08","SW",604,null,"ESMS",444,710.40000000000009]
["0101","Jefferson Elementary","01010010",null,"K  - 05","NT",340,null,"ES",17,27.200000000000003]
["0251","Jefferson Elementary School","02510060",null,"K  - 04","SW",283,null,"ES",107,171.20000000000002]
["0264","Jenkins Elementary School","02640015",null,"K  - 05","NT",365,null,"ES",50,80]
["0035","Jeremiah E Burke High","00350525",null,"09 - 12","SW",475,null,"HS",296,473.6]
["0201","Jireh Swift","02010130",null,"K  - 05","SW",213,null,"ES",103,164.8]
["0010","John A Bishop","00100005",null,"K  - 05","NT",415,null,"ES",24,38.400000000000006]
["0326","John A. Crisafulli Elementary School","03260045",null,"03 - 05","NT",342,null,"ES",14,22.400000000000002]
["0332","John Ashley","03320005",null,"K","SW",237,null,"EES",105,168]
["0201","John Avery Parker","02010115",null,"PK - 05","SW",266,null,"ES",177,283.2]
["0201","John B Devalles","02010050",null,"K  - 05","SW",390,null,"ES",302,483.20000000000005]
["0149","John Breen School","01490003",null,"PK - K","SW",346,null,"EES",217,347.20000000000005]
["0317","John D Hardy","03170020",null,"K  - 05","NT",294,null,"ES",13,20.8]
["0177","John D Mc Govern Elementary","01770013",null,"PK - 01","TA",341,null,"EES",37,59.2]
["0035","John D Philbrick","00350172",null,"PK - 05","SW",168,null,"ES",86,137.6]
["0046","John D Runkle","00460045",null,"PK - 08","NT",626,null,"ESMS",45,72]
["0229","John E Burke","02290007",null,"K  - 05","NT",262,null,"ES",54,86.4]
["0229","John E. McCarthy","02290016",null,"PK - 05","SW",371,null,"ES",112,179.20000000000002]
["0199","John Eliot","01990020",null,"K  - 05","TA",396,null,"ES",36,57.6]
["0031","John F Kennedy","00310012",null,"K  - 05","NT",315,null,"ES",44,70.400000000000006]
["0035","John F Kennedy","00350166",null,"PK - 05","SW",404,null,"ES",285,456]
["0044","John F Kennedy","00440017",null,"K  - 05","SW",604,null,"ES",272,435.20000000000005]
["0050","John F Kennedy","00500017",null,"K  - 05","NT",532,null,"ES",53,84.800000000000011]
["0133","John F Kennedy","01330018",null,"PK - 05","TA",634,null,"ES",183,292.8]
["0274","John F Kennedy","02740083",null,"K  - 08","SW",451,null,"ESMS",130,208]
["0622","John F Kennedy Elementary","06220008",null,"K  - 02","TA",284,null,"EES",69,110.4]
["0281","John F Kennedy Middle","02810328",null,"06 - 08","SW",478,null,"MS",400,640]
["0308","John F Kennedy Middle","03080404",null,"06 - 08","SW",514,null,"MS",159,254.4]
["0210","John F Kennedy Middle School","02100410",null,"06 - 08","SW",611,null,"MS",164,262.40000000000003]
["0347","John F Kennedy Middle School","03470405",null,"06 - 08","NT",484,null,"MS",140,224]
["0293","John F Parker Middle","02930305",null,"05 - 07","NT",502,null,"MS",280,448]
["0295","John F. Ryan","02950023",null,"05 - 06","NT",519,null,"ES",61,97.600000000000009]
["0128","John G Whittier","01280085",null,"05 - 08","NT",539,null,"MS",219,350.40000000000003]
["0023","John Glenn Middle","00230305",null,"06 - 08","TA",583,null,"MS",45,72]
["0780","John H Duval","07800030",null,"K  - 05","TA",443,null,"ES",118,188.8]
["0099","John J Ahern","00990405",null,"05 - 08","NT",845,null,"MS",124,198.4]
["0095","John J Doran","00950045",null,"PK - 08","SW",523,null,"ESMS",409,654.40000000000009]
["0281","John J Duggan Middle","02810320",null,"06 - 12","SW",777,null,"MSHS/K-12",545,872]
["0176","John J McGlynn Elementary School","01760068",null,"PK - 05","TA",519,null,"ES",221,353.6]
["0160","John J Shaughnessy","01600050",null,"PK - 04","SW",480,null,"ES",283,452.8]
["0176","John J. McGlynn Middle School","01760320",null,"06 - 08","NT",458,null,"MS",169,270.40000000000003]
["0149","John K Tarbox","01490075",null,"01 - 05","SW",348,null,"ES",243,388.8]
["0049","John M Tobin","00490065",null,"PK - 05","NT",294,null,"ES",75,120]
["0220","John P Oldham","02200020",null,"01 - 05","TA",227,null,"ES",46,73.600000000000009]
["0332","John R Fausey","03320010",null,"01 - 05","NT",469,null,"ES",162,259.2]
["0236","John T Reid Middle","02360305",null,"06 - 08","NT",541,null,"MS",307,491.20000000000005]
["0182","John T. Nichols Middle","01820305",null,"06 - 08","NT",785,null,"MS",224,358.40000000000003]
["0035","John W McCormack","00350179",null,"06 - 08","SW",390,null,"MS",294,470.40000000000003]
["0251","John W Rogers Middle","02510305",null,"05 - 08","NT",649,null,"MS",211,337.6]
["0308","John W. McDevitt Middle School","03080415",null,"06 - 08","SW",630,null,"MS",200,320]
["0295","John W. Wynn Middle","02950305",null,"07 - 08","NT",581,null,"MS",86,137.6]
["0207","John Ward","02070120",null,"K  - 05","NT",307,null,"ES",9,14.4]
["0310","John William Decas","03100003",null,"K  - 02","SW",576,null,"EES",339,542.4]
["0035","John Winthrop","00350180",null,"PK - 05","SW",312,null,"ES",236,377.6]
["0153","Johnny Appleseed","01530025",null,"K  - 05","SW",665,null,"ES",274,438.40000000000003]
["0196","Johnson","01960010",null,"PK - 06","TA",148,null,"ES",25,40]
["0198","Johnson","01980031",null,"K  - 04","TA",230,null,"ES",30,48]
["0336","Johnson Early Childhood Center","03360003",null,"PK","NT",207,null,"EES",60,96]
["0155","Jonas Clarke Middle","01550305",null,"06 - 08","NT",931,null,"MS",50,80]
["0167","Jordan/Jackson Elementary","01670014",null,"03 - 05","NT",794,null,"ES",114,182.4]
["0079","Joseph A Campbell Elementary","00790020",null,"PK - 05","NT",578,null,"ES",106,169.60000000000002]
["0057","Joseph A. Browne School","00570055",null,"05 - 08","SW",624,null,"MS",397,635.20000000000005]
["0293","Joseph C Chamberlain","02930008",null,"K  - 04","SW",523,null,"ES",187,299.2]
["0292","Joseph Case High","02920505",null,"09 - 12","NT",529,null,"HS",96,153.60000000000002]
["0292","Joseph Case Jr High","02920305",null,"06 - 08","NT",518,null,"MS",104,166.4]
["0072","Joseph Demello","00720015",null,"01 - 05","NT",436,null,"ES",95,152]
["0317","Joseph E Fiske","03170015",null,"PK - 05","TA",419,null,"ES",39,62.400000000000006]
["0155","Joseph Estabrook","01550010",null,"K  - 05","TA",577,null,"ES",32,51.2]
["0044","Joseph F. Plouffe Academy","00440422",null,"06 - 08","NT",682,null,"MS",316,505.6]
["0292","Joseph G Luther","02920020",null,"03 - 05","TA",229,null,"ES",39,62.400000000000006]
["0285","Joseph H Gibbons","02850025",null,"K  - 05","NT",359,null,"ES",99,158.4]
["0293","Joseph H Martin","02930042",null,"05 - 07","NT",669,null,"MS",288,460.8]
["0035","Joseph J Hurley","00350182",null,"PK - 08","SW",364,null,"ESMS",185,296]
["0035","Joseph Lee","00350183",null,"PK - 08","SW",654,null,"ESMS",446,713.6]
["0160","Joseph McAvinnue","01600010",null,"PK - 04","SW",507,null,"ES",312,499.20000000000005]
["0137","Joseph Metcalf School","01370003",null,"PK - 03","SW",285,null,"ES",157,251.20000000000002]
["0065","Joseph Osgood","00650010",null,"PK - 02","NT",349,null,"EES",14,22.400000000000002]
["0829","Joseph P Keefe Technical High School","08290605",null,"09 - 12","SW",720,null,"HS",282,451.20000000000005]
["0035","Joseph P Manning","00350184",null,"PK - 05","SW",154,null,"ES",49,78.400000000000006]
["0035","Joseph P Tynan","00350181",null,"PK - 05","SW",234,null,"ES",181,289.60000000000002]
["0285","Joseph R Dawe Jr Elementary","02850014",null,"K  - 05","NT",356,null,"ES",93,148.80000000000001]
["0212","Joseph W Martin Jr Elementary","02120013",null,"K  - 05","NT",644,null,"ES",90,144]
["0246","Joshua Eaton","02460010",null,"K  - 05","TA",382,null,"ES",30,48]
["0288","Josiah Haynes","02880010",null,"K  - 05","NT",385,null,"ES",15,24]
["0035","Josiah Quincy","00350286",null,"PK - 05","SW",837,null,"ES",437,699.2]
["0035","Joyce Kilmer","00350190",null,"PK - 08","SW",468,null,"ESMS",123,196.8]
["0163","Julia F Callahan","01630030",null,"PK - 05","SW",471,null,"ES",277,443.20000000000005]
["0100","Juniper Hill School","01000001",null,"PK","NT",302,null,"EES",82,131.20000000000002]
["0079","Justus C. Richardson Middle School","00790410",null,"06 - 08","SW",885,null,"MS",212,339.20000000000005]
["0317","Katharine Lee Bates","03170005",null,"K  - 05","NT",368,null,"ES",8,12.8]
["0160","Kathryn P. Stoklosa Middle School","01600360",null,"05 - 08","SW",691,null,"MS",444,710.40000000000009]
["0201","Keith Middle School","02010405",null,"06 - 08","SW",891,null,"MS",580,928]
["0137","Kelly Elementary","01370040",null,"PK - 08","SW",569,null,"ESMS",506,809.6]
["0049","Kennedy-Longfellow","00490040",null,"PK - 05","SW",314,null,"ES",122,195.20000000000002]
["0172","Kenneth Coombs School","01720005",null,"PK - 02","TA",427,null,"EES",158,252.8]
["0281","Kensington International School","02810110",null,"K  - 05","SW",324,null,"ES",271,433.6]
["0025","Keough Memorial Academy","00250510",null,"08 - 12","NT",41,null,"MSHS/K-12",16,25.6]
["0100","King Elementary School","01000005",null,"K  - 03","NT",277,null,"ES",57,91.2]
["0035","King K-8","00350376",null,"PK - 08","SW",486,null,"ESMS",377,603.20000000000005]
["0049","King Open","00490035",null,"PK - 05","SW",326,null,"ES",95,152]
["0690","King Philip Middle School","06900510",null,"07 - 08","TA",740,null,"MS",65,104]
["0690","King Philip Regional High","06900505",null,"09 - 12","NT",1300,null,"HS",108,172.8]
["0145","Kingston Elementary","01450005",null,"K  - 02","TA",449,null,"EES",75,120]
["0145","Kingston Intermediate","01450020",null,"03 - 06","TA",573,null,"ES",89,142.4]
["0463","KIPP Academy Boston Charter School","04630205",null,"K  - 08","SW",556,null,"ESMS",348,556.80000000000007]
["0429","KIPP Academy Lynn Charter School","04290010",null,"K  - 12","SW",1333,null,"MSHS/K-12",628,1004.8000000000001]
["0211","Kittredge","02110015",null,"K  - 05","NT",289,null,"ES",37,59.2]
["0635","Kittredge","06350035",null,"PK - 05","TA",157,null,"ES",62,99.2]
["0767","Knox Trail Middle School","07670415",null,"05 - 08","TA",426,null,"MS",157,251.20000000000002]
["0217","L D Batchelder","02170005",null,"K  - 05","NT",466,null,"ES",27,43.2]
["0295","L F Dewing","02950001",null,"PK - 02","TA",618,null,"EES",106,169.60000000000002]
["0218","L G Nourse Elementary","02180010",null,"K  - 03","TA",287,null,"ES",86,137.6]
["0168","L H Coffin","01680010",null,"02 - 03","NT",155,null,"ES",16,25.6]
["0093","Lafayette School","00930038",null,"K  - 08","SW",939,null,"ESMS",459,734.40000000000009]
["0348","Lake View","03480145",null,"K  - 06","SW",297,null,"ES",132,211.20000000000002]
["0625","Laliberte Elementary School","06250050",null,"02 - 04","TA",503,null,"ES",90,144]
["0061","Lambert-Lavoie","00610040",null,"K  - 05","SW",317,null,"ES",149,238.4]
["0148","Lanesborough Elementary","01480005",null,"PK - 06","TA",213,null,"ES",54,86.4]
["0160","Laura Lee Therapeutic Day School","01600085",null,"K - 01,04 - 08","SW",25,null,"ESMS",21,33.6]
["0149","Lawlor Early Childhood Center","01490002",null,"K","SW",175,null,"EES",121,193.60000000000002]
["0046","Lawrence","00460030",null,"K  - 08","TA",715,null,"ESMS",75,120]
["0096","Lawrence","00960405",null,"07 - 08","NT",601,null,"MS",153,244.8]
["0454","Lawrence Family Development Charter School","04540205",null,"PK - 08","SW",738,null,"ESMS",409,654.40000000000009]
["0149","Lawrence Family Public Academy","01490011",null,"PK - K","SW",216,null,"EES",142,227.20000000000002]
["0149","Lawrence High School","01490515",null,"09 - 12","SW",3238,null,"HS",1747,2795.2000000000003]
["0336","Lawrence W Pingree","03360065",null,"K  - 04","TA",187,null,"ES",55,88]
["0160","Leblanc Therapeutic Day School","01600320",null,"09 - 12","SW",40,null,"HS",33,52.800000000000004]
["0035","Lee Academy","00350001",null,"PK - 03","SW",227,null,"ES",141,225.60000000000002]
["0150","Lee Elementary","01500025",null,"PK - 06","TA",343,null,"ES",143,228.8]
["0150","Lee Middle/High School","01500505",null,"07 - 12","NT",345,null,"MSHS/K-12",106,169.60000000000002]
["0210","Leeds","02100025",null,"PK - 05","NT",330,null,"ES",91,145.6]
["0151","Leicester High","01510505",null,"09 - 12","NT",454,null,"HS",106,169.60000000000002]
["0151","Leicester Memorial Elementary","01510005",null,"03 - 05","TA",336,null,"ES",91,145.6]
["0151","Leicester Middle","01510015",null,"06 - 08","NT",411,null,"MS",96,153.60000000000002]
["0151","Leicester Primary School","01510010",null,"PK - 02","TA",365,null,"EES",98,156.80000000000001]
["0152","Lenox Memorial High","01520505",null,"06 - 12","NT",439,null,"MSHS/K-12",73,116.80000000000001]
["0153","Leominster Center for Excellence","01530515",null,"09 - 12","SW",55,null,"HS",28,44.800000000000004]
["0153","Leominster High School","01530505",null,"09 - 12","SW",1118,null,"HS",332,531.20000000000005]
["0775","Leroy E.Mayo","07750032",null,"K  - 05","NT",489,null,"ES",44,70.400000000000006]
["0094","Leroy Wood","00940030",null,"PK - 05","TA",511,null,"ES",159,254.4]
["0095","Letourneau Elementary School","00950013",null,"PK - 05","SW",642,null,"ES",461,737.6]
["0154","Leverett Elementary","01540005",null,"PK - 06","TA",126,null,"ES",25,40]
["0155","Lexington Children's Place","01550001",null,"PK","NT",81,null,"EES",12,19.200000000000003]
["0155","Lexington High","01550505",null,"09 - 12","NT",2204,null,"HS",115,184]
["3514","Libertas Academy Charter School","35140305",null,"06","SW",88,null,"MS",70,112]
["0040","Liberty","00400025",null,"01 - 05","NT",469,null,"ES",60,96]
["0281","Liberty","02810115",null,"K  - 05","SW",283,null,"ES",220,352]
["0281","Liberty Preparatory Academy","02810560",null,"09 - 11","SW",11,null,"HS",9,14.4]
["0198","Lilja Elementary","01980035",null,"K  - 04","NT",434,null,"ES",50,80]
["0035","Lilla G. Frederick Middle School","00350383",null,"06 - 08","SW",527,null,"MS",391,625.6]
["0142","Lillian M Jacobs","01420015",null,"PK - 05","TA",426,null,"ES",130,208]
["0178","Lincoln","01780020",null,"K  - 05","TA",418,null,"ES",90,144]
["0281","Lincoln","02810120",null,"K  - 05","SW",405,null,"ES",363,580.80000000000007]
["0344","Lincoln Elementary","03440005",null,"K  - 05","NT",404,null,"ES",8,12.8]
["0153","Lincoln School","01530005",null,"PK","SW",55,null,"EES",23,36.800000000000004]
["0157","Lincoln School","01570025",null,"PK - 08","NT",591,null,"ESMS",60,96]
["0213","Lincoln Street","02130003",null,"K  - 05","TA",257,null,"ES",27,43.2]
["0348","Lincoln Street","03480160",null,"K  - 06","SW",278,null,"ES",232,371.20000000000005]
["0207","Lincoln-Eliot","02070070",null,"K  - 05","TA",368,null,"ES",77,123.2]
["0243","Lincoln-Hancock Community School","02430035",null,"K  - 04","SW",522,null,"ES",242,387.20000000000005]
["0695","Lincoln-Sudbury Regional High","06950505",null,"09 - 12","TA",1519,null,"HS",90,144]
["0163","Lincoln-Thomson","01630070",null,"K  - 05","SW",243,null,"ES",122,195.20000000000002]
["0165","Linden","01650047",null,"K  - 08","SW",852,null,"ESMS",322,515.20000000000005]
["0347","Linscott-Rumford","03470025",null,"K  - 05","SW",209,null,"ES",66,105.60000000000001]
["0158","Littleton High School","01580505",null,"09 - 12","NT",465,null,"HS",25,40]
["0158","Littleton Middle School","01580305",null,"06 - 08","NT",368,null,"MS",44,70.400000000000006]
["0672","Littleville Elementary School","06720143",null,"PK - 05","NT",303,null,"ES",90,144]
["0061","Litwin","00610022",null,"K  - 05","SW",420,null,"ES",224,358.40000000000003]
["0031","Locke Middle","00310310",null,"06 - 08","NT",506,null,"MS",70,112]
["0315","Loker School","03150020",null,"K  - 05","TA",288,null,"ES",13,20.8]
["0159","Longmeadow High","01590505",null,"09 - 12","NT",953,null,"HS",56,89.600000000000009]
["0044","Louis F Angelo Elementary","00440065",null,"K  - 05","SW",908,null,"ES",502,803.2]
["0780","Louise A Conley","07800010",null,"K  - 05","TA",563,null,"ES",107,171.20000000000002]
["0295","Louise Davy Trahan","02950025",null,"03 - 04","NT",235,null,"ES",34,54.400000000000006]
["0456","Lowell Community Charter Public School","04560050",null,"PK - 08","SW",801,null,"ESMS",362,579.20000000000005]
["0160","Lowell Day School on Broadway","01600605",null,"PK - 06","SW",33,null,"ES",18,28.8]
["0160","Lowell High","01600505",null,"09 - 12","SW",3140,null,"HS",1410,2256]
["0458","Lowell Middlesex Academy Charter School","04580505",null,"09 - 12","SW",99,null,"HS",65,104]
["0137","Lt Clayre Sullivan Elementary","01370055",null,"K  - 08","SW",562,null,"ESMS",445,712]
["0023","Lt Elezer Davis","00230010",null,"K  - 02","NT",602,null,"EES",65,104]
["0137","Lt Elmer J McMahon Elementary","01370015",null,"PK - 08","SW",438,null,"ESMS",276,441.6]
["0023","Lt Job Lane School","00230012",null,"03 - 05","TA",608,null,"ES",53,84.800000000000011]
["0050","Lt Peter M Hansen","00500012",null,"K  - 05","TA",475,null,"ES",72,115.2]
["0161","Ludlow Senior High","01610505",null,"09 - 12","NT",871,null,"HS",183,292.8]
["0162","Lunenburg High","01620505",null,"09 - 12","NT",437,null,"HS",55,88]
["0162","Lunenburg Middle School","01620305",null,"06 - 08","NT",421,null,"MS",57,91.2]
["0162","Lunenburg Primary School","01620010",null,"PK - 02","TA",402,null,"EES",68,108.80000000000001]
["0616","Lura A. White Elementary School","06160001",null,"PK - 05","NT",407,null,"ES",99,158.4]
["0725","Luther Burbank Middle School","07250305",null,"06 - 08","TA",245,null,"MS",36,57.6]
["0600","Luther Conant School","06000030",null,"K  - 06","NT",445,null,"ES",31,49.6]
["0344","Lynch Elementary","03440020",null,"PK - 05","TA",548,null,"ES",47,75.2]
["0035","Lyndon","00350262",null,"PK - 08","SW",588,null,"ESMS",174,278.40000000000003]
["0163","Lynn English High","01630510",null,"09 - 12","SW",1757,null,"HS",936,1497.6000000000001]
["0163","Lynn Vocational Technical Institute","01630605",null,"PK,06 - 07,09 -","SW",1022,null,"HS",573,916.80000000000007]
["0163","Lynn Woods","01630075",null,"K  - 05","SW",168,null,"ES",48,76.800000000000011]
["0164","Lynnfield High","01640505",null,"09 - 12","NT",641,null,"HS",59,94.4]
["0164","Lynnfield Middle School","01640405",null,"05 - 08","NT",676,null,"MS",45,72]
["0164","Lynnfield Preschool","01640005",null,"PK","NT",39,null,"EES",4,6.4]
["0262","Lynnhurst","02620040",null,"K  - 05","SW",280,null,"ES",82,131.20000000000002]
["0035","Lyon K-8","00350004",null,"K  - 08","SW",137,null,"ESMS",67,107.2]
["0035","Lyon Upper 9-12","00350655",null,"09 - 12","SW",128,null,"HS",61,97.600000000000009]
["0281","M Marcus Kiley Middle","02810330",null,"06 - 08","SW",666,null,"MS",534,854.40000000000009]
["0010","M Norcross Stratton","00100055",null,"K  - 05","TA",411,null,"ES",40,64]
["0468","Ma Academy for Math and Science School","04680505",null,"11 - 12","NT",96,null,"HS",2,3.2]
["0099","Mabelle M Burrell","00990015",null,"PK - 04","NT",330,null,"ES",45,72]
["0176","Madeleine Dugger Andrews","01760315",null,"06 - 08","NT",500,null,"MS",100,160]
["0093","Madeline English School","00930018",null,"K  - 08","SW",822,null,"ESMS",348,556.80000000000007]
["0035","Madison Park High","00350537",null,"09 - 12","SW",817,null,"HS",589,942.40000000000009]
["0322","Major Edwards Elementary","03220005",null,"PK - 05","TA",428,null,"ES",97,155.20000000000002]
["0168","Malcolm L Bell","01680005",null,"K  - 03","NT",274,null,"ES",33,52.800000000000004]
["0347","Malcolm White","03470055",null,"K  - 05","SW",325,null,"ES",121,193.60000000000002]
["0165","Malden Early Learning Center","01650049",null,"PK","NT",386,null,"EES",147,235.20000000000002]
["0165","Malden High","01650505",null,"09 - 12","NT",1842,null,"HS",747,1195.2]
["0035","Manassah E Bradley","00350215",null,"PK - 05","SW",287,null,"ES",136,217.60000000000002]
["0698","Manchester Essex Regional High School","06980510",null,"09 - 12","NT",436,null,"HS",27,43.2]
["0698","Manchester Essex Regional Middle School","06980030",null,"06 - 08","TA",369,null,"MS",24,38.400000000000006]
["0698","Manchester Memorial Elementary","06980010",null,"PK - 05","NT",342,null,"ES",19,30.400000000000002]
["0239","Manomet Elementary","02390015",null,"K  - 05","TA",282,null,"ES",83,132.80000000000001]
["0167","Mansfield High","01670505",null,"09 - 12","NT",1308,null,"HS",160,256]
["0044","Manthala George Jr. School","00440003",null,"K  - 05","SW",941,null,"ES",558,892.80000000000007]
["0086","Maple","00860010",null,"PK - 04","TA",264,null,"ES",101,161.60000000000002]
["0087","Mapleshade","00870010",null,"03 - 05","SW",280,null,"ES",63,100.80000000000001]
["0780","Maquan Elementary","07800025",null,"PK - 02","NT",443,null,"EES",71,113.60000000000001]
["0464","Marblehead Community Charter Public School","04640305",null,"04 - 08","NT",230,null,"ESMS",22,35.200000000000003]
["0168","Marblehead High","01680505",null,"09 - 12","NT",1028,null,"HS",96,153.60000000000002]
["0168","Marblehead Veterans Middle School","01680300",null,"07 - 08","NT",490,null,"MS",45,72]
["0276","Margaret A Neary","02760020",null,"04 - 05","NT",263,null,"ES",17,27.200000000000003]
["0281","Margaret C Ells","02810060",null,"PK - 01","SW",274,null,"EES",190,304]
["0244","Margaret L Donovan","02440015",null,"K  - 05","NT",446,null,"ES",170,272]
["0035","Margarita Muniz Academy","00350549",null,"09 - 12","SW",302,null,"HS",210,336]
["0213","Marguerite E Peaslee","02130014",null,"K  - 05","TA",273,null,"ES",27,43.2]
["0645","Marguerite E Small Elementary","06450015",null,"PK - 03","SW",294,null,"ES",152,243.20000000000002]
["0155","Maria Hastings","01550035",null,"K  - 05","NT",471,null,"ES",27,43.2]
["0049","Maria L. Baldwin","00490005",null,"PK - 05","NT",364,null,"ES",73,116.80000000000001]
["0336","Maria Weston Chapman Middle School","03360020",null,"05 - 08","TA",875,null,"MS",242,387.20000000000005]
["0035","Mario Umana Academy","00350656",null,"PK - 08","SW",1004,null,"ESMS",626,1001.6]
["0213","Marion E Zeh","02130020",null,"K  - 05","TA",242,null,"ES",19,30.400000000000002]
["0292","Mark G Hoyle Elementary","02920017",null,"PK - 02","NT",264,null,"EES",51,81.600000000000009]
["0170","Marlborough High","01700505",null,"09 - 12","NT",1118,null,"HS",342,547.20000000000005]
["0181","Marsh Grammar School","01810030",null,"PK - 08","NT",1204,null,"ESMS",316,505.6]
["0031","Marshall Middle School","00310305",null,"06 - 08","TA",652,null,"MS",101,161.60000000000002]
["0048","Marshall Simonds Middle","00480303",null,"06 - 08","NT",800,null,"MS",92,147.20000000000002]
["0171","Marshfield High","01710505",null,"09 - 12","NT",1334,null,"HS",162,259.2]
["0335","Martha Jones","03350017",null,"K  - 05","NT",295,null,"ES",10,16]
["0466","Martha's Vineyard Charter School","04660550",null,"K  - 12","TA",185,null,"MSHS/K-12",58,92.800000000000011]
["0700","Martha's Vineyard Regional High","07000505",null,"09 - 12","TA",635,null,"HS",130,208]
["0244","Martin E Young Elementary","02440040",null,"K  - 05","SW",311,null,"ES",158,252.8]
["0049","Martin Luther King Jr.","00490030",null,"PK - 05","SW",324,null,"ES",78,124.80000000000001]
["0492","Martin Luther King Jr. Charter School of Excellence","04920005",null,"K  - 05","SW",363,null,"ES",255,408]
["0171","Martinson Elementary","01710025",null,"PK - 05","TA",429,null,"ES",49,78.400000000000006]
["0281","Mary A. Dryden Veterans Memorial School","02810125",null,"PK - 05","SW",372,null,"ES",236,377.6]
["0347","Mary D Altavesta","03470065",null,"K  - 05","SW",240,null,"ES",65,104]
["0276","Mary E Finn School","02760008",null,"PK - 01","NT",355,null,"EES",34,54.400000000000006]
["0040","Mary E Flaherty School","00400020",null,"K  - 05","NT",378,null,"ES",68,108.80000000000001]
["0100","Mary E Stapleton Elementary","01000045",null,"K  - 05","NT",372,null,"ES",146,233.60000000000002]
["0044","Mary E. Baker School","00440002",null,"K  - 05","SW",821,null,"ES",406,649.6]
["0095","Mary Fonseca Elementary School","00950011",null,"PK - 05","SW",697,null,"ES",547,875.2]
["0182","Mary K. Goode Elementary School","01820010",null,"01 - 05","SW",593,null,"ES",164,262.40000000000003]
["0026","Mary Lee Burbank","00260010",null,"K  - 04","NT",373,null,"ES",19,30.400000000000002]
["0281","Mary M Lynch","02810140",null,"K  - 05","SW",268,null,"ES",222,355.20000000000005]
["0281","Mary M Walsh","02810155",null,"K  - 05","SW",292,null,"ES",238,380.8]
["0281","Mary O Pottenger","02810145",null,"K  - 05","SW",446,null,"ES",304,486.40000000000003]
["0725","Mary Rowlandson Elementary","07250010",null,"PK - 05","TA",482,null,"ES",81,129.6]
["0705","Masconomet Regional High School","07050505",null,"09 - 12","NT",1139,null,"HS",68,108.80000000000001]
["0705","Masconomet Regional Middle School","07050405",null,"07 - 08","TA",659,null,"MS",34,54.400000000000006]
["0172","Mashpee High","01720505",null,"09 - 12","NT",448,null,"HS",114,182.4]
["0172","Mashpee Middle School","01720020",null,"07 - 08","NT",275,null,"MS",60,96]
["0658","Mason Road School","06580010",null,"PK - 01","SW",281,null,"EES",84,134.4]
["0207","Mason-Rice","02070080",null,"K  - 05","NT",517,null,"ES",18,28.8]
["3901","Massachusetts Virtual Academy at Greenfield Commonwealth Virtual School","39010900",null,"K  - 12","SW",607,null,"MSHS/K-12",321,513.6]
["0469","MATCH Charter Public School","04690505",null,"PK - 12","SW",1216,null,"MSHS/K-12",689,1102.4000000000001]
["0035","Mather","00350227",null,"PK - 05","SW",625,null,"ES",389,622.40000000000009]
["0645","Mattacheese Middle School","06450305",null,"05 - 08","SW",438,null,"MS",184,294.40000000000003]
["0035","Mattapan Early Elementary School","00350016",null,"PK - 01","SW",310,null,"EES",199,318.40000000000003]
["0095","Matthew J Kuss Middle","00950320",null,"06 - 08","SW",732,null,"MS",445,712]
["0137","Maurice A Donahue Elementary","01370060",null,"PK - 08","SW",493,null,"ESMS",402,643.20000000000005]
["0035","Maurice J Tobin","00350229",null,"PK - 08","SW",443,null,"ESMS",344,550.4]
["0348","May Street","03480175",null,"K  - 06","SW",352,null,"ES",151,241.60000000000002]
["0174","Maynard High","01740505",null,"09 - 12","NT",374,null,"HS",64,102.4]
["0344","McCall Middle","03440305",null,"06 - 08","NT",1113,null,"MS",55,88]
["0056","McCarthy Middle School","00560310",null,"05 - 08","NT",822,null,"MS",105,168]
["0600","McCarthy-Towne School","06000015",null,"K  - 06","TA",497,null,"ES",41,65.600000000000009]
["0304","McCloskey Middle School","03040015",null,"06 - 08","NT",405,null,"MS",76,121.60000000000001]
["0097","McKay Arts Academy","00970340",null,"PK - 08","SW",688,null,"ESMS",425,680]
["0030","McKeown School","00300002",null,"PK","NT",136,null,"EES",54,86.4]
["0087","Meadow Brook","00870013",null,"PK - 02","TA",584,null,"EES",110,176]
["0175","Medfield Senior High","01750505",null,"09 - 12","NT",828,null,"HS",47,75.2]
["0176","Medford High","01760505",null,"PK,09 - 12","NT",1416,null,"HS",394,630.40000000000009]
["0177","Medway High","01770505",null,"09 - 12","NT",728,null,"HS",67,107.2]
["0177","Medway Middle","01770305",null,"05 - 08","NT",707,null,"MS",69,110.4]
["0610","Meetinghouse School","06100010",null,"K  - 01","NT",166,null,"EES",27,43.2]
["0178","Melrose High","01780505",null,"09 - 12","NT",1000,null,"HS",117,187.20000000000002]
["0178","Melrose Middle","01780305",null,"06 - 08","NT",784,null,"MS",90,144]
["0048","Memorial","00480015",null,"K  - 05","NT",406,null,"ES",56,89.600000000000009]
["0138","Memorial","01380010",null,"K  - 06","TA",551,null,"ES",71,113.60000000000001]
["0185","Memorial","01850010",null,"K  - 02","SW",489,null,"EES",187,299.2]
["0198","Memorial","01980043",null,"K  - 04","NT",415,null,"ES",19,30.400000000000002]
["0332","Memorial","03320025",null,"01 - 05","SW",233,null,"ES",157,251.20000000000002]
["0343","Memorial","03430040",null,"K  - 02","SW",296,null,"EES",138,220.8]
["0182","Memorial Early Childhood Center","01820011",null,"PK - K","SW",305,null,"EES",97,155.20000000000002]
["0097","Memorial Intermediate","00970048",null,"05 - 08","SW",719,null,"MS",394,630.40000000000009]
["0142","Memorial Middle","01420305",null,"06 - 08","NT",188,null,"MS",51,81.600000000000009]
["0251","Memorial Park","02510020",null,"K  - 04","SW",288,null,"ES",100,160]
["0175","Memorial School","01750003",null,"PK - 01","TA",439,null,"EES",32,51.2]
["0710","Memorial School","07100001",null,"PK - 04","TA",475,null,"ES",45,72]
["0207","Memorial Spaulding","02070105",null,"K  - 05","NT",446,null,"ES",30,48]
["0010","Menotomy Preschool","00100038",null,"PK","NT",97,null,"EES",14,22.400000000000002]
["0600","Merriam School","06000010",null,"K  - 06","NT",495,null,"ES",31,49.6]
["0625","Merrill Elementary School","06250020",null,"K  - 01","TA",318,null,"EES",66,105.60000000000001]
["0243","Merrymount","02430060",null,"K  - 05","NT",342,null,"ES",82,131.20000000000002]
["0181","Methuen High","01810505",null,"09 - 12","TA",1962,null,"HS",605,968]
["0046","Michael Driscoll","00460020",null,"PK - 08","NT",626,null,"ESMS",43,68.8]
["0278","Michael E. Smith Middle School","02780305",null,"05 - 08","NT",581,null,"MS",156,249.60000000000002]
["0035","Michael J Perkins","00350231",null,"K  - 05","SW",207,null,"ES",164,262.40000000000003]
["0182","Middleborough High","01820505",null,"09 - 12","NT",716,null,"HS",166,265.60000000000002]
["0348","Midland Street","03480185",null,"K  - 06","SW",229,null,"ES",81,129.6]
["0265","Mildred Aitken School","02650015",null,"PK - 05","NT",433,null,"ES",54,86.4]
["0035","Mildred Avenue K-8","00350378",null,"PK - 08","SW",560,null,"ESMS",372,595.20000000000005]
["0680","Mile Tree Elementary","06800025",null,"PK - 01","NT",368,null,"EES",50,80]
["0675","Miles River Middle","06750310",null,"06 - 08","NT",380,null,"MS",21,33.6]
["0185","Milford High","01850505",null,"09 - 12","NT",1147,null,"HS",317,507.20000000000005]
["0321","Mill Pond School","03210045",null,"04 - 06","TA",950,null,"ES",78,124.80000000000001]
["0186","Millbury Junior/Senior High","01860505",null,"07 - 12","NT",716,null,"MSHS/K-12",155,248]
["0110","Millbury Street Elementary School","01100200",null,"02 - 06","TA",668,null,"ES",81,129.6]
["0326","Millennium Elementary","03260013",null,"PK","NT",121,null,"EES",16,25.6]
["0136","Miller School","01360007",null,"03 - 05","NT",685,null,"ES",60,96]
["0187","Millis High School","01870505",null,"09 - 12","NT",393,null,"HS",35,56]
["0187","Millis Middle","01870020",null,"05 - 08","NT",400,null,"MS",53,84.800000000000011]
["0622","Millville Elementary","06220010",null,"PK - 05","TA",290,null,"ES",77,123.2]
["0281","Milton Bradley School","02810023",null,"PK - 05","SW",573,null,"ES",521,833.6]
["0176","Milton Fuller Roberts","01760150",null,"PK - 05","TA",539,null,"ES",167,267.2]
["0189","Milton High","01890505",null,"PK,09 - 12","NT",1027,null,"HS",113,180.8]
["0680","Minnechaug Regional High","06800505",null,"09 - 12","NT",1085,null,"HS",129,206.4]
["0310","Minot Forest","03100017",null,"PK,03 - 04","SW",488,null,"ES",255,408]
["0830","Minuteman Regional High","08300605",null,"09 - 12","SW",531,null,"HS",116,185.60000000000002]
["0100","Miriam F McCarthy School","01000050",null,"K  - 05","SW",559,null,"ES",287,459.20000000000005]
["0710","Miscoe Hill School","07100015",null,"05 - 08","TA",782,null,"MS",61,97.600000000000009]
["0035","Mission Hill School","00350382",null,"PK - 08","SW",243,null,"ESMS",109,174.4]
["0625","Mitchell Elementary School","06250002",null,"PK - 03","TA",1064,null,"ES",190,304]
["0332","Mittineague","03320030",null,"01 - 05","SW",179,null,"ES",81,129.6]
["0717","Mohawk Trail Regional High","07170505",null,"07 - 12","NT",385,null,"MSHS/K-12",140,224]
["0040","Monatiquot Kindergarten Center","00400009",null,"K","NT",255,null,"EES",60,96]
["0712","Monomoy Regional High School","07120515",null,"08 - 12","NT",624,null,"MSHS/K-12",143,228.8]
["0712","Monomoy Regional Middle School","07120315",null,"05 - 07","NT",456,null,"MS",126,201.60000000000002]
["0191","Monson High School","01910505",null,"09 - 12","NT",258,null,"HS",46,73.600000000000009]
["0832","Montachusett Regional Vocational Technical","08320605",null,"09 - 12","TA",1395,null,"HS",324,518.4]
["0243","Montclair","02430065",null,"K  - 05","NT",398,null,"ES",120,192]
["0618","Monument Mt Regional High","06180505",null,"09 - 12","NT",517,null,"HS",116,185.60000000000002]
["0618","Monument Valley Regional Middle School","06180310",null,"05 - 08","SW",375,null,"MS",104,166.4]
["0128","Moody","01280045",null,"PK","NT",242,null,"EES",126,201.60000000000002]
["0160","Moody Elementary","01600027",null,"PK - 04","SW",258,null,"ES",168,268.8]
["0088","Moreau Hall","00880020",null,"PK - 02","NT",228,null,"EES",42,67.2]
["0137","Morgan Full Service Community School","01370025",null,"PK - 08","SW",445,null,"ESMS",407,651.20000000000005]
["0236","Morningside Community School","02360055",null,"PK - 05","SW",405,null,"ES",296,473.6]
["0152","Morris","01520015",null,"PK - 05","TA",312,null,"ES",50,80]
["0049","Morse","00490045",null,"PK - 05","SW",310,null,"ES",109,174.4]
["0096","Morse Pond School","00960305",null,"05 - 06","NT",555,null,"ES",165,264]
["0095","Morton Middle","00950315",null,"06 - 08","SW",583,null,"MS",351,561.6]
["0278","Mosier","02780020",null,"02 - 04","TA",418,null,"ES",109,174.4]
["0087","Mountain View","00870015",null,"03 - 05","NT",294,null,"ES",48,76.800000000000011]
["0775","Mountview Middle","07750305",null,"06 - 08","NT",804,null,"MS",72,115.2]
["0035","Mozart","00350237",null,"PK - 05","SW",186,null,"ES",64,102.4]
["0765","Mt Everett Regional","07650505",null,"07 - 12","NT",305,null,"MSHS/K-12",97,155.20000000000002]
["0715","Mt Greylock Regional High","07150505",null,"07 - 12","TA",535,null,"MSHS/K-12",76,121.60000000000001]
["0618","Muddy Brook Regional Elementary School","06180035",null,"PK - 04","SW",346,null,"ES",131,209.60000000000002]
["0293","Mulcahey Elementary School","02930015",null,"K  - 04","SW",483,null,"ES",250,400]
["0096","Mullen-Hall","00960020",null,"K  - 04","TA",431,null,"ES",113,180.8]
["0141","Mulready Elementary","01410007",null,"PK - 04","TA",241,null,"ES",53,84.800000000000011]
["0325","Munger Hill","03250033",null,"K  - 05","NT",383,null,"ES",95,152]
["0344","Muraco Elementary","03440040",null,"K  - 05","NT",380,null,"ES",16,25.6]
["0343","Murdock Academy for Success","03430405",null,"09 - 12","NT",38,null,"HS",25,40]
["0343","Murdock High School","03430515",null,"09 - 12","SW",299,null,"HS",116,185.60000000000002]
["0343","Murdock Middle School","03430315",null,"06 - 08","SW",280,null,"MS",104,166.4]
["0470","Mystic Valley Regional Charter School","04700105",null,"K  - 12","NT",1562,null,"MSHS/K-12",283,452.8]
["0645","N H Wixon Innovation School","06450050",null,"04 - 05","NT",541,null,"ES",213,340.8]
["0326","Nabnasset","03260015",null,"K  - 02","NT",334,null,"EES",20,32]
["0197","Nantucket Elementary","01970005",null,"PK - 02","NT",364,null,"EES",109,174.4]
["0197","Nantucket High","01970505",null,"09 - 12","NT",538,null,"HS",110,176]
["0197","Nantucket Intermediate School","01970020",null,"03 - 05","TA",371,null,"ES",87,139.20000000000002]
["0775","Naquag Elementary School","07750005",null,"K  - 02","TA",348,null,"EES",43,68.8]
["0720","Narragansett Middle","07200305",null,"05 - 08","NT",460,null,"MS",138,220.8]
["0720","Narragansett Regional High","07200505",null,"09 - 12","NT",340,null,"HS",85,136]
["0725","Nashoba Regional","07250505",null,"09 - 12","NT",975,null,"HS",50,80]
["0852","Nashoba Valley Technical High School","08520605",null,"09 - 12","TA",690,null,"HS",127,203.20000000000002]
["0035","Nathan Hale","00350243",null,"PK - 05","SW",161,null,"ES",91,145.6]
["0258","Nathaniel Bowditch","02580025",null,"K  - 08","SW",344,null,"ESMS",255,408]
["0239","Nathaniel Morton Elementary","02390030",null,"K  - 05","TA",557,null,"ES",114,182.4]
["0198","Natick High","01980505",null,"PK,09 - 12","NT",1738,null,"HS",142,227.20000000000002]
["0660","Nauset Regional High","06600505",null,"09 - 12","TA",929,null,"HS",174,278.40000000000003]
["0660","Nauset Regional Middle","06600305",null,"06 - 08","TA",558,null,"MS",111,177.60000000000002]
["0199","Needham High","01990505",null,"09 - 12","NT",1674,null,"HS",96,153.60000000000002]
["0444","Neighborhood House Charter School","04440205",null,"PK - 09","SW",561,null,"ESMS",207,331.20000000000005]
["0086","Neil A Pepin","00860020",null,"K  - 04","TA",181,null,"ES",62,99.2]
["0348","Nelson Place","03480200",null,"PK - 06","NT",548,null,"ES",179,286.40000000000003]
["0635","Nessacus Regional Middle School","06350305",null,"06 - 08","TA",379,null,"MS",118,188.8]
["0201","New Bedford High","02010505",null,"09 - 12","SW",1932,null,"HS",1221,1953.6000000000001]
["0753","New Braintree Grade","07530020",null,"K  - 01","NT",55,null,"EES",13,20.8]
["3513","New Heights Charter School of Brockton","35130305",null,"06 - 09","SW",421,null,"MS",167,267.2]
["0632","New Hingham Regional Elementary","06320025",null,"PK - 06","NT",139,null,"ES",36,57.6]
["0258","New Liberty Innovation School","02580510",null,"09 - 12","NT",39,null,"HS",29,46.400000000000006]
["0765","New Marlborough Central","07650018",null,"PK - 04","NT",87,null,"ES",21,33.6]
["0035","New Mission High School","00350542",null,"07,09 - 12","SW",387,null,"MSHS/K-12",209,334.40000000000003]
["0773","Newbury Elementary","07730020",null,"PK - 06","NT",456,null,"ES",53,84.800000000000011]
["0204","Newburyport High","02040505",null,"09 - 12","NT",774,null,"HS",72,115.2]
["0199","Newman Elementary","01990050",null,"PK - 05","NT",763,null,"ES",55,88]
["0207","Newton Early Childhood Center","02070108",null,"PK","NT",248,null,"EES",29,46.400000000000006]
["0207","Newton North High","02070505",null,"09 - 12","NT",2127,null,"HS",225,360]
["0114","Newton School","01140035",null,"K  - 04","SW",242,null,"ES",172,275.2]
["0207","Newton South High","02070510",null,"09 - 12","NT",1869,null,"HS",165,264]
["0274","Next Wave Junior High","02740410",null,"06 - 08","SW",19,null,"MS",14,22.400000000000002]
["0710","Nipmuc Regional High","07100510",null,"09 - 12","NT",635,null,"HS",67,107.2]
["0735","Nissitissit Middle School","07350310",null,"05 - 08","NT",527,null,"MS",68,108.80000000000001]
["0915","Norfolk County Agricultural","09150705",null,"09 - 12","TA",538,null,"HS",78,124.80000000000001]
["0201","Normandin Middle School","02010410",null,"06 - 08","SW",1249,null,"MS",748,1196.8]
["0348","Norrback Avenue","03480202",null,"PK - 06","SW",567,null,"ES",258,412.8]
["0211","North Andover High","02110505",null,"09 - 12","NT",1489,null,"HS",176,281.60000000000002]
["0211","North Andover Middle","02110305",null,"06 - 08","TA",1115,null,"MS",169,270.40000000000003]
["0212","North Attleboro High","02120505",null,"09 - 12","NT",1143,null,"HS",158,252.8]
["0212","North Attleborough Early Learning Center","02120020",null,"PK","NT",144,null,"EES",29,46.400000000000006]
["0212","North Attleborough Middle","02120305",null,"06 - 08","NT",1088,null,"MS",159,254.4]
["0030","North Beverly Elementary","00300040",null,"K  - 05","NT",400,null,"ES",98,156.80000000000001]
["0215","North Brookfield Elementary","02150015",null,"PK - 06","SW",331,null,"ES",115,184]
["0215","North Brookfield High","02150505",null,"07 - 12","NT",235,null,"MSHS/K-12",77,123.2]
["0273","North Elementary","02730008",null,"K  - 05","NT",487,null,"ES",98,156.80000000000001]
["0095","North End Elementary","00950005",null,"PK - 05","NT",771,null,"ES",423,676.80000000000007]
["0096","North Falmouth Elementary","00960030",null,"K  - 04","NT",326,null,"ES",66,105.60000000000001]
["0110","North Grafton Elementary","01100025",null,"PK - 01","NT",255,null,"EES",34,54.400000000000006]
["0348","North High","03480515",null,"09 - 12","NT",1311,null,"HS",859,1374.4]
["0342","North Intermediate","03420060",null,"04 - 05","NT",303,null,"ES",29,46.400000000000006]
["0044","North Middle School","00440410",null,"06 - 08","NT",635,null,"MS",375,600]
["0325","North Middle School","03250305",null,"06 - 08","NT",669,null,"MS",171,273.60000000000002]
["0735","North Middlesex Regional","07350505",null,"09 - 12","NT",795,null,"HS",114,182.4]
["0231","North Pembroke Elementary","02310015",null,"PK - 06","NT",555,null,"ES",72,115.2]
["0243","North Quincy High","02430510",null,"09 - 12","NT",1227,null,"HS",408,652.80000000000007]
["0217","North Reading High","02170505",null,"09 - 12","NT",801,null,"HS",53,84.800000000000011]
["0217","North Reading Middle","02170305",null,"06 - 08","TA",545,null,"MS",39,62.400000000000006]
["0295","North Street","02950020",null,"03 - 04","NT",285,null,"ES",59,94.4]
["0110","North Street Elementary School","01100030",null,"02 - 06","TA",590,null,"ES",71,113.60000000000001]
["0210","Northampton High","02100505",null,"09 - 12","NT",860,null,"HS",153,244.8]
["0214","Northbridge Elementary","02140005",null,"PK - 01","TA",394,null,"EES",130,208]
["0214","Northbridge High","02140505",null,"09 - 12","NT",553,null,"HS",133,212.8]
["0214","Northbridge Middle","02140305",null,"05 - 08","TA",721,null,"MS",173,276.8]
["0308","Northeast Elementary School","03080040",null,"PK - 05","SW",594,null,"ES",194,310.40000000000003]
["0853","Northeast Metro Regional Vocational","08530605",null,"09 - 12","SW",1231,null,"HS",419,670.40000000000009]
["0750","Northfield Elementary","07500008",null,"PK - 06","TA",187,null,"ES",46,73.600000000000009]
["0153","Northwest","01530030",null,"K  - 05","SW",677,null,"ES",298,476.8]
["0218","Norton High","02180505",null,"09 - 12","NT",730,null,"HS",90,144]
["0218","Norton Middle","02180305",null,"06 - 08","NT",585,null,"MS",86,137.6]
["0219","Norwell High","02190505",null,"09 - 12","NT",694,null,"HS",25,40]
["0219","Norwell Middle School","02190405",null,"06 - 08","TA",503,null,"MS",15,24]
["0220","Norwood High","02200505",null,"09 - 12","NT",966,null,"HS",209,334.40000000000003]
["0035","O W Holmes","00350138",null,"PK - 05","SW",333,null,"ES",251,401.6]
["0221","Oak Bluffs Elementary","02210005",null,"PK - 08","TA",423,null,"ESMS",98,156.80000000000001]
["0207","Oak Hill Middle","02070320",null,"06 - 08","NT",613,null,"MS",51,81.600000000000009]
["0271","Oak Middle School","02710030",null,"07 - 08","NT",1002,null,"MS",100,160]
["0261","Oak Ridge","02610025",null,"03 - 06","TA",828,null,"ES",142,227.20000000000002]
["0101","Oak Street Elementary","01010030",null,"K  - 05","NT",401,null,"ES",44,70.400000000000006]
["0073","Oakdale","00730030",null,"01 - 05","NT",300,null,"ES",57,91.2]
["0753","Oakham Center","07530025",null,"02 - 06","NT",128,null,"ES",28,44.800000000000004]
["0262","Oaklandvale","02620050",null,"K  - 05","SW",239,null,"ES",100,160]
["0610","Oakmont Regional High School","06100505",null,"09 - 12","NT",710,null,"HS",104,166.4]
["0035","O'Bryant School Math/Science","00350575",null,"07 - 12","SW",1544,null,"MSHS/K-12",694,1110.4000000000001]
["0285","O'Donnell Middle School","02850405",null,"06 - 08","NT",820,null,"MS",221,353.6]
["0855","Old Colony Regional Vocational Technical","08550605",null,"09 - 12","TA",531,null,"HS",92,147.20000000000002]
["0173","Old Hammondtown","01730010",null,"04 - 06","TA",206,null,"ES",29,46.400000000000006]
["0227","Old Mill Pond","02270008",null,"PK - 05","SW",699,null,"ES",317,507.20000000000005]
["0307","Old Post Road","03070018",null,"K  - 05","TA",421,null,"ES",34,54.400000000000006]
["0740","Old Rochester Regional High","07400505",null,"09 - 12","NT",772,null,"HS",75,120]
["0740","Old Rochester Regional Jr High","07400405",null,"07 - 08","TA",481,null,"MS",66,105.60000000000001]
["3515","Old Sturbridge Academy Charter Public School","35150205",null,"K  - 03","NT",159,null,"ES",43,68.8]
["0088","Oliver Ames High","00880505",null,"09 - 12","NT",1186,null,"HS",129,206.4]
["0035","Oliver Hazard Perry","00350255",null,"PK - 08","SW",221,null,"ESMS",103,164.8]
["0149","Oliver Partnership School","01490048",null,"01 - 05","SW",463,null,"ES",308,492.8]
["0035","Orchard Gardens","00350257",null,"PK - 08","SW",906,null,"ESMS",590,944]
["0224","Orleans Elementary","02240005",null,"K  - 05","TA",228,null,"ES",58,92.800000000000011]
["0044","Oscar F Raymond","00440078",null,"K  - 05","SW",926,null,"ES",604,966.40000000000009]
["0010","Ottoson Middle","00100410",null,"06 - 08","NT",1255,null,"MS",120,192]
["0610","Overlook Middle School","06100305",null,"06 - 08","NT",570,null,"MS",92,147.20000000000002]
["0226","Oxford High","02260505",null,"08 - 12","NT",539,null,"MSHS/K-12",166,265.60000000000002]
["0226","Oxford Middle","02260405",null,"05 - 07","TA",442,null,"MS",143,228.8]
["0276","P Brent Trottier","02760305",null,"06 - 08","NT",456,null,"MS",13,20.8]
["0616","Page Hilltop Elementary School","06160002",null,"PK - 05","SW",529,null,"ES",133,212.8]
["0017","Pakachoag School","00170025",null,"PK - 02","TA",308,null,"EES",53,84.800000000000011]
["0227","Palmer High","02270505",null,"06 - 12","SW",715,null,"MSHS/K-12",248,396.8]
["0650","Palmer River","06500010",null,"K  - 04","TA",564,null,"ES",71,113.60000000000001]
["0325","Paper Mill","03250036",null,"K  - 05","SW",400,null,"ES",173,276.8]
["0316","Park Avenue Elementary","03160015",null,"PK - 04","SW",836,null,"ES",482,771.2]
["0138","Park Street School","01380003",null,"PK","NT",94,null,"EES",13,20.8]
["0031","Parker","00310015",null,"K  - 05","TA",493,null,"ES",90,144]
["0271","Parker Road Preschool","02710040",null,"PK","NT",260,null,"EES",37,59.2]
["0088","Parkview Elementary","00880015",null,"PK - 02","NT",321,null,"EES",30,48]
["0093","Parlin School","00930058",null,"01 - 08","SW",831,null,"ESMS",451,721.6]
["0101","Parmenter","01010032",null,"K  - 05","TA",326,null,"ES",57,91.2]
["0149","Parthum Middle School","01490027",null,"05 - 08","SW",605,null,"MS",366,585.6]
["0860","Pathfinder Vocational Technical","08600605",null,"09 - 12","SW",620,null,"HS",224,358.40000000000003]
["0755","Pathways Early College Innovation School","07550515",null,"11 - 12","NT",36,null,"HS",6,9.6000000000000014]
["0035","Patrick J Kennedy","00350264",null,"PK - 05","SW",306,null,"ES",188,300.8]
["0035","Paul A Dever","00350268",null,"PK - 05","SW",394,null,"ES",312,499.20000000000005]
["0144","Paul F Doyon Memorial","01440007",null,"PK - 05","NT",403,null,"ES",46,73.600000000000009]
["0335","Paul Hanlon","03350015",null,"K  - 05","NT",220,null,"ES",14,22.400000000000002]
["0600","Paul P Gates Elementary School","06000025",null,"K  - 06","TA",403,null,"ES",39,62.400000000000006]
["0161","Paul R Baird Middle","01610305",null,"06 - 08","NT",637,null,"MS",144,230.4]
["0248","Paul Revere","02480050",null,"K  - 05","SW",483,null,"ES",229,366.40000000000003]
["0035","Pauline Agassiz Shaw Elementary School","00350014",null,"PK - 03","SW",246,null,"ES",171,273.60000000000002]
["3501","Paulo Freire Social Justice Charter School","35010505",null,"09 - 12","SW",299,null,"HS",218,348.8]
["0160","Pawtucketville Memorial","01600036",null,"PK - 04","SW",512,null,"ES",227,363.20000000000005]
["0775","Paxton Center","07750040",null,"K  - 08","TA",473,null,"ESMS",48,76.800000000000011]
["0049","Peabody","00490050",null,"PK - 05","SW",330,null,"ES",80,128]
["0229","Peabody Veterans Memorial High","02290510",null,"09 - 12","NT",1458,null,"HS",397,635.20000000000005]
["0750","Pearl E Rhodes Elementary","07500007",null,"PK - 06","TA",33,null,"ES",14,22.400000000000002]
["0036","Peebles Elementary School","00360010",null,"K  - 04","TA",347,null,"ES",95,152]
["0010","Peirce","00100045",null,"K  - 05","NT",305,null,"ES",22,35.200000000000003]
["0207","Peirce","02070100",null,"K  - 05","NT",272,null,"ES",18,28.8]
["0230","Pelham Elementary","02300005",null,"K  - 06","NT",127,null,"ES",27,43.2]
["0231","Pembroke Community Middle School","02310305",null,"07 - 08","TA",493,null,"MS",65,104]
["0231","Pembroke High School","02310505",null,"09 - 12","NT",915,null,"HS",91,145.6]
["0105","Penn Brook","01050010",null,"K  - 06","TA",693,null,"ES",60,96]
["0128","Pentucket Lake Elementary","01280054",null,"K  - 04","SW",509,null,"ES",261,417.6]
["0745","Pentucket Regional Middle","07450405",null,"07 - 08","NT",423,null,"MS",41,65.600000000000009]
["0745","Pentucket Regional Sr High","07450505",null,"09 - 12","NT",738,null,"HS",67,107.2]
["0105","Perley Elementary","01050005",null,"PK","NT",125,null,"EES",12,19.200000000000003]
["0735","Peter Fitzpatrick School","07350515",null,null,"NT",16,null,"SP",14,22.400000000000002]
["0288","Peter Noyes","02880030",null,"PK - 05","NT",578,null,"ES",17,27.200000000000003]
["0016","Peter Thacher Elementary School","00160050",null,"K  - 04","SW",435,null,"ES",140,224]
["0160","Peter W Reilly","01600040",null,"K  - 04","SW",546,null,"ES",280,448]
["0234","Petersham Center","02340005",null,"K  - 06","TA",114,null,"ES",26,41.6]
["0332","Philip G Coburn","03320007",null,"K  - 05","SW",543,null,"ES",370,592]
["0720","Phillipston Memorial","07200003",null,"PK - 04","SW",177,null,"ES",63,100.80000000000001]
["0035","Phineas Bates","00350278",null,"PK - 05","SW",267,null,"ES",125,200]
["0149","Phoenix Academy Lawrence","01490540",null,"09 - 12","SW",123,null,"HS",78,124.80000000000001]
["3508","Phoenix Academy Public Charter High School Springfield","35080505",null,"09 - 12","SW",196,null,"HS",164,262.40000000000003]
["0493","Phoenix Charter Academy","04930505",null,"09 - 12","SW",192,null,"HS",85,136]
["0163","Pickering Middle","01630420",null,"06 - 08","SW",616,null,"MS",235,376]
["0046","Pierce","00460040",null,"K  - 08","TA",858,null,"ESMS",97,155.20000000000002]
["0048","Pine Glen Elementary","00480020",null,"K  - 05","TA",313,null,"ES",37,59.2]
["0773","Pine Grove","07730025",null,"PK - 06","NT",457,null,"ES",56,89.600000000000009]
["0269","Pine Hill","02690010",null,"PK - 05","TA",425,null,"ES",23,36.800000000000004]
["0494","Pioneer Charter School of Science","04940205",null,"K - 04,07 - 12","SW",663,null,"MSHS/K-12",234,374.40000000000003]
["3506","Pioneer Charter School of Science II (PCSS-II)","35060505",null,"07 - 12","SW",356,null,"MSHS/K-12",91,145.6]
["0497","Pioneer Valley Chinese Immersion Charter School","04970205",null,"K  - 12","TA",494,null,"MSHS/K-12",69,110.4]
["0479","Pioneer Valley Performing Arts Charter Public School","04790505",null,"07 - 12","TA",400,null,"MSHS/K-12",86,137.6]
["0750","Pioneer Valley Regional","07500505",null,"07 - 12","NT",361,null,"MSHS/K-12",64,102.4]
["0236","Pittsfield High","02360505",null,"09 - 12","NT",842,null,"HS",339,542.4]
["0136","Placentino Elementary","01360010",null,"PK - 02","TA",754,null,"EES",54,86.4]
["0278","Plains Elementary","02780015",null,"PK - 01","TA",359,null,"EES",109,174.4]
["0107","Plum Cove School","01070042",null,"K  - 05","NT",213,null,"ES",59,94.4]
["0239","Plymouth Commun Intermediate","02390405",null,"06 - 08","NT",1028,null,"MS",276,441.6]
["0239","Plymouth Early Childhood Center","02390003",null,"PK","NT",156,null,"EES",49,78.400000000000006]
["0239","Plymouth North High","02390505",null,"09 - 12","NT",1248,null,"HS",260,416]
["0131","Plymouth River","01310019",null,"K  - 05","NT",468,null,"ES",18,28.8]
["0239","Plymouth South High","02390515",null,"09 - 12","NT",1093,null,"HS",187,299.2]
["0239","Plymouth South Middle","02390305",null,"06 - 08","NT",721,null,"MS",131,209.60000000000002]
["0243","Point Webster Middle","02430325",null,"05 - 08","NT",352,null,"MS",142,227.20000000000002]
["0199","Pollard Middle","01990405",null,"07 - 08","NT",848,null,"MS",40,64]
["0100","Potter Road","01000039",null,"K  - 05","NT",514,null,"ES",110,176]
["0766","Powder Mill School","07660315",null,"03 - 06","TA",445,null,"ES",120,192]
["0153","Priest Street","01530040",null,"K","SW",129,null,"EES",69,110.4]
["0298","Proctor Elementary","02980005",null,"04 - 06","NT",256,null,"ES",12,19.200000000000003]
["0226","Project C.O.F.F.E.E.","02260305",null,"08 - 12","NT",30,null,"HS",13,20.8]
["0487","Prospect Hill Academy Charter School","04870550",null,"K  - 12","SW",1154,null,"MSHS/K-12",450,720]
["0242","Provincetown Schools","02420020",null,"PK - 08","TA",121,null,"ESMS",43,68.8]
["0049","Putnam Avenue Upper School","00490310",null,"06 - 08","NT",262,null,"MS",109,174.4]
["0160","Pyne Arts","01600018",null,"PK - 08","SW",511,null,"ESMS",228,364.8]
["0753","Quabbin Regional High School","07530505",null,"09 - 12","NT",642,null,"HS",129,206.4]
["0753","Quabbin Regional Middle School","07530405",null,"07 - 08","NT",394,null,"MS",107,171.20000000000002]
["0778","Quaboag Regional High","07780505",null,"09 - 12","NT",354,null,"HS",106,169.60000000000002]
["0778","Quaboag Regional Middle Innovation School","07780305",null,"07 - 08","NT",231,null,"MS",81,129.6]
["0191","Quarry Hill Community School","01910025",null,"PK - 04","TA",399,null,"ES",129,206.4]
["0172","Quashnet School","01720035",null,"03 - 06","TA",487,null,"ES",152,243.20000000000002]
["0243","Quincy High","02430505",null,"09 - 12","NT",1528,null,"HS",530,848]
["0035","Quincy Upper School","00350565",null,"06 - 12","SW",509,null,"MSHS/K-12",308,492.8]
["0348","Quinsigamond","03480210",null,"PK - 06","SW",750,null,"ES",515,824]
["0251","R Stewart Esten","02510025",null,"K  - 04","SW",334,null,"ES",116,185.60000000000002]
["0349","R. H. Conwell","03490010",null,"PK - 06","TA",67,null,"ES",27,43.2]
["0210","R. K. Finn Ryan Road","02100029",null,"K  - 05","SW",222,null,"ES",69,110.4]
["0035","Rafael Hernandez","00350691",null,"PK - 08","SW",390,null,"ESMS",224,358.40000000000003]
["0107","Ralph B O'Maley Middle","01070305",null,"06 - 08","NT",675,null,"MS",212,339.20000000000005]
["0755","Ralph C Mahar Regional","07550505",null,"07 - 12","SW",642,null,"MSHS/K-12",249,398.40000000000003]
["0018","Ralph D Butler","00180010",null,"PK - 06","TA",419,null,"ES",121,193.60000000000002]
["0336","Ralph Talbot","03360085",null,"K  - 04","TA",241,null,"ES",63,100.80000000000001]
["0175","Ralph Wheelock School","01750007",null,"02 - 03","NT",377,null,"ES",19,30.400000000000002]
["0244","Randolph Community Middle","02440410",null,"06 - 08","NT",593,null,"MS",264,422.40000000000003]
["0244","Randolph High","02440505",null,"09 - 12","NT",703,null,"HS",319,510.40000000000003]
["0186","Raymond E. Shaw Elementary","01860025",null,"04 - 06","TA",435,null,"ES",114,182.4]
["0600","Raymond J Grey Junior High","06000405",null,"07 - 08","TA",962,null,"MS",43,68.8]
["0625","Raynham Middle School","06250315",null,"05 - 08","NT",673,null,"MS",105,168]
["0246","Reading Memorial High","02460505",null,"09 - 12","NT",1230,null,"HS",83,132.80000000000001]
["0243","Reay E Sterling Middle","02430320",null,"05 - 08","NT",366,null,"MS",171,273.60000000000002]
["0281","Rebecca M Johnson","02810055",null,"PK - 05","SW",787,null,"ES",688,1100.8]
["0097","Reingold Elementary","00970043",null,"PK - 04","SW",673,null,"ES",405,648]
["0101","Remington Middle","01010310",null,"06 - 08","NT",443,null,"MS",45,72]
["0201","Renaissance Community School for the Arts","02010124",null,"PK - 05","SW",220,null,"ES",162,259.2]
["0095","Resiliency Preparatory Academy","00950525",null,"07 - 12","SW",204,null,"MSHS/K-12",174,278.40000000000003]
["0248","Revere High","02480505",null,"09 - 12","SW",1966,null,"HS",848,1356.8000000000002]
["0348","Rice Square","03480215",null,"K  - 06","SW",447,null,"ES",291,465.6]
["0035","Richard J Murphy","00350240",null,"PK - 08","SW",947,null,"ESMS",442,707.2]
["0088","Richardson Olmsted School","00880025",null,"03 - 05","TA",845,null,"ES",96,153.60000000000002]
["0170","Richer","01700025",null,"K  - 04","SW",610,null,"ES",260,416]
["0249","Richmond Consolidated","02490005",null,"PK - 08","NT",181,null,"ESMS",37,59.2]
["0049","Rindge Avenue Upper School","00490315",null,"06 - 08","NT",268,null,"MS",66,105.60000000000001]
["0281","Rise Academy at Van Sickle","02810480",null,"06 - 07","SW",220,null,"MS",182,291.2]
["0246","RISE PreSchool","02460001",null,"PK","NT",104,null,"EES",12,19.200000000000003]
["0483","Rising Tide Charter Public School","04830305",null,"05 - 12","TA",658,null,"MSHS/K-12",59,94.4]
["0326","Rita E. Miller Elementary School","03260055",null,"K  - 02","NT",332,null,"EES",23,36.800000000000004]
["0482","River Valley Charter School","04820050",null,"K  - 08","TA",288,null,"ESMS",20,32]
["0073","Riverdale","00730045",null,"01 - 05","TA",189,null,"ES",51,81.600000000000009]
["0071","Riverside","00710030",null,"PK - 05","TA",375,null,"ES",65,104]
["0213","Robert E. Melican Middle School","02130305",null,"06 - 08","TA",620,null,"MS",64,102.4]
["0149","Robert Frost","01490018",null,"K  - 04","SW",619,null,"ES",369,590.4]
["0136","Robert H. Adams Middle School","01360305",null,"06 - 08","NT",682,null,"MS",48,76.800000000000011]
["0016","Robert J. Coelho Middle School","00160305",null,"05 - 08","NT",681,null,"MS",142,227.20000000000002]
["0163","Robert L Ford","01630050",null,"01 - 05","SW",511,null,"ES",340,544]
["0236","Robert T. Capeless Elementary School","02360045",null,"PK - 05","NT",220,null,"ES",106,169.60000000000002]
["0005","Roberta G. Doering School","00050303",null,"05,06 - 08","NT",574,null,"MS",195,312]
["0284","Robin Hood","02840025",null,"PK - 04","NT",384,null,"ES",79,126.4]
["0005","Robinson Park","00050025",null,"K  - 04","SW",367,null,"ES",138,220.8]
["0250","Rochester Memorial","02500005",null,"PK - 06","TA",501,null,"ES",72,115.2]
["0251","Rockland Senior High","02510505",null,"PK,09 - 12","NT",646,null,"HS",162,259.2]
["0252","Rockport Elementary","02520005",null,"PK - 05","TA",397,null,"ES",94,150.4]
["0252","Rockport High","02520510",null,"09 - 12","NT",286,null,"HS",38,60.800000000000004]
["0252","Rockport Middle","02520305",null,"06 - 08","NT",225,null,"MS",32,51.2]
["0050","Rodman Early Childhood Center","00500010",null,"PK","NT",100,null,"EES",19,30.400000000000002]
["0035","Roger Clap","00350298",null,"PK - 05","SW",153,null,"ES",96,153.60000000000002]
["0026","Roger E Wellington","00260035",null,"PK - 04","TA",643,null,"ES",47,75.2]
["0281","Roger L. Putnam Vocational Technical Academy","02810620",null,"09 - 12","SW",1419,null,"HS",945,1512]
["0160","Rogers STEM Academy","01600005",null,"PK - 06","SW",682,null,"ES",425,680]
["0167","Roland Green School","01670003",null,"PK","NT",113,null,"EES",26,41.6]
["0149","Rollins Early Childhood Center","01490001",null,"PK - K","SW",192,null,"EES",126,201.60000000000002]
["0178","Roosevelt","01780035",null,"K  - 05","TA",436,null,"ES",62,99.2]
["0348","Roosevelt","03480220",null,"PK - 06","SW",683,null,"ES",286,457.6]
["0212","Roosevelt Avenue","02120015",null,"K  - 05","NT",285,null,"ES",38,60.800000000000004]
["0201","Roosevelt Middle School","02010415",null,"06 - 08","SW",808,null,"MS",579,926.40000000000009]
["0323","Rose L Macdonald","03230003",null,"01 - 03","TA",245,null,"ES",31,49.6]
["0253","Rowe Elementary","02530005",null,"PK - 06","NT",68,null,"ES",19,30.400000000000002]
["0484","Roxbury Preparatory Charter School","04840505",null,"05 - 11","SW",1396,null,"MSHS/K-12",784,1254.4000000000001]
["0615","Royalston Community School","06150050",null,"K  - 06","TA",137,null,"ES",51,81.600000000000009]
["0753","Ruggles Lane","07530030",null,"PK - 06","TA",475,null,"ES",157,251.20000000000002]
["0248","Rumney Marsh Academy","02480014",null,"06 - 08","SW",601,null,"MS",276,441.6]
["0204","Rupert A Nock Middle","02040305",null,"06 - 08","NT",555,null,"MS",46,73.600000000000009]
["0325","Russell Elementary School","03250055",null,"K  - 05","NT",163,null,"ES",44,70.400000000000006]
["0158","Russell St Elementary","01580015",null,"03 - 05","TA",387,null,"ES",33,52.800000000000004]
["0160","S Christa McAuliffe Elementary","01600075",null,"PK - 04","SW",507,null,"ES",311,497.6]
["0441","Sabis International Charter School","04410505",null,"K  - 12","SW",1574,null,"MSHS/K-12",577,923.2]
["0485","Salem Academy Charter School","04850485",null,"06 - 12","SW",473,null,"MSHS/K-12",147,235.20000000000002]
["0258","Salem Early Childhood","02580001",null,"PK","NT",109,null,"EES",59,94.4]
["0258","Salem High","02580505",null,"09 - 12","NT",927,null,"HS",416,665.6]
["0258","Salem Prep High School","02580515",null,"08 - 12","NT",23,null,"MSHS/K-12",13,20.8]
["0165","Salemwood","01650057",null,"K  - 08","SW",1222,null,"ESMS",623,996.80000000000007]
["0773","Salisbury Elementary","07730015",null,"PK - 06","TA",521,null,"ES",183,292.8]
["0258","Saltonstall School","02580050",null,"K  - 08","SW",393,null,"ESMS",154,246.4]
["0153","Samoset School","01530045",null,"06 - 08","SW",494,null,"MS",170,272]
["0035","Samuel Adams","00350302",null,"PK - 05","SW",286,null,"ES",153,244.8]
["0281","Samuel Bowles","02810020",null,"K  - 05","SW",343,null,"ES",252,403.20000000000005]
["0035","Samuel W Mason","00350304",null,"PK - 05","SW",250,null,"ES",162,259.2]
["0095","Samuel Watson","00950145",null,"K  - 05","SW",293,null,"ES",228,364.8]
["0717","Sanderson Academy","07170020",null,"PK - 06","TA",160,null,"ES",46,73.600000000000009]
["0261","Sandwich High","02610505",null,"09 - 12","NT",664,null,"HS",65,104]
["0261","Sandwich STEM Academy","02610305",null,"07 - 08","NT",457,null,"MS",61,97.600000000000009]
["0035","Sarah Greenwood","00350308",null,"PK - 08","SW",422,null,"ESMS",321,513.6]
["0321","Sarah W Gibbons Middle","03210305",null,"07 - 08","NT",604,null,"MS",61,97.600000000000009]
["0262","Saugus High","02620505",null,"09 - 12","SW",664,null,"HS",176,281.60000000000002]
["0317","Schofield","03170045",null,"K  - 05","TA",375,null,"ES",31,49.6]
["0149","School for Exceptional Studies","01490537",null,"01 - 12","SW",153,null,"MSHS/K-12",128,204.8]
["0264","Scituate High School","02640505",null,"09 - 12","NT",915,null,"HS",96,153.60000000000002]
["0248","Seacoast School","02480520",null,"09 - 12","SW",90,null,"HS",52,83.2]
["0265","Seekonk High","02650505",null,"09 - 12","NT",593,null,"HS",83,132.80000000000001]
["0486","Seven Hills Charter School","04860105",null,"K  - 08","SW",660,null,"ESMS",398,636.80000000000007]
["0163","Sewell-Anderson","01630085",null,"K  - 05","SW",310,null,"ES",141,225.60000000000002]
["0201","Sgt Wm H Carney Academy","02010045",null,"PK - 05","SW",812,null,"ES",560,896]
["0158","Shaker Lane Elementary","01580005",null,"PK - 02","TA",451,null,"EES",32,51.2]
["0347","Shamrock","03470043",null,"PK - 05","SW",377,null,"ES",121,193.60000000000002]
["0266","Sharon Early Childhood Center","02660001",null,"PK","NT",50,null,"EES",6,9.6000000000000014]
["0266","Sharon High","02660505",null,"09 - 12","NT",1077,null,"HS",83,132.80000000000001]
["0266","Sharon Middle","02660305",null,"06 - 08","NT",875,null,"MS",73,116.80000000000001]
["0342","Shawsheen Elementary","03420025",null,"01 - 03","TA",344,null,"ES",30,48]
["0009","Shawsheen School","00090005",null,"PK","NT",100,null,"EES",12,19.200000000000003]
["0871","Shawsheen Valley Vocational Technical High School","08710605",null,"09 - 12","TA",1311,null,"HS",199,318.40000000000003]
["0674","Sheffield Elementary School","06740050",null,"02 - 05","SW",215,null,"ES",125,200]
["0658","Shepherd Hill Regional High","06580505",null,"09 - 12","NT",1161,null,"HS",199,318.40000000000003]
["0271","Sherwood Middle School","02710305",null,"05 - 06","NT",963,null,"ES",97,155.20000000000002]
["0185","Shining Star Early Childhood Center","01850075",null,"PK","NT",147,null,"EES",48,76.800000000000011]
["0271","Shrewsbury Sr High","02710505",null,"09 - 12","NT",1834,null,"HS",184,294.40000000000003]
["0057","Shurtleff Early Childhood","00570003",null,"PK - 01","SW",911,null,"EES",591,945.6]
["0272","Shutesbury Elementary","02720005",null,"PK - 06","TA",125,null,"ES",35,56]
["0477","Silver Hill Horace Mann Charter School","04770010",null,"K  - 05","SW",557,null,"ES",167,267.2]
["0760","Silver Lake Regional High","07600505",null,"PK,09 - 12","TA",1317,null,"HS",218,348.8]
["0760","Silver Lake Regional Middle School","07600405",null,"07 - 08","TA",541,null,"MS",88,140.80000000000001]
["0236","Silvio O Conte Community","02360105",null,"PK - 05","SW",367,null,"ES",304,486.40000000000003]
["0169","Sippican","01690005",null,"PK - 06","TA",454,null,"ES",102,163.20000000000002]
["0153","Sky View Middle School","01530320",null,"06 - 08","SW",912,null,"MS",352,563.20000000000005]
["0127","Smith Academy","01270505",null,"07 - 12","NT",188,null,"MSHS/K-12",22,35.200000000000003]
["0406","Smith Vocational and Agricultural High","04060705",null,"09 - 12","SW",491,null,"HS",165,264]
["0035","Snowden International School at Copley","00350690",null,"09 - 12","SW",451,null,"HS",248,396.8]
["0243","Snug Harbor Community School","02430090",null,"PK - 05","SW",494,null,"ES",278,444.8]
["0873","So Shore Vocational Technical High","08730605",null,"09 - 12","TA",636,null,"HS",156,249.60000000000002]
["0763","Somerset Berkley Regional High School","07630505",null,"09 - 12","TA",1002,null,"HS",133,212.8]
["0273","Somerset Middle School","02730305",null,"06 - 08","NT",609,null,"MS",116,185.60000000000002]
["0274","Somerville High","02740505",null,"09 - 12","NT",1188,null,"HS",486,777.6]
["0680","Soule Road","06800030",null,"04 - 05","TA",348,null,"ES",68,108.80000000000001]
["0273","South","02730015",null,"K  - 05","TA",272,null,"ES",69,110.4]
["0284","South","02840030",null,"K  - 04","NT",316,null,"ES",68,108.80000000000001]
["0009","South Elementary","00090020",null,"K  - 05","NT",490,null,"ES",13,20.8]
["0025","South Elementary","00250020",null,"K  - 03","TA",345,null,"ES",82,131.20000000000002]
["0131","South Elementary","01310020",null,"K  - 05","NT",527,null,"ES",12,19.200000000000003]
["0239","South Elementary","02390046",null,"K  - 05","NT",661,null,"ES",145,232]
["0285","South Elementary","02850015",null,"K  - 05","NT",253,null,"ES",61,97.600000000000009]
["0281","South End Middle School","02810355",null,"06 - 08","SW",248,null,"MS",223,356.8]
["0110","South Grafton Elementary","01100005",null,"PK - 01","NT",310,null,"EES",42,67.2]
["0278","South Hadley High","02780505",null,"09 - 12","NT",552,null,"HS",120,192]
["0348","South High Community","03480520",null,"09 - 12","NT",1402,null,"HS",826,1321.6000000000001]
["0149","South Lawrence East Elementary School","01490004",null,"01 - 05","SW",763,null,"ES",555,888]
["0229","South Memorial","02290035",null,"PK - 05","NT",471,null,"ES",112,179.20000000000002]
["0040","South Middle School","00400310",null,"06 - 08","NT",669,null,"MS",97,155.20000000000002]
["0044","South Middle School","00440415",null,"06 - 08","NT",482,null,"MS",238,380.8]
["0325","South Middle School","03250310",null,"06 - 08","SW",595,null,"MS",266,425.6]
["0171","South River","01710010",null,"K  - 05","NT",374,null,"ES",35,56]
["0056","South Row","00560015",null,"K  - 04","TA",398,null,"ES",39,62.400000000000006]
["0488","South Shore Charter Public School","04880550",null,"K  - 12","TA",920,null,"MSHS/K-12",159,254.4]
["0097","South Street Elementary","00970060",null,"PK - 04","SW",686,null,"ES",456,729.6]
["0325","Southampton Road","03250040",null,"K  - 05","SW",417,null,"ES",144,230.4]
["0277","Southbridge High School","02770515",null,"09 - 12","SW",525,null,"HS",341,545.6]
["0277","Southbridge Middle School","02770315",null,"06 - 08","SW",499,null,"MS",341,545.6]
["0872","Southeastern Regional Vocational Technical","08720605",null,"09 - 12","SW",1409,null,"HS",511,817.6]
["0766","Southwick Regional School","07660505",null,"07 - 12","NT",715,null,"MSHS/K-12",115,184]
["0149","Spark Academy","01490085",null,"06 - 08","SW",467,null,"MS",304,486.40000000000003]
["0735","Spaulding Memorial","07350005",null,"K  - 04","TA",423,null,"ES",108,172.8]
["0095","Spencer Borden","00950130",null,"K  - 05","NT",591,null,"ES",351,561.6]
["0038","Spofford Pond","00380013",null,"03 - 06","TA",393,null,"ES",22,35.200000000000003]
["0317","Sprague Elementary School","03170048",null,"K  - 05","NT",383,null,"ES",21,33.6]
["0271","Spring Street","02710035",null,"K  - 04","NT",358,null,"ES",15,24]
["0323","Spring Street School","03230005",null,"PK - K","TA",145,null,"EES",21,33.6]
["0281","Springfield Central High","02810500",null,"09 - 12","SW",2031,null,"HS",1305,2088]
["0281","Springfield High School","02810570",null,"09 - 12","SW",228,null,"HS",177,283.2]
["0281","Springfield High School of Science and Technology","02810530",null,"09 - 12","SW",1292,null,"HS",1008,1612.8000000000002]
["3510","Springfield Preparatory Charter School","35100205",null,"K  - 03","SW",213,null,"ES",143,228.8]
["0281","Springfield Public Day Elementary School","02810005",null,"K  - 05","SW",84,null,"ES",72,115.2]
["0281","Springfield Public Day High School","02810550",null,"09 - 12","SW",93,null,"HS",82,131.20000000000002]
["0281","Springfield Public Day Middle School","02810345",null,"06 - 08","SW",50,null,"MS",47,75.2]
["0281","Springfield Vocational Academy","02810675",null,null,"NT",81,null,"SP",61,97.600000000000009]
["0735","Squannacook Early Childhood Center","07350002",null,"PK","NT",100,null,"EES",24,38.400000000000006]
["0243","Squantum","02430095",null,"K  - 05","NT",345,null,"ES",92,147.20000000000002]
["0185","Stacy Middle","01850305",null,"06 - 08","NT",990,null,"MS",307,491.20000000000005]
["0248","Staff Sargent James J. Hill Elementary School","02480035",null,"K  - 05","SW",709,null,"ES",352,563.20000000000005]
["0025","Stall Brook","00250025",null,"K  - 03","SW",313,null,"ES",60,96]
["0291","Stanley","02910020",null,"K  - 04","NT",298,null,"ES",17,27.200000000000003]
["0309","Stanley M Koziol Elementary School","03090020",null,"PK - 03","SW",426,null,"ES",244,390.40000000000003]
["0645","Station Avenue Elementary","06450025",null,"K  - 03","SW",419,null,"ES",157,251.20000000000002]
["0236","Stearns","02360090",null,"K  - 05","NT",238,null,"ES",104,166.4]
["0281","STEM Middle Academy","02810350",null,"06 - 08","SW",287,null,"MS",190,304]
["0298","Steward Elementary","02980010",null,"PK - 03","TA",381,null,"ES",16,25.6]
["0095","Stone PK-12 School","00950340",null,"K,02 - 09,12","SW",50,null,"MSHS/K-12",44,70.400000000000006]
["0284","Stoneham Central Middle School","02840405",null,"05 - 08","TA",691,null,"MS",113,180.8]
["0284","Stoneham High","02840505",null,"09 - 12","NT",677,null,"HS",89,142.4]
["0041","Stony Brook Elementary","00410005",null,"PK - 02","TA",236,null,"EES",64,102.4]
["0326","Stony Brook School","03260330",null,"06 - 08","NT",649,null,"MS",39,62.400000000000006]
["0680","Stony Hill School","06800050",null,"02 - 03","TA",303,null,"ES",55,88]
["0285","Stoughton High","02850505",null,"09 - 12","NT",1096,null,"HS",276,441.6]
["0061","Streiber Memorial School","00610065",null,"K  - 05","NT",283,null,"ES",115,184]
["0489","Sturgis Charter Public School","04890505",null,"09 - 12","NT",822,null,"HS",111,177.60000000000002]
["0348","Sullivan Middle","03480423",null,"06 - 08","NT",896,null,"MS",509,814.40000000000009]
["0164","Summer Street","01640020",null,"K  - 04","NT",430,null,"ES",22,35.200000000000003]
["0281","Sumner Avenue","02810160",null,"PK - 05","SW",613,null,"ES",477,763.2]
["0093","Sumner G. Whittier School","00930010",null,"K  - 08","SW",636,null,"ESMS",356,569.6]
["0289","Sunderland Elementary","02890005",null,"PK - 06","TA",237,null,"ES",73,116.80000000000001]
["0248","Susan B. Anthony Middle School","02480305",null,"06 - 08","SW",573,null,"MS",262,419.20000000000005]
["0290","Sutton Early Learning","02900003",null,"PK - 02","TA",328,null,"EES",38,60.800000000000004]
["0290","Sutton Elementary","02900005",null,"03 - 05","NT",328,null,"ES",34,54.400000000000006]
["0290","Sutton High School","02900510",null,"09 - 12","NT",395,null,"HS",30,48]
["0290","Sutton Middle School","02900305",null,"06 - 08","NT",367,null,"MS",34,54.400000000000006]
["0673","Swallow/Union School","06730005",null,"K  - 04","NT",291,null,"ES",21,33.6]
["0291","Swampscott High","02910505",null,"09 - 12","NT",676,null,"HS",107,171.20000000000002]
["0291","Swampscott Middle","02910305",null,"PK,05 - 08","TA",756,null,"MS",106,169.60000000000002]
["0017","Swanson Road Intermediate School","00170030",null,"03 - 05","TA",575,null,"ES",120,192]
["0728","Swift River","07280015",null,"PK - 06","TA",155,null,"ES",56,89.600000000000009]
["0024","Swift River Elementary","00240018",null,"01 - 03","TA",467,null,"ES",99,158.4]
["0122","Sylvester","01220015",null,"03 - 04","NT",228,null,"ES",13,20.8]
["0061","Szetela Early Childhood Center","00610001",null,"PK","NT",276,null,"EES",112,179.20000000000002]
["0236","Taconic High","02360510",null,"09 - 12","NT",723,null,"HS",286,457.6]
["0304","Taft Early Learning Center","03040005",null,"PK - 02","TA",449,null,"EES",106,169.60000000000002]
["0620","Tahanto Regional High","06200505",null,"06 - 12","TA",587,null,"MSHS/K-12",67,107.2]
["0095","Talbot Innovation School","00950305",null,"06 - 08","SW",526,null,"MS",388,620.80000000000007]
["0770","Tantasqua Regional Jr High","07700405",null,"07 - 08","TA",591,null,"MS",130,208]
["0770","Tantasqua Regional Sr High","07700505",null,"09 - 12","NT",716,null,"HS",105,168]
["0770","Tantasqua Regional Vocational","07700605",null,"09 - 12","NT",468,null,"HS",103,164.8]
["0332","Tatham","03320040",null,"K  - 05","NT",252,null,"ES",88,140.80000000000001]
["0348","Tatnuck","03480230",null,"PK - 06","SW",404,null,"ES",195,312]
["0293","Taunton Alternative High School","02930525",null,"10 - 12","NT",110,null,"HS",77,123.2]
["0293","Taunton High","02930505",null,"08 - 12","NT",2625,null,"MSHS/K-12",991,1585.6000000000001]
["0128","TEACH","01280073",null,"K  - 12","NT",48,null,"MSHS/K-12",31,49.6]
["0096","Teaticket","00960015",null,"PK - 04","SW",375,null,"ES",173,276.8]
["3902","TEC Connections Academy Commonwealth Virtual School","39020900",null,"K  - 12","SW",1855,null,"MSHS/K-12",776,1241.6000000000001]
["0035","TechBoston Academy","00350657",null,"06 - 12","SW",915,null,"MSHS/K-12",600,960]
["0720","Templeton Center","07200020",null,"K  - 01","TA",171,null,"EES",39,62.400000000000006]
["0181","Tenney Grammar School","01810055",null,"PK - 08","TA",1376,null,"ESMS",560,896]
["0295","Tewksbury Memorial High","02950505",null,"09 - 12","NT",915,null,"HS",120,192]
["0114","The Academy of Early Learning at North Parish","01140005",null,"PK","NT",122,null,"EES",58,92.800000000000011]
["0160","The Career Academy","01600515",null,"09 - 12","SW",122,null,"HS",86,137.6]
["0035","The English High","00350535",null,"09 - 12","SW",541,null,"HS",369,590.4]
["0755","The Gateway to College","07550525",null,"09 - 12","NT",107,null,"HS",48,76.800000000000011]
["0046","The Lynch Center","00460060",null,"PK","NT",69,null,"EES",15,24]
["0281","The Springfield Renaissance School an Expeditionary Learning School","02810205",null,"06 - 12","SW",692,null,"MSHS/K-12",343,548.80000000000007]
["0236","Theodore Herberg Middle","02360310",null,"06 - 08","NT",648,null,"MS",278,444.8]
["0625","Therapeutic Day School","06250415",null,"07 - 12","NT",19,null,"MSHS/K-12",10,16]
["0175","Thomas Blake Middle","01750305",null,"06 - 08","NT",624,null,"MS",23,36.800000000000004]
["0229","Thomas Carroll","02290010",null,"K  - 05","SW",621,null,"ES",259,414.40000000000003]
["0031","Thomas Ditson","00310005",null,"K  - 05","TA",539,null,"ES",99,158.4]
["0035","Thomas J Kenny","00350328",null,"PK - 05","SW",322,null,"ES",204,326.40000000000003]
["0281","Thomas M Balliet","02810015",null,"PK - 05","SW",322,null,"ES",232,371.20000000000005]
["0775","Thomas Prince","07750045",null,"K  - 08","NT",408,null,"ESMS",25,40]
["0308","Thomas R Plympton Elementary School","03080050",null,"K  - 05","SW",420,null,"ES",155,248]
["0201","Thomas R Rodman","02010125",null,"K  - 05","SW",195,null,"ES",134,214.4]
["0336","Thomas V Nash","03360060",null,"K  - 04","NT",206,null,"ES",53,84.800000000000011]
["0336","Thomas W. Hamilton Primary School","03360105",null,"K  - 04","NT",354,null,"ES",71,113.60000000000001]
["0016","Thomas Willett Elementary School","00160035",null,"K  - 04","SW",430,null,"ES",170,272]
["0010","Thompson","00100050",null,"K  - 05","TA",486,null,"ES",72,115.2]
["0211","Thomson","02110020",null,"K  - 05","TA",342,null,"ES",79,126.4]
["0067","Thoreau","00670020",null,"PK - 05","NT",458,null,"ES",24,38.400000000000006]
["0348","Thorndyke Road","03480235",null,"K  - 06","SW",388,null,"ES",166,265.60000000000002]
["0680","Thornton Burgess","06800305",null,"06 - 08","TA",104,null,"MS",28,44.800000000000004]
["0163","Thurgood Marshall Mid","01630305",null,"06 - 08","SW",1315,null,"MS",837,1339.2]
["0128","Tilton","01280075",null,"K  - 04","SW",534,null,"ES",365,584]
["0296","Tisbury Elementary","02960005",null,"PK - 08","TA",303,null,"ESMS",84,134.4]
["0343","Toy Town Elementary","03430050",null,"03 - 05","SW",293,null,"ES",118,188.8]
["0163","Tracy","01630100",null,"01 - 05","SW",440,null,"ES",291,465.6]
["0878","Tri-County Regional Vocational Technical","08780605",null,"09 - 12","TA",975,null,"HS",182,291.2]
["0201","Trinity Day Academy","02010510",null,"06 - 12","SW",81,null,"MSHS/K-12",71,113.60000000000001]
["0773","Triton Regional High School","07730505",null,"09 - 12","NT",709,null,"HS",116,185.60000000000002]
["0773","Triton Regional Middle School","07730405",null,"07 - 08","NT",410,null,"MS",85,136]
["0300","Truro Central","03000005",null,"PK - 05","NT",106,null,"ES",34,54.400000000000006]
["0189","Tucker","01890020",null,"PK - 05","TA",440,null,"ES",78,124.80000000000001]
["0162","Turkey Hill Elementary School","01620025",null,"03 - 05","TA",368,null,"ES",61,97.600000000000009]
["0674","Turners Fall High","06740505",null,"09 - 12","NT",224,null,"HS",69,110.4]
["0301","Tyngsborough Elementary","03010020",null,"PK - 05","TA",798,null,"ES",98,156.80000000000001]
["0301","Tyngsborough High School","03010505",null,"09 - 12","NT",482,null,"HS",38,60.800000000000004]
["0301","Tyngsborough Middle","03010305",null,"06 - 08","NT",409,null,"MS",57,91.2]
["0765","Undermountain","07650035",null,"PK - 06","TA",292,null,"ES",109,174.4]
["0207","Underwood","02070115",null,"K  - 05","TA",285,null,"ES",24,38.400000000000006]
["0348","Union Hill School","03480240",null,"K  - 06","SW",463,null,"ES",360,576]
["0348","University Pk Campus School","03480285",null,"07 - 12","NT",238,null,"MSHS/K-12",139,222.4]
["0480","UP Academy Charter School of Boston","04800405",null,"06 - 08","SW",498,null,"MS",328,524.80000000000007]
["3505","UP Academy Charter School of Dorchester","35050405",null,"PK - 08","SW",736,null,"ESMS",463,740.80000000000007]
["0035","UP Academy Holland","00350167",null,"PK - 05","SW",767,null,"ES",561,897.6]
["0149","UP Academy Leonard Middle School","01490090",null,"06 - 08","SW",299,null,"MS",188,300.8]
["0149","UP Academy Oliver Middle School","01490049",null,"06 - 08","SW",356,null,"MS",232,371.20000000000005]
["0879","Upper Cape Cod Vocational Technical","08790605",null,"09 - 12","TA",698,null,"HS",162,259.2]
["0035","Urban Science Academy","00350579",null,"09 - 12","SW",364,null,"HS",196,313.60000000000002]
["0304","Uxbridge High","03040505",null,"09 - 12","NT",480,null,"HS",88,140.80000000000001]
["0281","Van Sickle Academy","02810485",null,"06 - 08","SW",411,null,"MS",297,475.20000000000005]
["0735","Varnum Brook","07350035",null,"K  - 04","TA",541,null,"ES",114,182.4]
["0049","Vassal Lane Upper School","00490320",null,"06 - 08","NT",278,null,"MS",86,137.6]
["0498","Veritas Preparatory Charter School","04980405",null,"05 - 08","SW",316,null,"MS",219,350.40000000000003]
["0348","Vernon Hill School","03480280",null,"PK - 06","SW",550,null,"ES",392,627.20000000000005]
["0107","Veterans Memorial","01070045",null,"K  - 05","SW",207,null,"ES",108,172.8]
["0262","Veterans Memorial","02620065",null,"PK - 05","SW",539,null,"ES",159,254.4]
["0161","Veterans Park Elementary","01610023",null,"04 - 05","SW",395,null,"ES",108,172.8]
["0168","Village School","01680016",null,"04 - 06","TA",644,null,"ES",63,100.80000000000001]
["0099","Vincent M Igo Elementary","00990020",null,"K  - 04","TA",395,null,"ES",79,126.4]
["0344","Vinson-Owen Elementary","03440025",null,"PK - 05","NT",459,null,"ES",13,20.8]
["0214","W Edward Balmer","02140001",null,"02 - 04","SW",508,null,"ES",160,256]
["0775","Wachusett Regional High","07750505",null,"09 - 12","NT",2118,null,"HS",174,278.40000000000003]
["0635","Wahconah Regional High","06350505",null,"09 - 12","NT",533,null,"HS",137,219.20000000000002]
["0305","Wakefield Memorial High","03050505",null,"09 - 12","TA",1031,null,"HS",129,206.4]
["0306","Wales Elementary","03060005",null,"PK - 06","TA",160,null,"ES",43,68.8]
["0128","Walnut Square","01280080",null,"K  - 02","NT",139,null,"EES",41,65.600000000000009]
["0307","Walpole High","03070505",null,"09 - 12","NT",1124,null,"HS",105,168]
["0100","Walsh Middle","01000310",null,"06 - 08","NT",754,null,"MS",206,329.6]
["0271","Walter J Paton","02710025",null,"K  - 04","NT",348,null,"ES",14,22.400000000000002]
["0246","Walter S Parker Middle","02460310",null,"06 - 08","NT",559,null,"MS",57,91.2]
["0308","Waltham Public Schools Dual Language Program","03080001",null,"K  - 01","NT",79,null,"EES",27,43.2]
["0308","Waltham Sr High","03080505",null,"09 - 12","NT",1606,null,"HS",530,848]
["0305","Walton","03050040",null,"01 - 04","NT",209,null,"ES",18,28.8]
["0264","Wampatuck Elementary","02640020",null,"PK - 05","NT",398,null,"ES",42,67.2]
["0016","Wamsutta Middle School","00160320",null,"05 - 08","NT",568,null,"MS",171,273.60000000000002]
["0309","Ware Junior/Senior High School","03090505",null,"07 - 12","NT",462,null,"MSHS/K-12",206,329.6]
["0309","Ware Middle School","03090305",null,"04 - 06","SW",343,null,"ES",158,252.8]
["0310","Wareham Cooperative Alternative School","03100315",null,"09 - 12","NT",71,null,"HS",40,64]
["0310","Wareham Middle","03100305",null,"05 - 08","NT",724,null,"MS",363,580.80000000000007]
["0310","Wareham Senior High","03100505",null,"09 - 12","NT",446,null,"HS",169,270.40000000000003]
["0281","Warner","02810180",null,"PK - 05","SW",288,null,"ES",202,323.20000000000005]
["0778","Warren Elementary","07780005",null,"PK - 06","SW",447,null,"ES",211,337.6]
["0035","Warren-Prescott","00350346",null,"PK - 08","SW",595,null,"ESMS",260,416]
["0750","Warwick Community School","07500009",null,"PK - 06","TA",56,null,"ES",13,20.8]
["0160","Washington","01600055",null,"PK - 04","SW",249,null,"ES",117,187.20000000000002]
["0281","Washington","02810185",null,"PK - 05","SW",429,null,"ES",334,534.4]
["0163","Washington Elementary School","01630005",null,"K  - 05","SW",471,null,"ES",336,537.6]
["0035","Washington Irving Middle","00350445",null,"06 - 08","SW",338,null,"MS",222,355.20000000000005]
["0103","Waterford Street","01030020",null,"PK - 01","SW",493,null,"EES",285,456]
["0314","Watertown High","03140505",null,"09 - 12","NT",674,null,"HS",178,284.8]
["0314","Watertown Middle","03140305",null,"06 - 08","TA",524,null,"MS",137,219.20000000000002]
["0348","Wawecus Road School","03480026",null,"K  - 06","SW",159,null,"ES",89,142.4]
["0315","Wayland High School","03150505",null,"09 - 12","NT",864,null,"HS",48,76.800000000000011]
["0315","Wayland Middle School","03150305",null,"06 - 08","NT",643,null,"MS",44,70.400000000000006]
["0316","Webster Middle School","03160315",null,"05 - 08","SW",604,null,"MS",307,491.20000000000005]
["0093","Webster School","00930015",null,"PK - 05","NT",740,null,"ES",381,609.6]
["0317","Wellesley Middle","03170305",null,"06 - 08","NT",1128,null,"MS",58,92.800000000000011]
["0317","Wellesley Sr High","03170505",null,"09 - 12","TA",1561,null,"HS",102,163.20000000000002]
["0318","Wellfleet Elementary","03180005",null,"PK - 05","TA",119,null,"ES",41,65.600000000000009]
["0336","Wessagusset","03360110",null,"K  - 04","NT",283,null,"ES",71,113.60000000000001]
["0020","West Barnstable Elementary","00200005",null,"K  - 03","NT",256,null,"ES",72,115.2]
["0322","West Boylston Junior/Senior High","03220505",null,"06 - 12","NT",486,null,"MSHS/K-12",83,132.80000000000001]
["0323","West Bridgewater Junior/Senior","03230505",null,"07 - 12","NT",628,null,"MSHS/K-12",76,121.60000000000001]
["0778","West Brookfield Elementary","07780010",null,"PK - 06","NT",302,null,"ES",77,123.2]
["0009","West Elementary","00090025",null,"K  - 05","TA",610,null,"ES",45,72]
["0239","West Elementary","02390047",null,"K  - 05","TA",394,null,"ES",99,158.4]
["0285","West Elementary","02850020",null,"PK - 05","SW",375,null,"ES",172,275.2]
["0342","West Intermediate","03420080",null,"04 - 05","NT",247,null,"ES",28,44.800000000000004]
["0229","West Memorial","02290045",null,"PK - 05","NT",253,null,"ES",45,72]
["0044","West Middle School","00440420",null,"06 - 08","NT",646,null,"MS",309,494.40000000000003]
["0107","West Parish","01070050",null,"K  - 05","SW",351,null,"ES",107,171.20000000000002]
["0035","West Roxbury Academy","00350658",null,"09 - 12","SW",466,null,"HS",271,433.6]
["0274","West Somerville Neighborhood","02740115",null,"PK - 08","SW",366,null,"ESMS",140,224]
["0332","West Springfield High","03320505",null,"09 - 12","NT",1222,null,"HS",466,745.6]
["0332","West Springfield Middle","03320305",null,"06 - 08","SW",938,null,"MS",423,676.80000000000007]
["0111","West Street","01110010",null,"PK - 03","TA",217,null,"ES",78,124.80000000000001]
["0277","West Street","02770020",null,"02 - 05","SW",332,null,"ES",235,376]
["0348","West Tatnuck","03480260",null,"PK - 06","NT",373,null,"ES",106,169.60000000000002]
["0774","West Tisbury Elementary","07740020",null,"PK - 08","TA",340,null,"ESMS",66,105.60000000000001]
["0020","West Villages Elementary School","00200045",null,"K  - 03","NT",438,null,"ES",91,145.6]
["0321","Westborough High","03210505",null,"09 - 12","NT",1127,null,"HS",87,139.20000000000002]
["0325","Westfield High","03250505",null,"09 - 12","SW",1231,null,"HS",330,528]
["0325","Westfield Technical Academy","03250605",null,"09 - 12","SW",539,null,"HS",181,289.60000000000002]
["0326","Westford Academy","03260505",null,"09 - 12","NT",1713,null,"HS",73,116.80000000000001]
["0327","Westhampton Elementary School","03270005",null,"PK - 06","NT",121,null,"ES",17,27.200000000000003]
["0610","Westminster Elementary","06100005",null,"02 - 05","NT",380,null,"ES",55,88]
["0330","Weston High","03300505",null,"09 - 12","TA",693,null,"HS",34,54.400000000000006]
["0330","Weston Middle","03300305",null,"06 - 08","TA",483,null,"MS",15,24]
["0331","Westport Elementary","03310030",null,"03 - 06","TA",504,null,"ES",126,201.60000000000002]
["0331","Westport Junior/Senior High School","03310515",null,"07 - 12","NT",553,null,"MSHS/K-12",127,203.20000000000002]
["0335","Westwood High","03350505",null,"09 - 12","NT",1004,null,"HS",43,68.8]
["0335","Westwood Integrated Preschool","03350050",null,"PK","NT",48,null,"EES",3,4.8000000000000007]
["0336","Weymouth High School","03360505",null,"09 - 12","NT",1881,null,"HS",440,704]
["0201","Whaling City Junior/Senior High School","02010515",null,"06 - 12","SW",119,null,"MSHS/K-12",94,150.4]
["0337","Whately Elementary","03370005",null,"PK - 06","NT",137,null,"ES",28,44.800000000000004]
["0086","White Brook Middle School","00860305",null,"05 - 08","TA",451,null,"MS",121,193.60000000000002]
["0281","White Street","02810190",null,"K  - 05","SW",448,null,"ES",380,608]
["0304","Whitin Elementary School","03040020",null,"03 - 05","TA",380,null,"ES",76,121.60000000000001]
["0780","Whitman Hanson Regional","07800505",null,"09 - 12","NT",1175,null,"HS",197,315.20000000000005]
["0780","Whitman Middle","07800310",null,"06 - 08","TA",574,null,"MS",122,195.20000000000002]
["0885","Whittier Regional Vocational","08850605",null,"09 - 12","SW",1247,null,"HS",369,590.4]
["0680","Wilbraham Middle","06800310",null,"06 - 08","NT",606,null,"MS",86,137.6]
["0342","Wildwood","03420015",null,"PK - K","NT",203,null,"EES",21,33.6]
["0008","Wildwood Elementary","00080050",null,"K  - 06","TA",402,null,"ES",129,206.4]
["0067","Willard","00670030",null,"PK - 05","NT",440,null,"ES",20,32]
["0057","William A Berkowitz Elementary","00570025",null,"01 - 04","SW",506,null,"ES",329,526.4]
["0229","William A Welch Sr","02290027",null,"PK - 05","SW",363,null,"ES",184,294.40000000000003]
["0275","William E Norris","02750005",null,"PK - 06","TA",510,null,"ES",68,108.80000000000001]
["0035","William E Russell","00350366",null,"PK - 05","SW",418,null,"ES",273,436.8]
["0335","William E Sheehan","03350025",null,"K  - 05","NT",317,null,"ES",10,16]
["0035","William Ellery Channing","00350360",null,"PK - 05","SW",214,null,"ES",140,224]
["0308","William F. Stanley Elementary School","03080005",null,"PK - 05","SW",429,null,"ES",149,238.4]
["0219","William G Vinal","02190020",null,"PK - 05","NT",518,null,"ES",9,14.4]
["0046","William H Lincoln","00460035",null,"K  - 08","TA",578,null,"ESMS",78,124.80000000000001]
["0035","William H Ohrenberger","00350258",null,"03 - 08","SW",668,null,"ESMS",332,531.20000000000005]
["0201","William H Taylor","02010135",null,"PK - 05","SW",274,null,"ES",154,246.4]
["0035","William McKinley","00350363",null,"01 - 12","SW",377,null,"MSHS/K-12",297,475.20000000000005]
["0199","William Mitchell","01990040",null,"K  - 05","NT",496,null,"ES",15,24]
["0035","William Monroe Trotter","00350370",null,"PK - 08","SW",537,null,"ESMS",426,681.6]
["0281","William N. DeBerry","02810045",null,"K  - 05","SW",266,null,"ES",239,382.40000000000003]
["0346","William P. Gorman/Fort Banks Elementary","03460015",null,"PK - 02","TA",463,null,"EES",133,212.8]
["0014","William Pittaway Elementary","00140005",null,"PK","NT",132,null,"EES",15,24]
["0163","William R Fallon","01630080",null,"K  - 06","SW",46,null,"ES",33,52.800000000000004]
["0137","William R. Peck School","01370030",null,"04 - 08","SW",334,null,"ESMS",297,475.20000000000005]
["0095","William S Greene","00950065",null,"PK - 05","SW",755,null,"ES",522,835.2]
["0336","William Seach","03360080",null,"K  - 04","SW",320,null,"ES",164,262.40000000000003]
["0207","Williams","02070125",null,"K  - 05","NT",288,null,"ES",21,33.6]
["0236","Williams","02360100",null,"K  - 05","NT",314,null,"ES",96,153.60000000000002]
["0625","Williams Intermediate School","06250300",null,"04 - 06","NT",809,null,"ES",148,236.8]
["0159","Williams Middle","01590305",null,"06 - 08","NT",330,null,"MS",18,28.8]
["0341","Williamstown Elementary","03410010",null,"PK - 06","TA",462,null,"ES",85,136]
["0071","Willis E Thorpe","00710045",null,"K  - 05","TA",312,null,"ES",52,83.2]
["0342","Wilmington High","03420505",null,"09 - 12","NT",863,null,"HS",70,112]
["0342","Wilmington Middle School","03420330",null,"06 - 08","NT",838,null,"MS",74,118.4]
["0198","Wilson Middle","01980310",null,"05 - 08","NT",947,null,"MS",102,163.20000000000002]
["0343","Winchendon PreSchool Program","03430010",null,"PK","NT",79,null,"EES",38,60.800000000000004]
["0344","Winchester High School","03440505",null,"09 - 12","NT",1343,null,"HS",86,137.6]
["0026","Winn Brook","00260005",null,"K  - 04","NT",486,null,"ES",14,22.400000000000002]
["0035","Winship Elementary","00350374",null,"PK - 05","SW",214,null,"ES",97,155.20000000000002]
["0274","Winter Hill Community","02740120",null,"PK - 08","SW",466,null,"ESMS",264,422.40000000000003]
["0144","Winthrop","01440015",null,"PK - 05","TA",375,null,"ES",81,129.6]
["0178","Winthrop","01780050",null,"K  - 05","NT",405,null,"ES",23,36.800000000000004]
["0346","Winthrop High School","03460505",null,"PK,09 - 12","NT",573,null,"HS",123,196.8]
["0026","Winthrop L Chenery Middle","00260305",null,"05 - 08","NT",1427,null,"MS",115,184]
["0346","Winthrop Middle School","03460305",null,"06 - 08","NT",468,null,"MS",122,195.20000000000002]
["0675","Winthrop School","06750015",null,"PK - 05","TA",292,null,"ES",27,43.2]
["0767","Wire Village School","07670040",null,"K  - 04","TA",446,null,"ES",174,278.40000000000003]
["0258","Witchcraft Heights","02580070",null,"K  - 05","SW",476,null,"ES",191,305.60000000000002]
["0155","Wm Diamond Middle","01550310",null,"06 - 08","NT",889,null,"MS",39,62.400000000000006]
["0050","Wm H Galvin Middle","00500305",null,"06 - 08","NT",739,null,"MS",112,179.20000000000002]
["0137","Wm J Dean Vocational Technical High","01370605",null,"10 - 12","SW",182,null,"HS",151,241.60000000000002]
["0131","Wm L Foster Elementary","01310010",null,"K  - 05","TA",445,null,"ES",23,36.800000000000004]
["0163","Wm P Connery","01630040",null,"PK - 05","SW",649,null,"ES",448,716.80000000000007]
["0347","Woburn High","03470505",null,"09 - 12","NT",1319,null,"HS",298,476.8]
["0342","Woburn Street","03420020",null,"01 - 03","TA",376,null,"ES",42,67.2]
["0159","Wolf Swamp Road","01590025",null,"PK - 05","TA",412,null,"ES",52,83.2]
["0243","Wollaston School","02430110",null,"K  - 05","NT",331,null,"ES",112,179.20000000000002]
["0246","Wood End Elementary School","02460020",null,"K  - 05","NT",291,null,"ES",21,33.6]
["0009","Wood Hill Middle School","00090350",null,"06 - 08","TA",418,null,"MS",28,44.800000000000004]
["0185","Woodland","01850090",null,"03 - 05","SW",981,null,"ES",346,553.6]
["0330","Woodland","03300015",null,"PK - 03","NT",304,null,"ES",15,24]
["0348","Woodland Academy","03480030",null,"K  - 06","SW",635,null,"ES",480,768]
["0766","Woodland School","07660010",null,"PK - 02","TA",359,null,"EES",102,163.20000000000002]
["0100","Woodrow Wilson","01000055",null,"K  - 05","SW",572,null,"ES",302,483.20000000000005]
["0001","Woodsdale Elementary School","00010015",null,"03 - 04","NT",319,null,"ES",84,134.4]
["0305","Woodville School","03050015",null,"K  - 04","TA",437,null,"ES",80,128]
["0348","Worcester Arts Magnet School","03480225",null,"PK - 06","SW",407,null,"ES",125,200]
["0348","Worcester East Middle","03480420",null,"06 - 08","NT",828,null,"MS",560,896]
["0348","Worcester Technical High","03480605",null,"09 - 12","NT",1387,null,"HS",610,976]
["0347","Wyman","03470060",null,"K  - 05","NT",182,null,"ES",37,59.2]
["0035","Young Achievers","00350380",null,"PK - 08","SW",567,null,"ESMS",378,604.80000000000007]
["0207","Zervas","02070130",null,"K  - 05","NT",413,null,"ES",36,57.6]