{"text_format":"1","workbook":"xlsx","n_sheets":9,"sheets":["Instructions","Cover Sheet","Budget Pages","School_Lookup","School","Amendment","Indirect Costs","supt list 040604","FY19 Budget Projection"],"not_rendered":{"charts":0,"images":1,"macros":0,"external_links":1,"defined_names":32,"comments":1,"pivot_tables":0},"unopened":[],"bounds":{"document_bytes":16777216,"sheet_cells":100000,"rows_first":2000,"rows_last":500,"rows_between":2000,"halvings":0,"cell_chars":16384,"cell_head_chars":4096},"cells_cut":0,"cells_raw":0,"read":"whole","date_system":"1900"}

{"sheet":"Instructions","index":0,"n_rows":8,"n_cols":2,"rows_kept":8,"cut":false,"hidden":false,"merged":[]}
["Massachusetts Department of Elementary and Secondary Education\nBudget Workbook Instructions\n","Russ Fleming 8-21-14\n8-21-2014"]
["School Redesign (SRG) and Level 3 School Turnaround Grant"]
["FY 2019 Fund Code 511 and 539"]
["Overview\nThis Excel workbook contains budget forms that a school district must submit to the Massachusetts Department of Elementary and Secondary Education in applying for the above-listed grant opportunities. The forms are on separate worksheets within this workbook. To access the worksheets and complete the necessary information, click on the appropriate worksheet - for example, Cover Sheet - listed at the bottom of this page.\n"]
["Cover Sheet\nOn the Cover Sheet worksheet, select your district name from the drop-down menu and enter the contact person's name and phone number. Enter the amount the district for which the district is eligible in the Total Allocation cell. The Total Amount Requested cell will fill in automatically and is linked to the budget pages; this amount may be different than the allocation amount if the district chooses to not apply for the full allocation.\n"]
["Budget Summary\nEnter the budget details in the Budget Summary worksheet. Be sure to enter Number of Staff, Full-time Equivalent (FTE), and Contractual Services rates per hour or day where indicated.  Stipends do not need to be associated with FTEs; however, showing rates is required (provide an hourly, daily, flat, or other rate as well as other information requested in the line item). As well, include narrative details for line item expenditures in Column J (Line Item Explanation). Additional guidance regarding how to complete grant applications is available at: http://finance1.doe.mass.edu/Grants/procedure/manual.html (procedural manual). \n"]
["\nSubmitting the Workbook\nSave the workbook file as 'FY19 SRG.L3 Grant' and email it to srg@doe.mass.edu. \nNo hard copies mailed to ESE is necessary."]
["Final Notes / Amendments\nOnce your grant is approved, the Department will email you an approved copy of the budget workbook. You must use this approved electronic copy to make any future amendments to the grant. Do so by completing the Amendment worksheet and updating the Budget Summary. An indirect cost calculator has been included on a separate worksheet. Use this, if necessary, to calculate the amount to use for indirect costs. "]

{"sheet":"Cover Sheet","index":1,"n_rows":35,"n_cols":16,"rows_kept":35,"cut":false,"hidden":false,"merged":[[16,5,16,7],[16,1,16,3],[16,10,16,11],[14,1,15,3],[0,1,0,15],[1,1,1,15],[4,5,4,7],[3,12,3,13],[4,8,4,12],[4,13,4,15],[6,5,6,11],[7,5,7,7],[13,12,13,13],[11,1,11,15],[8,5,8,7],[7,11,7,13],[12,9,12,13],[12,1,12,3],[13,9,13,11],[12,4,12,8],[12,14,13,15],[13,4,13,8],[13,1,13,3],[33,1,33,15],[31,1,31,15],[18,1,18,15],[14,9,15,11],[14,12,15,13],[25,1,25,15],[17,3,17,13],[17,14,17,15],[23,14,23,15],[14,4,15,8],[32,1,32,15],[20,5,20,11],[22,14,22,15],[14,14,15,15],[22,5,22,11],[20,14,20,15]]}
[null,"Massachusetts Department of Elementary and Secondary Education"]
[null,"STANDARD CONTRACT FORM AND APPLICATION FOR PROGRAM GRANTS"]
[null,"PART I - GENERAL"]
[null,"A. APPLICANT",null,"District Name:",null,null,null,1,null,null,null,null,"District Code:",null,{"$f":"LEFT(VLOOKUP('Cover Sheet'!$H$4,suptlist,6,FALSE),4)","v":"ORGA"}]
[null,"Contact Name:",null,null,null,null,null,null,"Email Address:"]
[]
[null,"Address: ",null,null,null,{"$f":"VLOOKUP('Cover Sheet'!$H$4,suptlist,7,FALSE)","v":"ADDRESS LINE 1"},{"$f":"VLOOKUP('Cover Sheet'!$H$4,'supt list 040604'!C6:M397,5,FALSE)","v":{"$error":"#N/A"}}]
[null,null,null,null,null,{"$f":"VLOOKUP('Cover Sheet'!$H$4,suptlist,9,FALSE)","v":"CITY/TOWN"},null,null,null,null,null,{"$f":"VLOOKUP('Cover Sheet'!$H$4,suptlist,11,FALSE)","v":"ZIP CODE"}]
[null,"Contact Telephone:"]
[]
[]
[null,"B. APPLICATION FOR PROGRAM FUNDING"]
[null,"Fund Code",null,null,"Program Name",null,null,null,null,"PROJECT DURATION",null,null,null,null,"Total Request\n"]
[null,null,null,null,null,null,null,null,null,"FROM",null,null,"TO"]
[null,539,null,null,"Level 3 School Turnaround Grant Fund Code 539",null,null,null,null,"Upon Approval",null,null,"2019-06-30"]
[]
[null,511,null,null,null,"School Redesign Grant Fund Code 511 and ",null,null,null,null,"Upon Approval",null,null,"2019-08-31"]
[null,null,null,"TOTAL AMOUNT REQUESTED:\nThis amount is linked to the grand total on the budget page and cannot be edited here.\n",null,null,null,null,null,null,null,null,null,null,{"$f":"'Budget Pages'!$N$99","v":0}]
[null,"C. I CERTIFY THAT THE INFORMATION CONTAINED IN THIS APPLICATION IS CORRECT AND COMPLETE; THAT THE APPLICANT AGENCY HAS AUTHORIZED ME, AS ITS REPRESENTATIVE, TO FILE THIS APPLICATION; AND THAT I UNDERSTAND THAT FOR ANY FUNDS RECEIVED THROUGH THIS APPLICATION THE AGENCY AGREES TO COMPLY WITH ALL APPLICATION STATE AND FEDERAL GRANT REQUIREMENTS COVERING BOTH THE PROGRAMMATIC AND FISCAL ADMINISTRATION OF GRANT FUNDS"]
[]
{"$rows_left_out":16}
{"sheet":"Budget Pages","index":2,"n_rows":100,"n_cols":15,"rows_kept":100,"cut":false,"hidden":false,"merged":[[95,2,95,9],[95,14,96,14],[96,2,96,9],[97,2,97,9],[98,2,98,9],[88,1,88,9],[89,1,89,9],[90,1,90,9],[91,2,91,9],[92,2,92,7],[93,2,94,9],[79,2,79,9],[80,1,81,1],[80,2,81,9],[80,14,81,14],[83,1,83,9],[83,14,90,14],[84,1,84,9],[85,1,85,9],[86,1,86,9],[87,1,87,9],[71,2,71,9],[72,2,72,9],[73,2,73,9],[74,2,74,9],[74,14,78,14],[75,2,75,9],[76,2,76,9],[77,2,77,9],[78,2,78,9],[62,2,62,7],[63,2,63,9],[64,2,64,9],[65,2,65,9],[65,14,71,14],[66,2,66,9],[67,2,67,9],[68,2,68,9],[69,2,69,9],[70,2,70,9],[54,2,54,7],[54,14,61,14],[55,2,55,7],[56,2,56,7],[57,2,57,7],[58,2,58,7],[59,2,59,7],[60,2,60,7],[61,2,61,7],[48,2,48,9],[48,14,50,14],[49,2,49,9],[50,2,50,9],[51,2,52,9],[52,12,53,12],[52,13,53,13],[52,14,53,14],[53,2,53,7],[33,2,33,6],[34,2,34,6],[35,2,35,6],[44,1,45,13],[44,14,45,14],[46,2,46,9],[46,13,47,13],[47,2,47,9],[26,2,26,6],[27,2,27,6],[28,2,28,6],[28,14,35,14],[29,2,29,6],[30,2,30,6],[31,2,31,6],[32,2,32,6],[38,2,38,6],[40,2,40,6],[42,2,42,6],[36,2,36,6],[37,2,37,6],[18,2,18,6],[19,2,19,6],[19,14,25,14],[20,2,20,6],[21,2,21,6],[22,2,22,6],[23,2,23,6],[24,2,24,6],[25,2,25,6],[11,2,11,6],[12,2,12,6],[12,14,17,14],[13,2,13,6],[14,2,14,6],[15,2,15,6],[16,2,16,6],[17,2,17,6],[4,4,4,5],[4,9,4,12],[6,1,6,13],[7,1,7,13],[8,1,8,13],[9,1,10,1],[9,2,10,6],[5,1,5,13],[1,5,1,6],[1,7,1,8],[1,14,8,14],[2,1,2,3],[2,4,2,5],[2,8,2,9],[3,1,3,3],[3,4,3,5],[3,9,3,12],[4,1,4,3]]}
[null,"PART II - PROJECT EXPENDITURES - DETAIL INFORMATION",null,null,null,null,null,null,null,null,null,null,"A.",{"$f":"'Cover Sheet'!B15","v":539}]
[null,"B. APPLICANT AGENCY",null,null,null,{"$f":"VLOOKUP('Cover Sheet'!H4,suptlist,5,FALSE)","v":"ORGANIZATION NAME"},null,"District Code:",null,{"$f":"'Cover Sheet'!O4","v":"ORGA"},null,null,"FY",2019,"Line Item Narrative Description and Rationale:\n\n \n\nIn the spaces below describe in more detail line item expenditures, providing, for example, information that clearly identifies the individual or group providing a service or the rationale for proposing a purchase.\n"]
[null,"Contact Person:",null,null,null,null,null,"Address:",{"$f":"'Cover Sheet'!F7","v":"ADDRESS LINE 1"},null,null,null,{"$f":"'Cover Sheet'!F8","v":"CITY/TOWN"},{"$f":"'Cover Sheet'!L8","v":"ZIP CODE"}]
[null,"Telephone: ",null,null,null,null,null,"Email address:",null,null,null,null,null,""]
[null,"Summer phone:",null,null,null,null,null,"Submission Date:"]
[null,"SRG and L3 School Turnaround Grant"]
[null,"PLEASE PROVIDE ALL OF THE INFORMATION REQUESTED ABOVE AND SUBMIT ALL PAGES OF THE BUDGET DETAIL."]
[null,"C. ASSIGNMENT THROUGH SCHEDULE A"]
[null,"Check this box ONLY if this project will be using funds assigned by more than one agency.  A completed Schedule A, with signatures and the amount of funds assigned by each participating agency, must be attached to this Budget Detail."]
[null,"D.","STAFFING CATEGORIES",null,null,null,null,"E.","F.","G.",null,null,"H.","I.","J."]
[null,null,null,null,null,null,null,"# OF STAFF","FTE","MTRS*\n(see note below)",null,null,"AMOUNT","TOTAL","LINE ITEM EXPLANATION"]
[null,"1. ","ADMINISTRATORS:",null,null,null,null,null,null,null,null,null,"Do not use decimals",null,"To add narrative, click on the cell below (the \"Enter\" key works only when \"Alt\" + \"Enter\" are pressed together):"]
[null,null,null,null,null,null,null,null,null," ",null,null,null,null," "]
[null,null,null,null,null,null,null,null,null,null,false,{"$f":"IF(K14=TRUE,M14,0)","v":0}]
[null,null,null,null,null,null,null,null,null,null,false,0]
[null," ",null,null,null,null,null," "," ",null,null,0]
[null,null,"  \n",null,null,null,null,null,null,null,false,0]
[null,null,"SUB-TOTAL",null,null,null,null,{"$f":"SUM(H13:H17)","v":0},{"$f":"SUM(I13:I17)","v":0},null,null,null,null,{"$f":"ROUND(SUM(M13:M17), 0)","v":0}]
[null,"2.","INSTRUCTIONAL/\nPROFESSIONAL STAFF:",null,null,null,null,null,null,null,null,null," ",null," "]
[null,null,null,null,null,null,null,null,null,null,false,{"$f":"IF(K20=TRUE,M20,0)","v":0},null," "]
{"$rows_left_out":81}
{"sheet":"School_Lookup","index":3,"n_rows":134,"n_cols":8,"rows_kept":134,"cut":false,"hidden":true,"merged":[]}
[null,"SchoolList48",null,null,"Item #","Category","Title"]
[null,{"$f":"LEFT(#REF!,4)","v":{"$error":"#REF!"}},null,null,"1PD10001","Leadership","Instructional Leadership Training",{"$f":"E2&\": \" &G2","v":"1PD10001: Instructional Leadership Training"}]
[null,null,null,null,"9PDM10003","Mathematics","Mass Intel Math Initiative",{"$f":"E3&\": \" &G3","v":"9PDM10003: Mass Intel Math Initiative"}]
[0,{"$f":"IF(ISERROR($B$2),\"\",IF(LEFT(INDEX(school,MATCH(B$2,districtcode,FALSE)+$A4,2),4)=B$2,INDEX(school,MATCH(B$2,districtcode,FALSE)+$A4,3),\"\"))","v":""},{"$f":"IF(ISERROR($B$2),\"\",IF(LEFT(INDEX(school,MATCH(B$2,districtcode,FALSE)+$A4,2),4)=B$2,INDEX(school,MATCH(B$2,districtcode,FALSE)+$A4,2),\"\"))","v":""},null,"9PDM10004","Mathematics","Developing Algebraic Thinking for MS/HS Math Teachers","9PDM10004: Developing Algebraic Thinking for MS/HS Math Teachers"]
[1,"","",null,"9PDM10005","Mathematics","Understanding Rational Numbers","9PDM10005: Understanding Rational Numbers"]
[2,"","",null,"9PDM10006","Mathematics","The Coaching Cycle","9PDM10006: The Coaching Cycle"]
[3,"","",null,"9PDM10008","Mathematics","Academic Youth Development","9PDM10008: Academic Youth Development"]
[4,"","",null,"9PDM10009","Literacy","Differentiated Writing to Close the Achievement Gap","9PDM10009: Differentiated Writing to Close the Achievement Gap"]
[5,"","",null,"9PDM10010","Literacy","Foundations of Literacy K-3","9PDM10010: Foundations of Literacy K-3"]
[6,"","",null,"9PDM10011","Literacy","Language Essentials for Teachers of Reading & Spelling K-3","9PDM10011: Language Essentials for Teachers of Reading & Spelling K-3"]
[7,"","",null,"9PDM10012","Literacy","Reading and Writing Informational Text K-6","9PDM10012: Reading and Writing Informational Text K-6"]
[8,"","",null,"9PDM10013","Literacy","Reading in the Content Areas 6-8","9PDM10013: Reading in the Content Areas 6-8"]
[9,"","",null,"9PDM10014","Literacy","Teaching Expository & Persuasive Writing 6-12","9PDM10014: Teaching Expository & Persuasive Writing 6-12"]
[10,"","",null,"9PDM10015","Literacy","Oral Language and Vocabulary K-5","9PDM10015: Oral Language and Vocabulary K-5"]
[11,"","",null,"9PDM10016","Literacy","Writing in Response to Reading 2-5","9PDM10016: Writing in Response to Reading 2-5"]
[12,"","",null,"1TA10026","Targeted Offerings","Guided Self-Assessment on the Conditions for School Effectiveness","1TA10026: Guided Self-Assessment on the Conditions for School Effectiveness"]
[13,"","",null,"1TA10027","Targeted Offerings","Leadership Networks","1TA10027: Leadership Networks"]
[14,"","",null,"1TA10028","Targeted Offerings","Instructional Leadership Coaching","1TA10028: Instructional Leadership Coaching"]
[15,"","",null,"3TA10029","Targeted Offerings","Data Reporting and Analysis","3TA10029: Data Reporting and Analysis"]
[16,"","",null,"7TA10030","Targeted Offerings","Orientation to PLC Guidance","7TA10030: Orientation to PLC Guidance"]
{"$rows_left_out":115}
{"sheet":"School","index":4,"n_rows":1814,"n_cols":8,"rows_kept":1814,"cut":false,"hidden":true,"merged":[]}
["System","SCHOOL","School","Total","Gradeserved"]
["0001","00010003","Abington ECC",631,"PK - 03","Title I School (TA)"," "," "]
["0001","00010505","Abington High",510,"09 - 12","Non-Title I School (NT)"," "," "]
["0001","00010002","Center Elementary School",null,null,"Non-Title I School (NT)"]
["0001","00010405","Frolio Middle School",369,"07 - 08","Non-Title I School (NT)","Improvement Year 2 - Subgroups","Improvement Year 2 - Aggregate"]
["0001","00010015","Woodsdale",506,"04 - 06","Non-Title I School (NT)","Corrective Action - Subgroups","Corrective Action - Subgroups"]
["0002","00020020","Douglas",488,"K  - 06","Non-Title I School (NT)"," "," "]
["0002","00020025","Gates",490,"K  - 06","Non-Title I School (NT)"," "," "]
["0002","00020030","Luther Conant",488,"K  - 06","Non-Title I School (NT)","Improvement Year 2 - Subgroups","Improvement Year 2 - Subgroups"]
["0002","00020015","McCarthy-Towne",486,"K  - 06","Title I School (TA)","Improvement Year 1 - Subgroups"," "]
["0002","00020010","Merriam",614,"PK - 06","Title I School (TA)","Improvement Year 1 - Subgroups"," "]
["0003","00030025","Acushnet Elementary Sch",524,"PK - 04","Title I School (TA)","Corrective Action - Subgroups","Improvement Year 2 - Subgroups"]
["0003","00030305","Albert F Ford Middle Sch",483,"05 - 08","Non-Title I School (NT)","Improvement Year 2 - Subgroups","Improvement Year 2 - Aggregate"]
["0005","00050003","Agawam ECC",124,"PK","Non-Title I School (NT)"]
["0005","00050505","Agawam High",1337,"09 - 12","Non-Title I School (NT)"," "," "]
["0005","00050405","Agawam Junior High",695,"07 - 08","Non-Title I School (NT)","Restructuring Year 2+ - Subgroups","Restructuring Year 2+ - Subgroups"]
["0005","00050020","Benjamin J Phelps",366,"K  - 04","Non-Title I School (NT)","Improvement Year 2 - Subgroups","Improvement Year 2 - Subgroups"]
["0005","00050010","Clifford M Granger",307,"K  - 04","Title I School (TA)"," "," "]
["0005","00050030","James Clark School",373,"K  - 04","Title I School (TA)"," ","Improvement Year 2 - Subgroups"]
["0005","00050303","Roberta G. Doering School",649,"05 - 08","Non-Title I School (NT)","Restructuring Year 1 - Subgroups","Restructuring Year 2+ - Subgroups"]
{"$rows_left_out":1795}
{"sheet":"Amendment","index":5,"n_rows":65,"n_cols":8,"rows_kept":65,"cut":false,"hidden":true,"merged":[[27,2,27,7],[28,2,28,7],[52,2,52,4],[51,2,51,4],[19,5,19,7],[37,2,37,3],[26,2,26,7],[25,1,25,7],[59,6,59,7],[57,6,57,7],[63,5,63,7],[59,4,59,5],[58,4,58,5],[57,4,57,5],[63,2,63,4],[62,2,62,4],[61,2,61,4],[62,5,62,7],[58,6,58,7],[64,5,64,7],[61,5,61,7],[29,1,29,2],[30,1,30,2],[60,2,60,4],[56,1,56,7],[54,2,54,4],[52,5,52,7],[53,5,53,7],[60,5,60,7],[54,5,54,7],[51,5,51,7],[53,2,53,4],[29,4,29,5],[30,4,30,5],[31,1,31,3],[1,1,1,7],[2,1,2,7],[3,1,3,7],[13,1,14,1],[16,1,17,1],[13,2,13,3],[16,2,16,3],[13,4,13,5],[4,1,4,7],[6,1,6,7],[9,2,9,7],[10,2,10,7],[7,2,7,7],[8,2,8,7],[15,4,15,7],[17,2,17,3],[12,2,12,3],[14,2,14,3],[11,1,12,1],[15,2,15,3],[11,2,11,3],[16,4,17,7],[18,2,18,3],[24,1,24,7],[20,5,20,7],[18,1,20,1],[20,2,20,3],[23,1,23,7],[22,1,22,5],[19,2,19,3],[18,5,18,7]]}
[]
[null,"Massachusetts Department of Elementary and Secondary Education"]
[null,"STANDARD APPLICATION FOR PROGRAM GRANTS"]
[null,"FORM AM 1"]
[null,"(AMENDMENT REQUEST FORM)"]
[]
[null,"PART 1:"]
[null,"A.","Fill in the highlighted sections of Parts I and II only (Part III will be calculated automatically) and submit the request at least 30 days prior to the proposed change and no later than 30 days prior to the termination date of the project."]
[null,"B. ","Email the entire workbook to: srg@doe.mass.edu"]
[null,"C.","Also, mail two copies of this signed Amendment form to: \nAmanda Trainor, Office of Effective Practices\nMassachusetts Department of Elementary and Secondary Education\n75 Pleasant Street   Malden, MA  02148-4906 "]
[null,"D.","Amendment requests must be approved in writing by an authorized representative of the Department of Elementary and Secondary Education prior to implementation."]
[null,"E.","Grant Recipient:",null,{"$f":"VLOOKUP('Cover Sheet'!$H$4,suptlist,5,FALSE)","v":"ORGANIZATION NAME"}]
[null,null,"(Legal Name of Agency",null,{"$f":"LEFT(VLOOKUP('Cover Sheet'!$H$4,suptlist,6,FALSE),4)","v":"ORGA"}]
[null,"F.","Address:",null,{"$f":"VLOOKUP('Cover Sheet'!$H$4,suptlist,7,FALSE)","v":"ADDRESS LINE 1"},{"$f":"VLOOKUP('Cover Sheet'!$H$4,'supt list 040604'!B16:L407,5,FALSE)","v":{"$error":"#N/A"}}]
[null,null,"(Street, City/Town/Zip Code)",null,{"$f":"VLOOKUP('Cover Sheet'!$H$4,suptlist,9,FALSE)","v":"CITY/TOWN"},{"$f":"VLOOKUP('Cover Sheet'!$H$4,suptlist,11,FALSE)","v":"ZIP CODE"}]
[null,"G.","Project Number:"]
[null,"H.","Name of grant program/",null,"Level 3 Turnaround Grant Fund Code 539"]
[null,null,"Source of funds"]
[null,"I.","Name of person ",null,"Name:"]
[null,null,"Completing this report:",null,"Title:"]
{"$rows_left_out":46}
{"sheet":"Indirect Costs","index":6,"n_rows":30,"n_cols":4,"rows_kept":30,"cut":false,"hidden":false,"merged":[[0,1,0,3],[29,1,29,3],[25,1,25,3],[26,1,26,3],[27,1,27,3],[28,1,28,3],[3,1,3,3],[4,1,4,3],[5,1,5,3],[24,1,24,3]]}
[null,"Indirect Cost Calculation Worksheet"]
[]
[]
[null,"The following worksheet will automatically calculate the amount of funds that can be used by a school district for indirect costs."]
[null,"You will need to insert your school district's approved allowable rate and total funds requested in the yellow boxes. "]
[null,"You will need to input the rate in either percentage (A) or decimal form (B).  The \"amount that can be used for indirect\" is the maximum amount that your school districts can put in for indirect costs in line item 9. This worksheet assumes no capital expenditures.  See other important notes below."]
[null,"Indirect Cost Calculation (A)",null,"Input Your"]
[null,"Note: if percentage format used",null,"Grant Information"]
[null,null,"Example","Below"]
[null,"Total Funds Requested",100000,199742]
[null,"Indirect Cost Percentage: If percentage used (2.18%)",2.18E-2,1.2E-2]
[null,"Total Funds/(1+Percentage)",{"$f":"+C10/(1+C11)","v":97866.510080250533},{"$f":"+D10/(1+D11)","v":197373.51778656125}]
[null,"Maximum Amount that can be used for Indirect:",{"$f":"+C10-C12","v":2133.4899197494669},{"$f":"+D10-D12","v":2368.4822134387505}]
[null," "]
[null," "]
[null,"Indirect Cost Calculation (B)",null,"Input Your"]
[null,"Note: if decimal format used",null,"Grant Information"]
[null,null,"Example","Below"]
[null,"Total Funds Requested",100000,199542]
[null,"Indirect Cost Percentage: If decimals used  (.0218)",2.18E-2,1.2E-2]
{"$rows_left_out":11}
{"sheet":"supt list 040604","index":7,"n_rows":395,"n_cols":11,"rows_kept":395,"cut":false,"hidden":true,"merged":[]}
[1,"FUNCTION","FIRST NAME","LAST NAME","ORGANIZATION NAME","ORGANIZATION CODE","ADDRESS LINE 1","ADDRESS LINE 2","CITY/TOWN","STATE","ZIP CODE"]
[2,"Charter School Leader","Kathleen Greenwood",null,"Abby Kelley Foster Charter","04450000","10 New Bond Street",null,"Worcester","MA","01606"]
[3,"Superintendent","Peter Schafer",null,"Abington","00010000","171 Adams St",null,"Abington","MA","02351"]
[4,"Charter School Leader","Susan Thompson",null,"Academy Of the Pacific Rim Charter","04120000","1 Westinghouse Plaza",null,"Hyde Park","MA","02136"]
[5,"Superintendent","Stephen Mills",null,"Acton","00020000","16 Charter Road",null,"Acton","MA","01720"]
[6,"Superintendent","Stephen Mills",null,"Acton-Boxborough","06000000","16 Charter Rd",null,"Acton","MA","01720"]
[7,"Superintendent","Stephen Donovan",null,"Acushnet","00030000","708 Middle Road","Suite 1","Acushnet","MA","02743"]
[8,"Superintendent","Alfred Skrocki",null,"Adams-Cheshire","06030000","125 Savoy Road",null,"Cheshire","MA","01225"]
[9,"Charter School Leader","Barbara McGann",null,"Advanced Math and Science Academy Charter","04300000","201 Forest Street",null,"Marlborough","MA","01752"]
[10,"Superintendent","Mary Czajkowski",null,"Agawam","00050000","1305 Springfield St","Suite 1","Feeding Hills","MA","01030"]
[11,"Superintendent","David Jack",null,"Amesbury","00070000","10 Congress Street",null,"Amesbury","MA","01913"]
[12,"Charter School Leader","Donna Georges",null,"Amesbury Academy Charter","04150000","9 Water Street",null,"Amesbury","MA","01913"]
[13,"Superintendent","Maria Geryk",null,"Amherst","00080000","170 Chestnut Street",null,"Amherst","MA","01002"]
[14,"Superintendent","Maria Geryk",null,"Amherst-Pelham","06050000","170 Chestnut Street",null,"Amherst","MA","01002"]
[15,"Superintendent","Marinel McGrath",null,"Andover","00090000","36 Bartlet Street",null,"Andover","MA","01810"]
[16,"Superintendent","Kathleen Bodie",null,"Arlington","00100000","869 Massachusetts Avenue",null,"Arlington","MA","02476"]
[17,"Superintendent","Michael Zapantis",null,"Ashburnham-Westminster","06100000","11 Oakmont Drive","c/o Office of the Superintendent","Ashburnham","MA","01430"]
[18,"Superintendent","Ann Marie Dargon",null,"Ashland","00140000","87 West Union Street",null,"Ashland","MA","01721"]
[19,"Superintendent","Mary Jo Nawrocki",null,"Assabet Valley Regional Vocational Technical","08010000","215 Fitchburg Street",null,"Marlborough","MA","01752"]
[20,"Superintendent","Anthony Polito",null,"Athol-Royalston","06150000","P.O.Box 968","1062 Pleasant Street","Athol","MA","01331"]
{"$rows_left_out":376}
{"sheet":"FY19 Budget Projection","index":8,"n_rows":17,"n_cols":8,"rows_kept":17,"cut":false,"hidden":true,"merged":[[3,3,3,6],[3,7,4,10],[5,1,5,2],[5,7,5,10],[6,1,6,2],[6,7,6,10],[7,1,7,2],[7,7,7,10],[8,1,8,2],[8,7,8,10],[9,1,9,2],[9,7,9,10],[14,1,14,2],[14,7,14,10],[16,0,16,2],[10,1,10,2],[10,7,10,10],[11,1,11,2],[11,7,11,10],[12,1,12,2],[12,7,12,10]]}
["SUMMARY OF GRANT REQUEST ACROSS TWO YEARS"]
["Manually enter estimated amounts for FY20"]
[]
[null,null,null,"Amount",null,null,null,"Notes on Budget Projections"]
[null,null,null,null,"FY19","FY19","Total"]
[1,"Administrators",null,null,{"$f":"'Budget Pages'!N18","v":0},null,{"$f":"E6+F6","v":0}]
[2,"Instructional/Professional Staff",null,null,{"$f":"'Budget Pages'!N27","v":0},null,{"$f":"SUM(E7:F7)","v":0}]
[3,"Support Staff",null,null,{"$f":"'Budget Pages'!N36","v":0},null,0]
[4,"Stipends",null,null,{"$f":"'Budget Pages'!N44","v":0},null,0]
[5,"Fringe Benefits",null,null,{"$f":"'Budget Pages'!N51","v":0},null,0]
[6,"Contractual Services",null,null,{"$f":"'Budget Pages'!N63","v":0},null,0]
[7,"Supplies and Materials",null,null,{"$f":"'Budget Pages'!N73","v":0},null,0]
[8,"Travel",null,null,{"$f":"'Budget Pages'!N80","v":0},null,0]
[9,"Other Costs",null,null,{"$f":"'Budget Pages'!N92","v":0},null,0]
[10,"Indirect Costs",null,null,{"$f":"'Budget Pages'!N93","v":0},null,0]
[11,"Equipment",null,null,{"$f":"'Budget Pages'!N98","v":0},null,0]
["TOTAL FUNDS REQUESTED FOR LEA",null,null,null,{"$f":"'Budget Pages'!N99","v":0},{"$f":"SUM(F6:F16)","v":0},{"$f":"SUM(E17:F17)","v":0}]