{"text_format":"1","workbook":"xlsx","n_sheets":24,"sheets":["READ ME 1ST","1. Signature Page","2. Contact Information ","3. Allocations and Flexing","4. Private School Services","5. Districtwide Strategies","data","ForImport","6. Title I, A & D Narrative","7. Title I, A Reservations","8. Title I, A School Funding","9. Title I, Part A Budget ","10. Title II, Part A Narrative","11. Title II, Part A Budget","12. Title III, Part A Narrative","13. Title III, Part A Budget","14. Title IV, Part A Narrative","15. Title IV, Part A Budget","16. Schedule A","Dropdowns","DataLookupValues","LiaisonList","dataDistrictList","dataSchoolInfo"],"not_rendered":{"charts":0,"images":9,"macros":1,"external_links":3,"defined_names":211,"comments":0,"pivot_tables":0},"unopened":[],"bounds":{"document_bytes":16777216,"sheet_cells":100000,"rows_first":2000,"rows_last":500,"rows_between":2000,"halvings":0,"cell_chars":16384,"cell_head_chars":4096},"cells_cut":0,"cells_raw":0,"read":"whole","date_system":"1900"}

{"sheet":"READ ME 1ST","index":0,"n_rows":31,"n_cols":2,"rows_kept":31,"cut":false,"hidden":false,"merged":[[14,1,14,12],[15,1,15,12],[3,1,3,12],[1,1,1,11],[2,1,2,11],[4,1,4,11],[5,1,13,12],[57,2,57,4],[40,1,40,4],[41,2,41,4],[43,2,43,4],[51,1,51,4],[47,2,47,4],[55,2,55,4],[56,2,56,4],[54,2,54,4],[17,1,24,12],[16,1,16,12],[52,2,52,4],[53,2,53,4],[27,1,27,12],[28,1,28,12],[30,1,30,12],[29,1,29,12],[31,1,31,11],[32,1,32,11],[26,1,26,12],[39,1,39,4],[35,2,35,4],[36,2,36,4],[37,2,37,4],[25,1,25,12]]}
[]
[null,"Massachusetts Department of Elementary & Secondary Education"]
[null,"FY20 Consolidated Federal ESEA Programs Application Workbook"]
[null,"Overview  "]
[null,"This Excel workbook contains the FY18 Title I grant application forms that a school district must submit to the Massachusetts Department of Elementary and Secondary Education. Information about the FY18 Title I grant can be found at http://www.doe.mass.edu/grants/."]
[null,"\n  The consolidated application allows LEAs (districts and other eligible entities, referred to in this application collectively as \n  districts) to apply for funding for any combination of the following federal programs of the Elementary and Secondary \n  Education Act (ESEA), as most recently reauthorized by the Every Student Succeeds Act (2015) (ESSA):\n\n                                                                             • Title I, Parts A & D (Fund Code 305)\n                                                                             • Title II, Part A  (Fund Code 140)\n                                                                             • Title III, Part A (Fund Code 180 only)\n                                                                             • Title IV, Part A (Fund Code 309)                                     \n\nYou may notice that some requirements of past applications have been omitted or are requested in a different way, which is permitted by ESSA to reduce burden to districts when applying for grants.  However, all districts are still required to meet all statutory requirements for any program for which they receive funds.  If you have questions about these requirements, please refer to our Federal Grant Programs web pages and/or contact the Federal Programs Specialist assigned to your district for guidance.\n\n"]
[]
[]
[]
[]
[]
[]
[]
[]
[null,"First Step:  Saving the File"]
[null,"Save this file to your computer (Important: ensure macros are enabled).  Rename the file by replacing the words 'leacode' in the file name with your 4-digit district code. For example, Abington (0001) would rename the file as 'FY20CA-0001.xlsm'. Do not change the filename except for your district's 4-digit code. Users of Macintosh computers must save as a macro-enabled file (with an .xlsm extension) for the workbook to function properly."]
[null,"Tips for Completing the Consolidated Application"]
[null,"  \n Workflow and printing:  \n    • Complete each tab that applies to your district in the order that they are numbered unless instructed otherwise.  If one of the \n      numbered tabs does not apply to  your district, skip to the next set of numbered tabs (for example, skip Tab 12. \"Title III, Part A\n      Narrative\" and Tab. 13. \"Title III, Part A Budget\" if your district does not receive an allocation for Title III and go on to Tab 14).  Pay\n      particular attention to completing Tab 5 (Districtwide Strategies) prior to working on any Title narrative tabs.  Those tabs will \n      automatically import information from Tab 5 to help you complete the narrative questions.\n\n    • Complete the steps on each tab in the order that they are numbered (for example, on Tab 7, begin with Step 7.1, then complete 7.2).\n      Note that some steps may not be required for your district and may be skipped.\n\n   •  Budget worksheets appearing after the tabs for each Title narrative must be completed for each grant.  They mirror the budget entry \n      page in EdGrants with the addition of checkboxes to indicate whether funds are used for private school services and for \n      Title II, Part A and Title IV, Part A, to indicate whether funds were flexed.  These budget worksheets are mandatory, in addition to \n      entering budget information in EdGrants. \n\n   •  This workbook is structured to be used in electronic format.  However, you can print a copy using Excel's print preview functions \n       to set the appearance and paper orientation to best fit your completed application.  \n   \n  Color-coding and cell features:\n   •  Those cells that appear light yellow require districts to input information.  Text may be pasted into these cells as long as\n       the source of the information has no excel formulas.  \n\n   •  Those cells that appear light gray will automatically populate based on information your district supplies on the application or from\n       preloaded data already reported to the Department of Elementary and Secondary Education (DESE) (for example, SIMS data).   \n       Do not cut and paste information from other pages or sources into gray cells!  \n\n   •  Those cells that appear in light orange offer a dropdown menu from which districts can choose a supplied response or \n       \"other,\" which requires districts to supply a brief description where indicated.   Do not cut and paste information from other pages \n       or sources into orange cells!  \n\n   •  Throughout the tabs of this application you will find instruction boxes (gray), tip boxes (pink) to help avoid common mistakes, \n       and resource boxes (tan) that include links to materials outside the application with more detailed, grant-related information.\n"]
[]
[]
[]
[]
[]
[]
[]
[null,"\n   •  If boxes/cells containing text in some parts of the application appear to be cut off, please enlarge the \"view\" of that page using your \n      Zoom feature (usually a slide bar appearing in the lower corner of your Excel screen), which should solve the problem.  100% is best \n      in most cases.\n\n Last Steps:\n   •  Signature Page (Tab 1) :  Once the application has been completed, print, sign, date (using date of submission), scan and upload \n      a signed copy of the signature page with each of the district's EdGrants submissions (once for each fund code).   We cannot approve\n      any grant without an uploaded, signed, and properly dated signature page!\n\n   •  NEW! Federal Grant Assurances Signature Page : Each district must review the FY20 Federal Grant Assurances and submit a signed, \n      scanned (pdf) signature page indicating such review and assurance of compliance with the requirements contained therein. Once the\n      application has been completed,print, sign, date (using date of submission), scan and upload as an attachment to to its Title I Edgrants\n      submission (Fund Code 305). If your district does not receive a Title I grant, contact your district's DESE grant liaison for submission\n      instructions.  We cannot  approve  any federal entitlement grant without an uploaded, signed, and properly dated signature page from\n      the federal grant assurance document!\n\n   •  All tabs related to programs for which a district has received an allocation must be complete and budgets submitted in \n      EdGrants for each of those fund codes in order for an application to be substantially approvable and ready for review.  No partial \n      submissions will be accepted.\n \n   •  A completed consolidated workbook should be submitted only once, as an attachment in EdGrants with each district's Title I\n      submission. It does not need to be submitted with any other ESSA entitlement grant EdGrants submission.  If your district does not \n      receive a Title I allocation, please contact your district liaison for submission instructions."]
[null,"Submit the FY20 Consolidated Application Workbook as an Excel workbook with Title I via\nEdGrants Front Office web page"]
[null,"\nEdGrants Submission Information:\nMost districts/applicants already have designated control users in EdGrants: Front Office, who have access to submit grant applications as well as to make payment requests.  Each district/applicant needs to ensure that it has an authorized control user prior to grant submission.  If a district waits until its grant submission is ready to submit before inquiring about a new user name/login, grant submissions may be delayed several business days waiting for control user set-up.  Please review the EdGrants Security Controls documents and/or contact DESE's Grants Management Office, 781-338-6595 or EdGrants@doe.mass.edu, regarding assigning your EdGrants: Front Office control users.  "]
[null,"The district/applicant control users will register each grant opportunity, create each grant project and enter contact information, budget, and required attachments in EdGrants. All districts' business offices have been contacted with information regarding training.  If you are unsure of who in your office is \na control user, please contact your business office.  The Consolidation Application Workbook must be uploaded with your Title I budget in EdGrants.  If you do not receive a Title I allocation, please contact the DESE liaison for your district for submission instructions."]
[null,"Applications are due by September 13, 2019"]
[null,"NOTE ON SUBMISSION TIMELINE: \n    • Districts that submit near the due date should expect to wait a few weeks for review. Districts that submit early may see a shorter turnaround.   \n    • The start date for each grant is the date on which the district submits substantially approvable information and budget for that grant.  For example, \n       if the completed consolidated ESSA application is submitted on August 15 and all grant information but that for Title III, Part A is substantially \n       approvable, the start date for all grants but Title III, Part A will be August 15.  The start date for Title III, Part A will be the date on which any \n       deficiency for that grant has been cured and it becomes substantially approvable.  However, no grant funds for any ESSA grant will be issued \n       until all of the grants contained within this consolidated ESSA application have been approved.  \n    •  Districts that fail to file by September 13, 2019 will receive last priority for review.    \n    •  Expenses incurred prior to approval of a district's consolidated application and start date(s) are not payable with grant funds!\n    •  Responding quickly to requests for information can result in an earlier approval of your grant application.  \n    •  Grant payment notices will be available in EdGrants after the grant application has been approved and the initial payment is processed.\n"]

{"sheet":"1. Signature Page","index":1,"n_rows":41,"n_cols":18,"rows_kept":41,"cut":false,"hidden":false,"merged":[[40,2,40,20],[32,17,32,20],[29,17,29,20],[30,17,31,20],[1,2,1,9],[1,18,1,20],[2,2,3,20],[5,2,5,20],[6,2,6,20],[12,6,12,12],[11,6,11,12],[22,6,22,11],[22,13,22,14],[22,15,22,19],[18,2,19,20],[21,2,21,5],[21,6,21,11],[21,13,21,14],[21,15,21,19],[22,2,22,5],[26,2,28,4],[26,5,26,9],[26,10,26,16],[26,17,26,20],[27,5,28,9],[27,10,27,13],[27,14,27,16],[27,17,28,20],[28,10,28,13],[28,14,28,16],[29,2,31,4],[29,5,29,9],[29,10,29,16],[32,2,34,4],[33,14,33,16],[31,10,31,13],[31,14,31,16],[32,5,32,9],[32,10,32,16],[30,5,31,9],[30,10,30,13],[30,14,30,16],[33,17,34,20],[34,10,34,13],[34,14,34,16],[36,2,38,4],[36,5,36,9],[36,10,36,16],[36,17,36,20],[37,5,38,9],[37,10,37,13],[37,17,38,20],[38,10,38,13],[38,14,38,16],[37,14,37,16],[33,5,34,9],[33,10,33,13]]}
[]
[]
[null,null,"Massachusetts Department of Elementary and Secondary Education\nSTANDARD CONTRACT FORM AND APPLICATION FOR PROGRAM GRANTS"]
[]
[]
[null,null,"UPLOAD A SCANNED, SIGNED COPY OF THIS PAGE WITH THE DATE OF SUBMISSION TO EDGRANTS WITH THE BUDGET FOR EACH FUND CODE"]
[null,null,"District staff with the role of “control user” in EdGrants have been provided user log-in names and passwords and have been trained to submit a grant application via EdGrants. Provide all required application materials to your district control user with access to EdGrants to submit budgets and attachments  for each fund code for which the district is applying.                                                              \n                 Applications are due by September 13, 2019"]
[]
[]
[null,null,null,null,"District Name:",null,null,null,null,null,null,null,null,"Code:",null,{"$f":"valorg4code","v":"DIST"}]
[]
[null,null,null,null,"Address: ",null,{"$f":"IF(valAddr2=\"\", valAddr1, valAddr1&\", \"&valAddr2)","v":"ADDR 1, ADDR 2"},null,null,null,null,null,null,"DESE Federal Grant Liaison",null,{"$f":"valname","v":"Liaison's Name"}]
[null,null,null,null,null,null,{"$f":"valCtyStZip","v":"City, State Zip"},null,null,null,null,null,null,"Phone number:",null,{"$f":"valphonenum","v":"Liaison's Number"}]
[null,null,null,null,null,null,null,null,null,null,null,null,null,"Email:",null,{"$f":"valemail","v":"Liaison's Email"}]
[]
[]
[null,null,null,null,null,null,null,null,null,null,null,null,null,"`"]
[]
[null,null,"I CERTIFY THAT THE INFORMATION CONTAINED IN THIS APPLICATION IS CORRECT AND COMPLETE; THAT THE APPLICANT AGENCY HAS AUTHORIZED ME, AS ITS REPRESENTATIVE, TO FILE THIS APPLICATION; AND THAT I UNDERSTAND THAT FOR ANY FUNDS RECEIVED THROUGH THIS APPLICATION THE AGENCY AGREES TO COMPLY WITH ALL APPLICABLE STATE AND FEDERAL GRANT REQUIREMENTS COVERING BOTH THE PROGRAMMATIC AND FISCAL ADMINISTRATION OF GRANT FUNDS."]
[]
[]
[null,null,"AUTHORIZED SIGNATURE:",null,null,null,null,null,null,null,null,null,null,"TITLE:"]
[null,null,"PRINTED NAME:",null,null,null,null,null,null,null,null,null,null,"SUBMISSION DATE:"]
[]
[]
[]
[null,null,"FY2020 \nAllocation",null,null,"FEDERAL GRANT",null,null,null,null,"PROJECT DURATION",null,null,null,null,null,null,"TOTAL ALLOCATION"]
[null,null,null,null,null,"Title I, Part A\nFund Code 305",null,null,null,null,"FROM",null,null,null,"TO"]
[null,null,null,null,null,null,null,null,null,null,"UPON APPROVAL",null,null,null,"6/30/2020"]
[null,null,"FY2020 \nAllocation",null,null,"FEDERAL GRANT",null,null,null,null,"PROJECT DURATION"]
[null,null,null,null,null,"Title II, Part A\nFund Code 140",null,null,null,null,"FROM",null,null,null,"TO"]
[null,null,null,null,null,null,null,null,null,null,"UPON APPROVAL",null,null,null,"6/30/2020"]
[null,null,"FY2020 \nAllocation",null,null,"FEDERALGRANT",null,null,null,null,"PROJECT DURATION"]
[null,null,null,null,null,"Title III, Part A\nFund Code 180",null,null,null,null,"FROM",null,null,null,"TO"]
[null,null,null,null,null,null,null,null,null,null,"UPON APPROVAL",null,null,null,"6/30/2020"]
[]
[null,null,"FY2020 \nAllocation",null,null,"FEDERAL GRANT",null,null,null,null,"PROJECT DURATION"]
[null,null,null,null,null,"Title IV, Part A\nFund Code 309",null,null,null,null,"FROM",null,null,null,"TO"]
[null,null,null,null,null,null,null,null,null,null,"UPON APPROVAL",null,null,null,"6/30/2020"]
[]
[null,null,"UPLOAD A SCANNED, SIGNED COPY OF THIS PAGE WITH THE DATE OF SUBMISSION TO EDGRANTS WITH THE BUDGET FOR EACH FUND CODE\nBY SEPTEMBER 13, 2019"]

{"sheet":"2. Contact Information ","index":2,"n_rows":33,"n_cols":5,"rows_kept":33,"cut":false,"hidden":false,"merged":[[15,1,15,3],[17,1,17,3],[18,1,18,2],[16,1,16,11],[21,4,21,11],[27,4,27,11],[28,1,28,11],[27,1,27,3],[21,1,21,3],[23,1,23,3],[24,1,24,2],[24,3,24,11],[25,2,25,11],[26,2,26,11],[32,2,32,11],[29,1,29,3],[30,1,30,2],[30,3,30,11],[31,2,31,11],[29,4,29,11],[1,1,1,3],[17,4,17,11],[23,4,23,11],[10,1,10,11],[22,1,22,11],[18,3,18,11],[19,2,19,11],[20,2,20,11],[12,1,12,2],[12,3,12,11],[13,2,13,11],[14,2,14,11],[11,4,11,11],[11,1,11,3],[9,4,9,11],[15,4,15,11],[3,13,5,17],[4,1,4,11],[3,1,3,11],[6,1,6,2],[9,1,9,3],[6,3,6,11],[7,2,7,11],[8,2,8,11],[5,1,5,3],[5,4,5,11]]}
[]
[null,{"$f":"valDistrName & \" (\"&valorg4code&\")\"","v":"OrgName (DIST)"}]
[]
[null,"District Contact Information by Program\nPlease provide information for primary district contact for each program's application"]
[null,"Title I, Part A, Improving Basic Programs & Part D, Programs for Neglected, Delinquent and At-Risk Students"]
[null,"Name of Primary Contact:"]
[null,"Title:"]
[null,"Phone:"]
[null,"Email:"]
[null,"New to this program?  (Y/N)",null,null,"Select One"]
[null,"Title II, Part A, Supporting Effective Instruction"]
[null,"Name of Primary Contact:"]
[null,"Title:"]
[null,"Phone:"]
[null,"Email:"]
[null,"New to this program?  (Y/N)",null,null,"Select One"]
[null,"Title III, Part A, Support for English Learners and Immigrant  Students"]
[null,"Name of Primary Contact:"]
[null,"Title:"]
[null,"Phone:"]
[null,"Email:"]
[null,"New to this program?  (Y/N)",null,null,"Select One"]
[null,"Title IV, Part A, Student Support and Academic Enrichment"]
[null,"Name of Primary Contact:"]
[null,"Title:"]
[null,"Phone:"]
[null,"Email:"]
[null,"New to this program?  (Y/N)",null,null,"Select One"]
[null,"EdGrants Control User (person responsible for uploading to EdGrants, if different person from above roles)"]
[null,"Name of Primary Contact:"]
[null,"Title:"]
[null,"Phone:"]
[null,"Email:"]

{"sheet":"3. Allocations and Flexing","index":3,"n_rows":33,"n_cols":9,"rows_kept":33,"cut":false,"hidden":false,"merged":[[1,1,1,2],[32,1,32,2],[16,1,16,2],[21,1,21,2],[22,1,22,2],[23,1,23,2],[18,1,18,2],[20,1,20,2],[17,1,17,2],[27,1,27,2],[31,1,31,2],[24,1,24,2],[28,1,28,2],[30,1,30,2],[29,1,29,2],[3,1,3,12],[6,8,22,12],[12,6,17,6],[26,1,26,2],[6,6,10,6],[12,1,12,2],[6,1,6,2],[7,1,7,2],[8,1,8,2],[9,1,9,2],[10,1,10,2],[13,1,13,2],[14,1,14,2],[15,1,15,2]]}
[]
[null,{"$f":"valDistrName & \" (\"&valorg4code&\")\"","v":"OrgName (DIST)"}]
[]
[null,"Program Allocations and Flexing"]
[null,null,null,null,null,null,null,null," \n\n"]
[]
[null,"Title I, Part A, Improving Basic Programs (Fund Code 305)",null,null,null,null,"TIP:  Report  all expenses for sums in blue, by line item, in EdGrants budget for original program, even if some or all funds are used for allowable expenses in a different program after flexing.",null,"Instructions:  Indicate for Title II, Part A and Title IV, Part A whether you would like to flex funds from these programs to another Title program by placing an amount to be flexed in the yellow boxes.  Note that flexing is not required.  Also, flexing from either Title I, Part A and Title III, Part A into another program is not allowed.\n\nAfter all flexing is completed, the amount in the green boxes will be the total used for allowable expenses under each Title program and will also be the total used for calculating private school services for each Title program.  \n\nThe original allocation for each Title program (top gray box) is the amount that must be reported in the original program's budget (and in EdGrants), regardless of whether funds are flexed. \n\nFor example, if a district flexed funds from Title IV, Part A to Title III, Part A and those funds were used to buy leveled readers for EL classrooms, funds for those readers would be budgeted and described in Title IV, Part A despite that the allowable use is governed by Title III, Part A.  See federal flexing guidance (transferability) for details."]
[null,"Total original Title I, Part A allocation",null,{"$f":"valAllocationT1","v":0}]
[null,"Funds flexed from Title II, Part A",null,{"$f":"D15","v":0}]
[null,"Funds flexed from Title IV, Part A",null,{"$f":"D29","v":0}]
[null,"Post-flexing funds for use per Title I, Part A:",null,{"$f":"SUM(D8:D10)","v":0}]
[]
[null,"Title II, Part A, Supporting Effective Instruction (Fund Code 140)",null,null,null,null,"TIP: Use sums in green boxes for activities and programs under this Title, including any spending caps or requirements (e.g., for administrative expenses) and for calculating private school services.  In this workbook, this sum will automatically populate tabs where it should be used."]
[null,"Total original Title II, Part A allocation",null,{"$f":"valAllocationT2","v":0}]
[null,"Title II, Part A funds flexed into Title I, Part A"]
[null,"Title II, Part A funds flexed into Title III, Part A"]
[null,"Title II, Part A funds flexed into Title IV, Part A"]
[null,"Funds flexed fromTitles IV, Part A",null,{"$f":"D30","v":0}]
[null,"Post-flexing funds for use per Title II, Part A:",null,{"$f":"D14-(SUM(D15:D17))+D18","v":0}]
[]
[null,"Title III, Part A, Support for English Learners (Fund Code 180)"]
[null,"Total original Title III, Part A allocation",null,{"$f":"valAllocationT3","v":0}]
[null,"Funds flexed from Title II, Part A",null,{"$f":"D16","v":0}]
[null,"Funds flexed from Title IV, Part A",null,{"$f":"D31","v":0}]
[null,"Post-flexing funds for use per Title III, Part A:",null,{"$f":"SUM(D22:D24)","v":0}]
[]
[null,"Title IV, Part A, Student Support and Academic Enrichment (Fund Code 309)"]
[null,"Total original Title IV, Part A allocation",null,{"$f":"valAllocationT4","v":0}]
[null,"Title IV, Part A funds flexed into Title I, Part A"]
[null,"Title IV, Part A funds flexed into Title II, Part A"]
[null,"Title IVA funds flexed into Title III, Part A"]
[null,"Funds flexed from Titles II, Part A",null,{"$f":"D17","v":0}]
[null,"Post-flexing funds for use per Title IV, Part A:",null,{"$f":"(D28-(SUM(D29:D31))+D32)","v":0}]

{"sheet":"4. Private School Services","index":4,"n_rows":284,"n_cols":24,"rows_kept":284,"cut":false,"hidden":false,"merged":[[24,2,24,4],[1,1,1,5],[3,2,3,11],[5,2,5,11],[7,7,7,11],[8,7,8,11],[9,7,9,11],[10,7,10,11],[11,7,11,11],[14,2,14,4],[19,2,19,7],[20,2,20,7],[21,2,21,7],[8,1,10,1],[26,2,26,7],[28,2,28,7],[29,11,138,15],[30,2,30,9],[140,1,142,1],[140,2,140,10],[141,2,141,7],[142,2,142,3],[142,4,142,11],[143,2,143,11],[144,2,144,3],[144,4,144,11],[145,2,145,11],[146,2,146,3],[146,4,146,11],[150,1,151,1],[150,2,150,10],[152,2,152,16],[259,1,261,1],[259,2,259,9],[261,2,261,10],[152,18,257,23],[274,2,274,3],[263,2,263,3],[263,4,263,11],[264,2,264,10],[266,2,266,3],[266,4,266,11],[268,2,268,11],[269,2,269,3],[269,4,269,11],[270,2,270,11],[272,2,272,3],[272,4,272,11],[282,2,282,8],[283,2,283,3],[283,4,283,11],[275,2,275,3],[275,4,275,11],[278,2,278,11],[280,2,280,3],[280,4,280,11],[281,2,281,11]]}
[]
[null,{"$f":"valDistrName & \" (\"&valorg4code&\")\"","v":"OrgName (DIST)"}]
[]
[null,null,"Non-Profit Private School Participation Worksheets"]
[]
[null,null,"ESSA requires the equitable participation of students and educators in private, non-profit schools for federally funded programs and services. The public school district is required to have \"timely and meaningful consultation\" with private school officials regarding the participation of private school students and educators in ESSA-funded programs and services. The public school district is responsible for providing equitable services and must retain control of the federal funds used to provide such services. Therefore, equitable services are provided by either an employee of the district or through a contract by the district with an individual, association, agency, or organization. Reimbursement to participating private schools is not allowable.  "]
[]
[null,null,null,null,null,null,null,"Resources:"]
[null,"Step 4.1\nSchedule A Enrollment Data\nSchedule A Lead Districts Only",null,"Title II, Part A","Title III,\n Part A","Title IV, Part A",null,"Federal Guidance:  Title I, Part A: Providing Equitable Serices to Eligible Private School Children, Teachers and Families -- Updated Non-Regulatory Guidance (2019)"]
[null,null,"Are you lead agent for a Schedule A Consortium?","Select One","Select One","Select One",null,"Private School Equitable Services under ESSA"]
[null,null,"Total Consortium Enrollment (Use March 2019 data)",null,null,null,null,"Consolidated Affirmation of Consultation"]
[null,null,"Total Consortium EL Enrollment\n(Use March 2019 data)",null,null,null,null,"DESE's ombudsman for equitable services for private schools is Russ Fleming, who can be reached at ESEAequitableservices@doe.mass.edu or 781-338-6259."]
[]
[]
[null,"Step 4.2\nDirect Administrative Expenses\nTitle II, III, IV Districts","Fill in the amount that the district will reserve for administrative expenses for Titles II, Part A, III, Part A and/or Title IV, Part A.  The remainder of the grid will populate automatically once you have completed all steps of this worksheet."]
[]
[null,null,"District enrollment, March 2019",{"$f":"IFERROR(valDisEnr,\"\")","v":"March 2019 ENROLLED_sum"}]
[null,null,"District EL population, March 2019",{"$f":"IFERROR(valDisELenr,\"\")","v":"March 2019 nElCOUNT_sum"}]
[null,null,null,null,null,null,null,null,"Title I, Part A","Title II, Part A","Title III, Part A","Title IV, Part A"]
[null,null,"Provide total funding being used for district's direct administrative expenses ",null,null,null,null,null,"N/A"]
[null,null,"Total district funds per program after any flexing between programs and minus the amount reserved for program administration for Titles IIA III & IVA.",null,null,null,null,null,{"$f":"valAllocationFlexT1","v":0},{"$f":"'3. Allocations and Flexing'!D19-'4. Private School Services'!J20","v":0},{"$f":"'3. Allocations and Flexing'!D25-'4. Private School Services'!K20","v":0},{"$f":"'3. Allocations and Flexing'!D33-'4. Private School Services'!L20","v":0}]
[null,null,"Total amount that must be reserved for equitable services.  See below for allocations for each private school.",null,null,null,null,null,{"$f":"IFERROR((valAllocationFlexT1)/($G$137+'8. Title I, A School Funding'!$M$164)*$G$137, 0)","v":0},{"$f":"O256","v":0},{"$f":"P256","v":0},{"$f":"Q256","v":0}]
[]
[]
[null,"Step 4.3\nList Private Schools\nAll  Title I Districts","List all private schools with enrolled students who reside in a Title I-served school attendance area in your district"]
[]
[null,null,"Title I, Part A:  Improving Basic Services"]
[]
[null,null,"Do any district resident students attending private schools live in Title I school attendance areas?\nIf the answer is \"no,\" go on to Step 4.5",null,null,null,null,null,"Select One"]
[null,null,null,null,null,null,null,null,null,null,null,"Instructions: First, respond to the question at beginning of Step 4.2 to indicate whether any eligible private school students reside in the district.\n\nList the private schools that have students who are eligible to participate in the district’s Title I program. Eligible students are children who reside in your district and would have attended a Title I-served school had they attended a district public school. The listing represents the private schools that have been contacted regarding interest in participation in the district’s Title I program. Indicate whether each listed school will participate or not by selecting from the drop-down menu. \n\nNote:  If you able to determine the number of students attending a private school who reside in a Title I area who are low-income, you should be including that information in this chart, whether or not the private school elects to participate.  Those students will be included in creating the aggregate reservation for equitable services. See federal guidance, B-14.\n\nColumn A: Identify the span of grades offered at the listed school.\n\nColumn B: Indicate the number of children attending the school who reside in your district and who would have attended a Title I-served school had they attended the district public schools.\n\nColumn C: Indicate the number of eligible children (from column B) who are considered to be low-income. In most instances, the low-income count will be obtained with the assistance of private school officials. For eligible private schools that have declined to participate, it is likely that a low-income count will not be known and the column can be left blank.\n\nColumn D: Indicate the number of children (from column B) who will participate in the Title I program. Most likely, this number will be an estimate at the time of application for funding.\n\nColumns E & F:  A per-pupil amount for equitable services will automatically calculate in column E based on the information in this chart and the information provided in Tab 8, with a total per school appearing in column F.   Because the figures are reported in whole dollars, you might notice some discrepancies between per-pupil amounts and total allocated per school due to rounding issues -- rely on the total allocation by school for funding private school services.\n\nResponses to questions 1-4 are required for only those districts that have eligible private schools that have chosen to participate in the Title I program."]
[null,null,"Title I, Part A:  Private Schools Serving Eligible Children Residing in District"]
[null,null,"\n\nList private schools located within or outside district boundaries that have enrolled students who reside in a Title I-served school attendance area\n\n   ","Will this Private School Participate in Title I?\n(Yes or No)","Grades Served","Number of children who reside in Title I-served attendance area","Number of children (from column B) who are low-income using methodology described below","Estimated number of children (from Column B) who will participate in the Title I Program","Amount Per Low Income Student based on Title I Allocation","Allocation Per School for Services"," ",null,null,null,null,null,null,null,null,null,null,null,null,"Number of private school students at private schools participating in Title I (''Yes\" in column D)"]
[null,null,".",null,"A","B","C ","D","E","F"]
[null,null,null,"Select One",null,null,null,null,{"$f":"IF('8. Title I, A School Funding'!$M$164=0, \"0\", IF(G34>0, (valAllocationFlexT1)/($G$137+'8. Title I, A School Funding'!$M$164),0))","v":"0"},{"$f":"IFERROR(IF(D34=\"Yes\",(valPrivateSchoolT1/$X$137)*G34, 0), 0)","v":0},null,null,null,null,null,null,null,null,null,null,null,null,null,{"$f":"IF(D34=\"Yes\", G34, 0)","v":0}]
[null,null,null,"Select One",null,null,null,null,{"$f":"IF('8. Title I, A School Funding'!$M$164=0, \"0\", IF(G35>0, (valAllocationFlexT1)/($G$137+'8. Title I, A School Funding'!$M$164),0))","v":"0"},0,null,null,null,null,null,null,null,null,null,null,null,null,null,0]
[null,null,null,"Select One",null,null,null,null,{"$f":"IF('8. Title I, A School Funding'!$M$164=0, \"0\", IF(G36>0, (valAllocationFlexT1)/($G$137+'8. Title I, A School Funding'!$M$164),0))","v":"0"},0,null,null,null,null,null,null,null,null,null,null,null,null,null,0]
[null,null,null,"Select One",null,null,null,null,{"$f":"IF('8. Title I, A School Funding'!$M$164=0, \"0\", IF(G37>0, (valAllocationFlexT1)/($G$137+'8. Title I, A School Funding'!$M$164),0))","v":"0"},0,null,null,null,null,null,null,null,null,null,null,null,null,null,0]
[null,null,null,"Select One",null,null,null,null,{"$f":"IF('8. Title I, A School Funding'!$M$164=0, \"0\", IF(G38>0, (valAllocationFlexT1)/($G$137+'8. Title I, A School Funding'!$M$164),0))","v":"0"},0,null,null,null,null,null,null,null,null,null,null,null,null,null,0]
[null,null,null,"Select One",null,null,null,null,{"$f":"IF('8. Title I, A School Funding'!$M$164=0, \"0\", IF(G39>0, (valAllocationFlexT1)/($G$137+'8. Title I, A School Funding'!$M$164),0))","v":"0"},0,null,null,null,null,null,null,null,null,null,null,null,null,null,0]
[null,null,null,"Select One",null,null,null,null,{"$f":"IF('8. Title I, A School Funding'!$M$164=0, \"0\", IF(G40>0, (valAllocationFlexT1)/($G$137+'8. Title I, A School Funding'!$M$164),0))","v":"0"},0,null,null,null,null,null,null,null,null,null,null,null,null,null,0]
[null,null,null,"Select One",null,null,null,null,{"$f":"IF('8. Title I, A School Funding'!$M$164=0, \"0\", IF(G41>0, (valAllocationFlexT1)/($G$137+'8. Title I, A School Funding'!$M$164),0))","v":"0"},0,null,null,null,null,null,null,null,null,null,null,null,null,null,0]
[null,null,null,"Select One",null,null,null,null,{"$f":"IF('8. Title I, A School Funding'!$M$164=0, \"0\", IF(G42>0, (valAllocationFlexT1)/($G$137+'8. Title I, A School Funding'!$M$164),0))","v":"0"},0,null,null,null,null,null,null,null,null,null,null,null,null,null,0]
[null,null,null,"Select One",null,null,null,null,{"$f":"IF('8. Title I, A School Funding'!$M$164=0, \"0\", IF(G43>0, (valAllocationFlexT1)/($G$137+'8. Title I, A School Funding'!$M$164),0))","v":"0"},0,null,null,null,null,null,null,null,null,null,null,null,null,null,0]
[null,null,null,"Select One",null,null,null,null,{"$f":"IF('8. Title I, A School Funding'!$M$164=0, \"0\", IF(G44>0, (valAllocationFlexT1)/($G$137+'8. Title I, A School Funding'!$M$164),0))","v":"0"},0,null,null,null,null,null,null,null,null,null,null,null,null,null,0]
[null,null,null,"Select One",null,null,null,null,{"$f":"IF('8. Title I, A School Funding'!$M$164=0, \"0\", IF(G45>0, (valAllocationFlexT1)/($G$137+'8. Title I, A School Funding'!$M$164),0))","v":"0"},0,null,null,null,null,null,null,null,null,null,null,null,null,null,0]
[null,null,null,"Select One",null,null,null,null,{"$f":"IF('8. Title I, A School Funding'!$M$164=0, \"0\", IF(G46>0, (valAllocationFlexT1)/($G$137+'8. Title I, A School Funding'!$M$164),0))","v":"0"},0,null,null,null,null,null,null,null,null,null,null,null,null,null,0]
[null,null,null,"Select One",null,null,null,null,{"$f":"IF('8. Title I, A School Funding'!$M$164=0, \"0\", IF(G47>0, (valAllocationFlexT1)/($G$137+'8. Title I, A School Funding'!$M$164),0))","v":"0"},0,null,null,null,null,null,null,null,null,null,null,null,null,null,0]
[null,null,null,"Select One",null,null,null,null,{"$f":"IF('8. Title I, A School Funding'!$M$164=0, \"0\", IF(G48>0, (valAllocationFlexT1)/($G$137+'8. Title I, A School Funding'!$M$164),0))","v":"0"},0,null,null,null,null,null,null,null,null,null,null,null,null,null,0]
[null,null,null,"Select One",null,null,null,null,{"$f":"IF('8. Title I, A School Funding'!$M$164=0, \"0\", IF(G49>0, (valAllocationFlexT1)/($G$137+'8. Title I, A School Funding'!$M$164),0))","v":"0"},0,null,null,null,null,null,null,null,null,null,null,null,null,null,0]
[null,null,null,"Select One",null,null,null,null,{"$f":"IF('8. Title I, A School Funding'!$M$164=0, \"0\", IF(G50>0, (valAllocationFlexT1)/($G$137+'8. Title I, A School Funding'!$M$164),0))","v":"0"},0,null,null,null,null,null,null,null,null,null,null,null,null,null,0]
[null,null,null,"Select One",null,null,null,null,{"$f":"IF('8. Title I, A School Funding'!$M$164=0, \"0\", IF(G51>0, (valAllocationFlexT1)/($G$137+'8. Title I, A School Funding'!$M$164),0))","v":"0"},0,null,null,null,null,null,null,null,null,null,null,null,null,null,0]
[null,null,null,"Select One",null,null,null,null,{"$f":"IF('8. Title I, A School Funding'!$M$164=0, \"0\", IF(G52>0, (valAllocationFlexT1)/($G$137+'8. Title I, A School Funding'!$M$164),0))","v":"0"},0,null,null,null,null,null,null,null,null,null,null,null,null,null,0]
[null,null,null,"Select One",null,null,null,null,{"$f":"IF('8. Title I, A School Funding'!$M$164=0, \"0\", IF(G53>0, (valAllocationFlexT1)/($G$137+'8. Title I, A School Funding'!$M$164),0))","v":"0"},0,null,null,null,null,null,null,null,null,null,null,null,null,null,0]
[null,null,null,"Select One",null,null,null,null,{"$f":"IF('8. Title I, A School Funding'!$M$164=0, \"0\", IF(G54>0, (valAllocationFlexT1)/($G$137+'8. Title I, A School Funding'!$M$164),0))","v":"0"},0,null,null,null,null,null,null,null,null,null,null,null,null,null,0]
[null,null,null,"Select One",null,null,null,null,{"$f":"IF('8. Title I, A School Funding'!$M$164=0, \"0\", IF(G55>0, (valAllocationFlexT1)/($G$137+'8. Title I, A School Funding'!$M$164),0))","v":"0"},0,null,null,null,null,null,null,null,null,null,null,null,null,null,0]
[null,null,null,"Select One",null,null,null,null,{"$f":"IF('8. Title I, A School Funding'!$M$164=0, \"0\", IF(G56>0, (valAllocationFlexT1)/($G$137+'8. Title I, A School Funding'!$M$164),0))","v":"0"},0,null,null,null,null,null,null,null,null,null,null,null,null,null,0]
[null,null,null,"Select One",null,null,null,null,{"$f":"IF('8. Title I, A School Funding'!$M$164=0, \"0\", IF(G57>0, (valAllocationFlexT1)/($G$137+'8. Title I, A School Funding'!$M$164),0))","v":"0"},0,null,null,null,null,null,null,null,null,null,null,null,null,null,0]
[null,null,null,"Select One",null,null,null,null,{"$f":"IF('8. Title I, A School Funding'!$M$164=0, \"0\", IF(G58>0, (valAllocationFlexT1)/($G$137+'8. Title I, A School Funding'!$M$164),0))","v":"0"},0,null,null,null,null,null,null,null,null,null,null,null,null,null,0]
[null,null,null,"Select One",null,null,null,null,{"$f":"IF('8. Title I, A School Funding'!$M$164=0, \"0\", IF(G59>0, (valAllocationFlexT1)/($G$137+'8. Title I, A School Funding'!$M$164),0))","v":"0"},0,null,null,null,null,null,null,null,null,null,null,null,null,null,0]
[null,null,null,"Select One",null,null,null,null,{"$f":"IF('8. Title I, A School Funding'!$M$164=0, \"0\", IF(G60>0, (valAllocationFlexT1)/($G$137+'8. Title I, A School Funding'!$M$164),0))","v":"0"},0,null,null,null,null,null,null,null,null,null,null,null,null,null,0]
[null,null,null,"Select One",null,null,null,null,{"$f":"IF('8. Title I, A School Funding'!$M$164=0, \"0\", IF(G61>0, (valAllocationFlexT1)/($G$137+'8. Title I, A School Funding'!$M$164),0))","v":"0"},0,null,null,null,null,null,null,null,null,null,null,null,null,null,0]
[null,null,null,"Select One",null,null,null,null,{"$f":"IF('8. Title I, A School Funding'!$M$164=0, \"0\", IF(G62>0, (valAllocationFlexT1)/($G$137+'8. Title I, A School Funding'!$M$164),0))","v":"0"},0,null,null,null,null,null,null,null,null,null,null,null,null,null,0]
[null,null,null,"Select One",null,null,null,null,{"$f":"IF('8. Title I, A School Funding'!$M$164=0, \"0\", IF(G63>0, (valAllocationFlexT1)/($G$137+'8. Title I, A School Funding'!$M$164),0))","v":"0"},0,null,null,null,null,null,null,null,null,null,null,null,null,null,0]
[null,null,null,"Select One",null,null,null,null,{"$f":"IF('8. Title I, A School Funding'!$M$164=0, \"0\", IF(G64>0, (valAllocationFlexT1)/($G$137+'8. Title I, A School Funding'!$M$164),0))","v":"0"},0,null,null,null,null,null,null,null,null,null,null,null,null,null,0]
[null,null,null,"Select One",null,null,null,null,{"$f":"IF('8. Title I, A School Funding'!$M$164=0, \"0\", IF(G65>0, (valAllocationFlexT1)/($G$137+'8. Title I, A School Funding'!$M$164),0))","v":"0"},0,null,null,null,null,null,null,null,null,null,null,null,null,null,0]
[null,null,null,"Select One",null,null,null,null,{"$f":"IF('8. Title I, A School Funding'!$M$164=0, \"0\", IF(G66>0, (valAllocationFlexT1)/($G$137+'8. Title I, A School Funding'!$M$164),0))","v":"0"},{"$f":"IFERROR(IF(D66=\"Yes\",(valPrivateSchoolT1/$X$137)*G66, 0), 0)","v":0},null,null,null,null,null,null,null,null,null,null,null,null,null,{"$f":"IF(D66=\"Yes\", G66, 0)","v":0}]
[null,null,null,"Select One",null,null,null,null,{"$f":"IF('8. Title I, A School Funding'!$M$164=0, \"0\", IF(G67>0, (valAllocationFlexT1)/($G$137+'8. Title I, A School Funding'!$M$164),0))","v":"0"},0,null,null,null,null,null,null,null,null,null,null,null,null,null,0]
[null,null,null,"Select One",null,null,null,null,{"$f":"IF('8. Title I, A School Funding'!$M$164=0, \"0\", IF(G68>0, (valAllocationFlexT1)/($G$137+'8. Title I, A School Funding'!$M$164),0))","v":"0"},0,null,null,null,null,null,null,null,null,null,null,null,null,null,0]
[null,null,null,"Select One",null,null,null,null,{"$f":"IF('8. Title I, A School Funding'!$M$164=0, \"0\", IF(G69>0, (valAllocationFlexT1)/($G$137+'8. Title I, A School Funding'!$M$164),0))","v":"0"},0,null,null,null,null,null,null,null,null,null,null,null,null,null,0]
[null,null,null,"Select One",null,null,null,null,{"$f":"IF('8. Title I, A School Funding'!$M$164=0, \"0\", IF(G70>0, (valAllocationFlexT1)/($G$137+'8. Title I, A School Funding'!$M$164),0))","v":"0"},0,null,null,null,null,null,null,null,null,null,null,null,null,null,0]
[null,null,null,"Select One",null,null,null,null,{"$f":"IF('8. Title I, A School Funding'!$M$164=0, \"0\", IF(G71>0, (valAllocationFlexT1)/($G$137+'8. Title I, A School Funding'!$M$164),0))","v":"0"},0,null,null,null,null,null,null,null,null,null,null,null,null,null,0]
[null,null,null,"Select One",null,null,null,null,{"$f":"IF('8. Title I, A School Funding'!$M$164=0, \"0\", IF(G72>0, (valAllocationFlexT1)/($G$137+'8. Title I, A School Funding'!$M$164),0))","v":"0"},0,null,null,null,null,null,null,null,null,null,null,null,null,null,0]
[null,null,null,"Select One",null,null,null,null,{"$f":"IF('8. Title I, A School Funding'!$M$164=0, \"0\", IF(G73>0, (valAllocationFlexT1)/($G$137+'8. Title I, A School Funding'!$M$164),0))","v":"0"},0,null,null,null,null,null,null,null,null,null,null,null,null,null,0]
[null,null,null,"Select One",null,null,null,null,{"$f":"IF('8. Title I, A School Funding'!$M$164=0, \"0\", IF(G74>0, (valAllocationFlexT1)/($G$137+'8. Title I, A School Funding'!$M$164),0))","v":"0"},0,null,null,null,null,null,null,null,null,null,null,null,null,null,0]
[null,null,null,"Select One",null,null,null,null,{"$f":"IF('8. Title I, A School Funding'!$M$164=0, \"0\", IF(G75>0, (valAllocationFlexT1)/($G$137+'8. Title I, A School Funding'!$M$164),0))","v":"0"},0,null,null,null,null,null,null,null,null,null,null,null,null,null,0]
[null,null,null,"Select One",null,null,null,null,{"$f":"IF('8. Title I, A School Funding'!$M$164=0, \"0\", IF(G76>0, (valAllocationFlexT1)/($G$137+'8. Title I, A School Funding'!$M$164),0))","v":"0"},0,null,null,null,null,null,null,null,null,null,null,null,null,null,0]
[null,null,null,"Select One",null,null,null,null,{"$f":"IF('8. Title I, A School Funding'!$M$164=0, \"0\", IF(G77>0, (valAllocationFlexT1)/($G$137+'8. Title I, A School Funding'!$M$164),0))","v":"0"},0,null,null,null,null,null,null,null,null,null,null,null,null,null,0]
[null,null,null,"Select One",null,null,null,null,{"$f":"IF('8. Title I, A School Funding'!$M$164=0, \"0\", IF(G78>0, (valAllocationFlexT1)/($G$137+'8. Title I, A School Funding'!$M$164),0))","v":"0"},0,null,null,null,null,null,null,null,null,null,null,null,null,null,0]
[null,null,null,"Select One",null,null,null,null,{"$f":"IF('8. Title I, A School Funding'!$M$164=0, \"0\", IF(G79>0, (valAllocationFlexT1)/($G$137+'8. Title I, A School Funding'!$M$164),0))","v":"0"},0,null,null,null,null,null,null,null,null,null,null,null,null,null,0]
[null,null,null,"Select One",null,null,null,null,{"$f":"IF('8. Title I, A School Funding'!$M$164=0, \"0\", IF(G80>0, (valAllocationFlexT1)/($G$137+'8. Title I, A School Funding'!$M$164),0))","v":"0"},0,null,null,null,null,null,null,null,null,null,null,null,null,null,0]
[null,null,null,"Select One",null,null,null,null,{"$f":"IF('8. Title I, A School Funding'!$M$164=0, \"0\", IF(G81>0, (valAllocationFlexT1)/($G$137+'8. Title I, A School Funding'!$M$164),0))","v":"0"},0,null,null,null,null,null,null,null,null,null,null,null,null,null,0]
[null,null,null,"Select One",null,null,null,null,{"$f":"IF('8. Title I, A School Funding'!$M$164=0, \"0\", IF(G82>0, (valAllocationFlexT1)/($G$137+'8. Title I, A School Funding'!$M$164),0))","v":"0"},0,null,null,null,null,null,null,null,null,null,null,null,null,null,0]
[null,null,null,"Select One",null,null,null,null,{"$f":"IF('8. Title I, A School Funding'!$M$164=0, \"0\", IF(G83>0, (valAllocationFlexT1)/($G$137+'8. Title I, A School Funding'!$M$164),0))","v":"0"},0,null,null,null,null,null,null,null,null,null,null,null,null,null,0]
[null,null,null,"Select One",null,null,null,null,{"$f":"IF('8. Title I, A School Funding'!$M$164=0, \"0\", IF(G84>0, (valAllocationFlexT1)/($G$137+'8. Title I, A School Funding'!$M$164),0))","v":"0"},0,null,null,null,null,null,null,null,null,null,null,null,null,null,0]
[null,null,null,"Select One",null,null,null,null,{"$f":"IF('8. Title I, A School Funding'!$M$164=0, \"0\", IF(G85>0, (valAllocationFlexT1)/($G$137+'8. Title I, A School Funding'!$M$164),0))","v":"0"},0,null,null,null,null,null,null,null,null,null,null,null,null,null,0]
[null,null,null,"Select One",null,null,null,null,{"$f":"IF('8. Title I, A School Funding'!$M$164=0, \"0\", IF(G86>0, (valAllocationFlexT1)/($G$137+'8. Title I, A School Funding'!$M$164),0))","v":"0"},0,null,null,null,null,null,null,null,null,null,null,null,null,null,0]
[null,null,null,"Select One",null,null,null,null,{"$f":"IF('8. Title I, A School Funding'!$M$164=0, \"0\", IF(G87>0, (valAllocationFlexT1)/($G$137+'8. Title I, A School Funding'!$M$164),0))","v":"0"},0,null,null,null,null,null,null,null,null,null,null,null,null,null,0]
[null,null,null,"Select One",null,null,null,null,{"$f":"IF('8. Title I, A School Funding'!$M$164=0, \"0\", IF(G88>0, (valAllocationFlexT1)/($G$137+'8. Title I, A School Funding'!$M$164),0))","v":"0"},0,null,null,null,null,null,null,null,null,null,null,null,null,null,0]
[null,null,null,"Select One",null,null,null,null,{"$f":"IF('8. Title I, A School Funding'!$M$164=0, \"0\", IF(G89>0, (valAllocationFlexT1)/($G$137+'8. Title I, A School Funding'!$M$164),0))","v":"0"},0,null,null,null,null,null,null,null,null,null,null,null,null,null,0]
[null,null,null,"Select One",null,null,null,null,{"$f":"IF('8. Title I, A School Funding'!$M$164=0, \"0\", IF(G90>0, (valAllocationFlexT1)/($G$137+'8. Title I, A School Funding'!$M$164),0))","v":"0"},0,null,null,null,null,null,null,null,null,null,null,null,null,null,0]
[null,null,null,"Select One",null,null,null,null,{"$f":"IF('8. Title I, A School Funding'!$M$164=0, \"0\", IF(G91>0, (valAllocationFlexT1)/($G$137+'8. Title I, A School Funding'!$M$164),0))","v":"0"},0,null,null,null,null,null,null,null,null,null,null,null,null,null,0]
[null,null,null,"Select One",null,null,null,null,{"$f":"IF('8. Title I, A School Funding'!$M$164=0, \"0\", IF(G92>0, (valAllocationFlexT1)/($G$137+'8. Title I, A School Funding'!$M$164),0))","v":"0"},0,null,null,null,null,null,null,null,null,null,null,null,null,null,0]
[null,null,null,"Select One",null,null,null,null,{"$f":"IF('8. Title I, A School Funding'!$M$164=0, \"0\", IF(G93>0, (valAllocationFlexT1)/($G$137+'8. Title I, A School Funding'!$M$164),0))","v":"0"},0,null,null,null,null,null,null,null,null,null,null,null,null,null,0]
[null,null,null,"Select One",null,null,null,null,{"$f":"IF('8. Title I, A School Funding'!$M$164=0, \"0\", IF(G94>0, (valAllocationFlexT1)/($G$137+'8. Title I, A School Funding'!$M$164),0))","v":"0"},0,null,null,null,null,null,null,null,null,null,null,null,null,null,0]
[null,null,null,"Select One",null,null,null,null,{"$f":"IF('8. Title I, A School Funding'!$M$164=0, \"0\", IF(G95>0, (valAllocationFlexT1)/($G$137+'8. Title I, A School Funding'!$M$164),0))","v":"0"},0,null,null,null,null,null,null,null,null,null,null,null,null,null,0]
[null,null,null,"Select One",null,null,null,null,{"$f":"IF('8. Title I, A School Funding'!$M$164=0, \"0\", IF(G96>0, (valAllocationFlexT1)/($G$137+'8. Title I, A School Funding'!$M$164),0))","v":"0"},0,null,null,null,null,null,null,null,null,null,null,null,null,null,0]
[null,null,null,"Select One",null,null,null,null,{"$f":"IF('8. Title I, A School Funding'!$M$164=0, \"0\", IF(G97>0, (valAllocationFlexT1)/($G$137+'8. Title I, A School Funding'!$M$164),0))","v":"0"},0,null,null,null,null,null,null,null,null,null,null,null,null,null,0]
[null,null,null,"Select One",null,null,null,null,{"$f":"IF('8. Title I, A School Funding'!$M$164=0, \"0\", IF(G98>0, (valAllocationFlexT1)/($G$137+'8. Title I, A School Funding'!$M$164),0))","v":"0"},{"$f":"IFERROR(IF(D98=\"Yes\",(valPrivateSchoolT1/$X$137)*G98, 0), 0)","v":0},null,null,null,null,null,null,null,null,null,null,null,null,null,{"$f":"IF(D98=\"Yes\", G98, 0)","v":0}]
[null,null,null,"Select One",null,null,null,null,{"$f":"IF('8. Title I, A School Funding'!$M$164=0, \"0\", IF(G99>0, (valAllocationFlexT1)/($G$137+'8. Title I, A School Funding'!$M$164),0))","v":"0"},0,null,null,null,null,null,null,null,null,null,null,null,null,null,0]
[null,null,null,"Select One",null,null,null,null,{"$f":"IF('8. Title I, A School Funding'!$M$164=0, \"0\", IF(G100>0, (valAllocationFlexT1)/($G$137+'8. Title I, A School Funding'!$M$164),0))","v":"0"},0,null,null,null,null,null,null,null,null,null,null,null,null,null,0]
[null,null,null,"Select One",null,null,null,null,{"$f":"IF('8. Title I, A School Funding'!$M$164=0, \"0\", IF(G101>0, (valAllocationFlexT1)/($G$137+'8. Title I, A School Funding'!$M$164),0))","v":"0"},0,null,null,null,null,null,null,null,null,null,null,null,null,null,0]
[null,null,null,"Select One",null,null,null,null,{"$f":"IF('8. Title I, A School Funding'!$M$164=0, \"0\", IF(G102>0, (valAllocationFlexT1)/($G$137+'8. Title I, A School Funding'!$M$164),0))","v":"0"},0,null,null,null,null,null,null,null,null,null,null,null,null,null,0]
[null,null,null,"Select One",null,null,null,null,{"$f":"IF('8. Title I, A School Funding'!$M$164=0, \"0\", IF(G103>0, (valAllocationFlexT1)/($G$137+'8. Title I, A School Funding'!$M$164),0))","v":"0"},0,null,null,null,null,null,null,null,null,null,null,null,null,null,0]
[null,null,null,"Select One",null,null,null,null,{"$f":"IF('8. Title I, A School Funding'!$M$164=0, \"0\", IF(G104>0, (valAllocationFlexT1)/($G$137+'8. Title I, A School Funding'!$M$164),0))","v":"0"},0,null,null,null,null,null,null,null,null,null,null,null,null,null,0]
[null,null,null,"Select One",null,null,null,null,{"$f":"IF('8. Title I, A School Funding'!$M$164=0, \"0\", IF(G105>0, (valAllocationFlexT1)/($G$137+'8. Title I, A School Funding'!$M$164),0))","v":"0"},0,null,null,null,null,null,null,null,null,null,null,null,null,null,0]
[null,null,null,"Select One",null,null,null,null,{"$f":"IF('8. Title I, A School Funding'!$M$164=0, \"0\", IF(G106>0, (valAllocationFlexT1)/($G$137+'8. Title I, A School Funding'!$M$164),0))","v":"0"},0,null,null,null,null,null,null,null,null,null,null,null,null,null,0]
[null,null,null,"Select One",null,null,null,null,{"$f":"IF('8. Title I, A School Funding'!$M$164=0, \"0\", IF(G107>0, (valAllocationFlexT1)/($G$137+'8. Title I, A School Funding'!$M$164),0))","v":"0"},0,null,null,null,null,null,null,null,null,null,null,null,null,null,0]
[null,null,null,"Select One",null,null,null,null,{"$f":"IF('8. Title I, A School Funding'!$M$164=0, \"0\", IF(G108>0, (valAllocationFlexT1)/($G$137+'8. Title I, A School Funding'!$M$164),0))","v":"0"},0,null,null,null,null,null,null,null,null,null,null,null,null,null,0]
[null,null,null,"Select One",null,null,null,null,{"$f":"IF('8. Title I, A School Funding'!$M$164=0, \"0\", IF(G109>0, (valAllocationFlexT1)/($G$137+'8. Title I, A School Funding'!$M$164),0))","v":"0"},0,null,null,null,null,null,null,null,null,null,null,null,null,null,0]
[null,null,null,"Select One",null,null,null,null,{"$f":"IF('8. Title I, A School Funding'!$M$164=0, \"0\", IF(G110>0, (valAllocationFlexT1)/($G$137+'8. Title I, A School Funding'!$M$164),0))","v":"0"},0,null,null,null,null,null,null,null,null,null,null,null,null,null,0]
[null,null,null,"Select One",null,null,null,null,{"$f":"IF('8. Title I, A School Funding'!$M$164=0, \"0\", IF(G111>0, (valAllocationFlexT1)/($G$137+'8. Title I, A School Funding'!$M$164),0))","v":"0"},0,null,null,null,null,null,null,null,null,null,null,null,null,null,0]
[null,null,null,"Select One",null,null,null,null,{"$f":"IF('8. Title I, A School Funding'!$M$164=0, \"0\", IF(G112>0, (valAllocationFlexT1)/($G$137+'8. Title I, A School Funding'!$M$164),0))","v":"0"},0,null,null,null,null,null,null,null,null,null,null,null,null,null,0]
[null,null,null,"Select One",null,null,null,null,{"$f":"IF('8. Title I, A School Funding'!$M$164=0, \"0\", IF(G113>0, (valAllocationFlexT1)/($G$137+'8. Title I, A School Funding'!$M$164),0))","v":"0"},0,null,null,null,null,null,null,null,null,null,null,null,null,null,0]
[null,null,null,"Select One",null,null,null,null,{"$f":"IF('8. Title I, A School Funding'!$M$164=0, \"0\", IF(G114>0, (valAllocationFlexT1)/($G$137+'8. Title I, A School Funding'!$M$164),0))","v":"0"},0,null,null,null,null,null,null,null,null,null,null,null,null,null,0]
[null,null,null,"Select One",null,null,null,null,{"$f":"IF('8. Title I, A School Funding'!$M$164=0, \"0\", IF(G115>0, (valAllocationFlexT1)/($G$137+'8. Title I, A School Funding'!$M$164),0))","v":"0"},0,null,null,null,null,null,null,null,null,null,null,null,null,null,0]
[null,null,null,"Select One",null,null,null,null,{"$f":"IF('8. Title I, A School Funding'!$M$164=0, \"0\", IF(G116>0, (valAllocationFlexT1)/($G$137+'8. Title I, A School Funding'!$M$164),0))","v":"0"},0,null,null,null,null,null,null,null,null,null,null,null,null,null,0]
[null,null,null,"Select One",null,null,null,null,{"$f":"IF('8. Title I, A School Funding'!$M$164=0, \"0\", IF(G117>0, (valAllocationFlexT1)/($G$137+'8. Title I, A School Funding'!$M$164),0))","v":"0"},0,null,null,null,null,null,null,null,null,null,null,null,null,null,0]
[null,null,null,"Select One",null,null,null,null,{"$f":"IF('8. Title I, A School Funding'!$M$164=0, \"0\", IF(G118>0, (valAllocationFlexT1)/($G$137+'8. Title I, A School Funding'!$M$164),0))","v":"0"},0,null,null,null,null,null,null,null,null,null,null,null,null,null,0]
[null,null,null,"Select One",null,null,null,null,{"$f":"IF('8. Title I, A School Funding'!$M$164=0, \"0\", IF(G119>0, (valAllocationFlexT1)/($G$137+'8. Title I, A School Funding'!$M$164),0))","v":"0"},0,null,null,null,null,null,null,null,null,null,null,null,null,null,0]
[null,null,null,"Select One",null,null,null,null,{"$f":"IF('8. Title I, A School Funding'!$M$164=0, \"0\", IF(G120>0, (valAllocationFlexT1)/($G$137+'8. Title I, A School Funding'!$M$164),0))","v":"0"},0,null,null,null,null,null,null,null,null,null,null,null,null,null,0]
[null,null,null,"Select One",null,null,null,null,{"$f":"IF('8. Title I, A School Funding'!$M$164=0, \"0\", IF(G121>0, (valAllocationFlexT1)/($G$137+'8. Title I, A School Funding'!$M$164),0))","v":"0"},0,null,null,null,null,null,null,null,null,null,null,null,null,null,0]
[null,null,null,"Select One",null,null,null,null,{"$f":"IF('8. Title I, A School Funding'!$M$164=0, \"0\", IF(G122>0, (valAllocationFlexT1)/($G$137+'8. Title I, A School Funding'!$M$164),0))","v":"0"},0,null,null,null,null,null,null,null,null,null,null,null,null,null,0]
[null,null,null,"Select One",null,null,null,null,{"$f":"IF('8. Title I, A School Funding'!$M$164=0, \"0\", IF(G123>0, (valAllocationFlexT1)/($G$137+'8. Title I, A School Funding'!$M$164),0))","v":"0"},0,null,null,null,null,null,null,null,null,null,null,null,null,null,0]
[null,null,null,"Select One",null,null,null,null,{"$f":"IF('8. Title I, A School Funding'!$M$164=0, \"0\", IF(G124>0, (valAllocationFlexT1)/($G$137+'8. Title I, A School Funding'!$M$164),0))","v":"0"},0,null,null,null,null,null,null,null,null,null,null,null,null,null,0]
[null,null,null,"Select One",null,null,null,null,{"$f":"IF('8. Title I, A School Funding'!$M$164=0, \"0\", IF(G125>0, (valAllocationFlexT1)/($G$137+'8. Title I, A School Funding'!$M$164),0))","v":"0"},0,null,null,null,null,null,null,null,null,null,null,null,null,null,0]
[null,null,null,"Select One",null,null,null,null,{"$f":"IF('8. Title I, A School Funding'!$M$164=0, \"0\", IF(G126>0, (valAllocationFlexT1)/($G$137+'8. Title I, A School Funding'!$M$164),0))","v":"0"},0,null,null,null,null,null,null,null,null,null,null,null,null,null,0]
[null,null,null,"Select One",null,null,null,null,{"$f":"IF('8. Title I, A School Funding'!$M$164=0, \"0\", IF(G127>0, (valAllocationFlexT1)/($G$137+'8. Title I, A School Funding'!$M$164),0))","v":"0"},0,null,null,null,null,null,null,null,null,null,null,null,null,null,0]
[null,null,null,"Select One",null,null,null,null,{"$f":"IF('8. Title I, A School Funding'!$M$164=0, \"0\", IF(G128>0, (valAllocationFlexT1)/($G$137+'8. Title I, A School Funding'!$M$164),0))","v":"0"},0,null,null,null,null,null,null,null,null,null,null,null,null,null,0]
[null,null,null,"Select One",null,null,null,null,{"$f":"IF('8. Title I, A School Funding'!$M$164=0, \"0\", IF(G129>0, (valAllocationFlexT1)/($G$137+'8. Title I, A School Funding'!$M$164),0))","v":"0"},0,null,null,null,null,null,null,null,null,null,null,null,null,null,0]
[null,null,null,"Select One",null,null,null,null,{"$f":"IF('8. Title I, A School Funding'!$M$164=0, \"0\", IF(G130>0, (valAllocationFlexT1)/($G$137+'8. Title I, A School Funding'!$M$164),0))","v":"0"},{"$f":"IFERROR(IF(D130=\"Yes\",(valPrivateSchoolT1/$X$137)*G130, 0), 0)","v":0},null,null,null,null,null,null,null,null,null,null,null,null,null,{"$f":"IF(D130=\"Yes\", G130, 0)","v":0}]
[null,null,null,"Select One",null,null,null,null,{"$f":"IF('8. Title I, A School Funding'!$M$164=0, \"0\", IF(G131>0, (valAllocationFlexT1)/($G$137+'8. Title I, A School Funding'!$M$164),0))","v":"0"},0,null,null,null,null,null,null,null,null,null,null,null,null,null,0]
[null,null,null,"Select One",null,null,null,null,{"$f":"IF('8. Title I, A School Funding'!$M$164=0, \"0\", IF(G132>0, (valAllocationFlexT1)/($G$137+'8. Title I, A School Funding'!$M$164),0))","v":"0"},0,null,null,null,null,null,null,null,null,null,null,null,null,null,0]
[null,null,null,"Select One",null,null,null,null,{"$f":"IF('8. Title I, A School Funding'!$M$164=0, \"0\", IF(G133>0, (valAllocationFlexT1)/($G$137+'8. Title I, A School Funding'!$M$164),0))","v":"0"},0,null,null,null,null,null,null,null,null,null,null,null,null,null,0]
[null,null,null,"Select One",null,null,null,null,{"$f":"IF('8. Title I, A School Funding'!$M$164=0, \"0\", IF(G134>0, (valAllocationFlexT1)/($G$137+'8. Title I, A School Funding'!$M$164),0))","v":"0"},0,null,null,null,null,null,null,null,null,null,null,null,null,null,0]
[null,null,null,"Select One",null,null,null,null,{"$f":"IF('8. Title I, A School Funding'!$M$164=0, \"0\", IF(G135>0, (valAllocationFlexT1)/($G$137+'8. Title I, A School Funding'!$M$164),0))","v":"0"},0,null,null,null,null,null,null,null,null,null,null,null,null,null,0]
[null,null,null,"Select One",null,null,null,null,{"$f":"IF('8. Title I, A School Funding'!$M$164=0, \"0\", IF(G136>0, (valAllocationFlexT1)/($G$137+'8. Title I, A School Funding'!$M$164),0))","v":"0"},0,null,null,null,null,null,null,null,null,null,null,null,null,null,0]
[null,null,null,null,null,{"$f":"SUM(F34:F136)","v":0},{"$f":"SUM(G34:G136)","v":0},{"$f":"SUM(H34:H136)","v":0},null,{"$f":"IFERROR(SUM(J34:J136), 0)","v":0},null,null,null,null,null,null,null,null,null,null,null,null,null,{"$f":"SUM(X34:X136)","v":0}]
[]
[]
[]
[null,"Step 4.4\nEquitable Services\nAll  Title I Districts with eligible private school students","1. Has the district contacted all private schools (located within or beyond district boundaries) that enroll Title I eligible students and has evidence of such outreach on file.  (select yes/no/N/A) ",null,null,null,null,null,null,null,null,"Select One"]
[null,null,"2. How was low income status determined for private school students?"]
[null,null,"Select One"]
[null,null,"3. What Title I services will be provided to participating private school students, their teachers, and their parents? (Select primary service from dropdown menu; \n   list additional services in \"Other\")."]
[null,null,"Select One"]
[null,null,"4. How will the district assess the impact of services it delivers to private schools? (Choose primary source from dropdowns, and describe additional sources under \"Other\")."]
[null,null,"Select One"]
[]
[]
[]
[null,"Step 4.5\nList Private Schools\nAll  Title II, III, IV Districts ","Titles II, Part A; III, Part A; & IV, Part A:  Supporting Effective Instruction, Support for English Learners and Student Support and Academic Enrichment"]
[]
[null,null,"Title II, Part A; Title III, Part A & Title IV, Part A:  Private Schools Serving Eligible Children Residing in District",null,null,null,null,null,null,null,null,null,null,null,null,null,null,null,"\nInstructions:\nList the private schools located in the district boundaries and the number of students enrolled in each. The listing represents the private schools that have been contacted regarding interest in participation in the district’s Title IIA, Title III and/or Title IVA programs. Indicate whether each listed school has chosen to participate by selecting from the drop-down menu.\n\nColumns A-C: Indicate whether the private school has elected to participate in the program identified in the column heading (yes or no)\n\nColumn D: Indicate the number of children attending the listed school.\n\nColumn E: Indicate the number of children attending the private school who are English learners.\n\nColumns F, H and J:  These columns will automatically populate with a pro-rata per-pupil allocation based on your Title IIA, Title III and/or Title IVA funding after flexing and subtracting administrative expenses and all eligible students in private and district schools being funded equally.  \n\nColumns G, I and K:  Districts may opt, in consultation t with private school officials, to negotiate a different per pupil amount based on numbers and needs of students.  As with other decisions affecting services to private school students, the resulting methodology should reasonably reflect the relative numbers and educational needs of the public and private school students.  For examples, see USED guidance, Section F.  \n\nColumns L-M:  These columns will automatically populate based on the number of eligible students for each program multiplied by the per pupil amount for each program (using any negotiated per-pupil amount, and if none, the pro-rata per pupil amount).  Because the figures are reported in whole dollars, you might notice some discrepancies between per-pupil amounts and total allocated per school due to rounding issues -- rely on the total allocation by school for funding private school services.\n\nNote: For private schools that will participate in any or all Title II, Part A, Title III, Part A and Title IV, Part A, columns F through K will be populated according to the school's choice to participate, and, in the case of Title III, the number of eligible students.\n\nResponses to questions 1 and 2 for each Title II, Part A and Title IV, Part A and questions 1 through 3 for Title III, Part A are required, respectively, for only those districts that have eligible private schools that have chosen to participate in those programs. "]
[null,null,"\n\nList private schools located within  district boundaries      ","Will this Private School Participate in Title II, Part A?\n(Yes or No)","Will this Private School Participate in Title III, Part A?\n(Yes or No)","Will this Private School Participate in Title IV, Part A?\n(Yes or No)","Total Number of Students Enrolled in Private School\n(not including preschool students)","Number of Eligible English Learners Enrolled in Private School","Title II, Part A: Amount Per Pupil, Pro Rata","Title II, Part A: Amount Per Pupil, Negotiated","Title III, Part A: Amount Per Pupil, Pro Rata","Title III, Part A: Amount Per Pupil, Negotiated","Title IV, Part A: Amount Per Pupil, Pro Rata","Title IV, Part A: Amount Per Pupil, Negotiated","Title II, Part A: Total Allocation for Private School Services, by School","Title III, Part A: Total Allocation for Private School Services, by School","Title IV, Part A: Total Allocation for Private School Services, by School"]
[null,null,".","A","B","C","D","E","F","G","H","I","J","K","L","M","N"]
[null,null,null,"Select One","Select One","Select One",null,null,{"$f":"IF(D156=\"Yes\",IFERROR($J$21/((IF($D$10 =\"Yes\", $D$11, $D$17))+$G$257), 0),0)","v":0},null,{"$f":"IF(E156=\"Yes\",IFERROR($K$21/((IF($E$10 =\"Yes\", $E$12, $D$18))+$H$257), 0),0)","v":0},null,{"$f":"IF(F156=\"Yes\",IFERROR($L$21/((IF($F$10 =\"Yes\", $F$11, $D$17))+$E$257), 0),0)","v":0},null,{"$f":"IFERROR(IF(D156=\"Yes\", IF(J156>0, J156*G156, I156*G156), 0),0)","v":0},{"$f":"IFERROR(IF(E156=\"Yes\", IF(L156>0, L156*H156, K156*H156), 0),0)","v":0},{"$f":"IFERROR(IF(F156=\"Yes\", IF(N156>0, N156*G156, M156*G156), 0),0)","v":0}]
[null,null,null,"Select One","Select One","Select One",null,null,{"$f":"IF(D157=\"Yes\",IFERROR($J$21/((IF($D$10 =\"Yes\", $D$11, $D$17))+$G$257), 0),0)","v":0},null,{"$f":"IF(E157=\"Yes\",IFERROR($K$21/((IF($E$10 =\"Yes\", $E$12, $D$18))+$H$257), 0),0)","v":0},null,0,null,{"$f":"IFERROR(IF(D157=\"Yes\", IF(J157>0, J157*G157, I157*G157), 0),0)","v":0},{"$f":"IFERROR(IF(E157=\"Yes\", IF(L157>0, L157*H157, K157*H157), 0),0)","v":0},{"$f":"IFERROR(IF(F157=\"Yes\", IF(N157>0, N157*G157, M157*G157), 0),0)","v":0}]
[null,null,null,"Select One","Select One","Select One",null,null,0,null,0,null,0,null,{"$f":"IFERROR(IF(D158=\"Yes\", IF(J158>0, J158*G158, I158*G158), 0),0)","v":0},0,0]
[null,null,null,"Select One","Select One","Select One",null,null,0,null,0,null,0,null,0,0,0]
[null,null,null,"Select One","Select One","Select One",null,null,0,null,0,null,0,null,0,0,0]
[null,null,null,"Select One","Select One","Select One",null,null,0,null,0,null,0,null,0,0,0]
[null,null,null,"Select One","Select One","Select One",null,null,0,null,0,null,0,null,0,0,0]
[null,null,null,"Select One","Select One","Select One",null,null,0,null,0,null,0,null,0,0,0]
[null,null,null,"Select One","Select One","Select One",null,null,0,null,0,null,0,null,0,0,0]
[null,null,null,"Select One","Select One","Select One",null,null,0,null,0,null,0,null,0,0,0]
[null,null,null,"Select One","Select One","Select One",null,null,0,null,0,null,0,null,0,0,0]
[null,null,null,"Select One","Select One","Select One",null,null,0,null,0,null,0,null,0,0,0]
[null,null,null,"Select One","Select One","Select One",null,null,0,null,0,null,0,null,0,0,0]
[null,null,null,"Select One","Select One","Select One",null,null,0,null,0,null,0,null,0,0,0]
[null,null,null,"Select One","Select One","Select One",null,null,0,null,0,null,0,null,0,0,0]
[null,null,null,"Select One","Select One","Select One",null,null,0,null,0,null,0,null,0,0,0]
[null,null,null,"Select One","Select One","Select One",null,null,0,null,0,null,0,null,0,0,0]
[null,null,null,"Select One","Select One","Select One",null,null,0,null,0,null,0,null,0,0,0]
[null,null,null,"Select One","Select One","Select One",null,null,0,null,0,null,0,null,0,0,0]
[null,null,null,"Select One","Select One","Select One",null,null,0,null,0,null,0,null,0,0,0]
[null,null,null,"Select One","Select One","Select One",null,null,0,null,0,null,0,null,0,0,0]
[null,null,null,"Select One","Select One","Select One",null,null,0,null,0,null,0,null,0,0,0]
[null,null,null,"Select One","Select One","Select One",null,null,0,null,0,null,0,null,0,0,0]
[null,null,null,"Select One","Select One","Select One",null,null,0,null,0,null,0,null,0,0,0]
[null,null,null,"Select One","Select One","Select One",null,null,0,null,0,null,0,null,0,0,0]
[null,null,null,"Select One","Select One","Select One",null,null,0,null,0,null,0,null,0,0,0]
[null,null,null,"Select One","Select One","Select One",null,null,0,null,0,null,0,null,0,0,0]
[null,null,null,"Select One","Select One","Select One",null,null,0,null,0,null,0,null,0,0,0]
[null,null,null,"Select One","Select One","Select One",null,null,0,null,0,null,0,null,0,0,0]
[null,null,null,"Select One","Select One","Select One",null,null,0,null,0,null,0,null,0,0,0]
[null,null,null,"Select One","Select One","Select One",null,null,0,null,0,null,0,null,0,0,0]
[null,null,null,"Select One","Select One","Select One",null,null,0,null,0,null,0,null,0,0,0]
[null,null,null,"Select One","Select One","Select One",null,null,0,null,0,null,0,null,0,0,0]
[null,null,null,"Select One","Select One","Select One",null,null,0,null,0,null,0,null,0,0,0]
[null,null,null,"Select One","Select One","Select One",null,null,0,null,0,null,0,null,0,0,0]
[null,null,null,"Select One","Select One","Select One",null,null,0,null,0,null,0,null,0,0,0]
[null,null,null,"Select One","Select One","Select One",null,null,0,null,0,null,0,null,0,0,0]
[null,null,null,"Select One","Select One","Select One",null,null,0,null,0,null,0,null,0,0,0]
[null,null,null,"Select One","Select One","Select One",null,null,0,null,0,null,0,null,0,0,0]
[null,null,null,"Select One","Select One","Select One",null,null,0,null,0,null,0,null,0,0,0]
[null,null,null,"Select One","Select One","Select One",null,null,0,null,0,null,0,null,0,0,0]
[null,null,null,"Select One","Select One","Select One",null,null,0,null,0,null,0,null,0,0,0]
[null,null,null,"Select One","Select One","Select One",null,null,0,null,0,null,0,null,0,0,0]
[null,null,null,"Select One","Select One","Select One",null,null,0,null,0,null,0,null,0,0,0]
[null,null,null,"Select One","Select One","Select One",null,null,0,null,0,null,0,null,0,0,0]
[null,null,null,"Select One","Select One","Select One",null,null,0,null,0,null,0,null,0,0,0]
[null,null,null,"Select One","Select One","Select One",null,null,0,null,0,null,0,null,0,0,0]
[null,null,null,"Select One","Select One","Select One",null,null,0,null,0,null,0,null,0,0,0]
[null,null,null,"Select One","Select One","Select One",null,null,0,null,0,null,0,null,0,0,0]
[null,null,null,"Select One","Select One","Select One",null,null,0,null,0,null,0,null,0,0,0]
[null,null,null,"Select One","Select One","Select One",null,null,0,null,0,null,0,null,0,0,0]
[null,null,null,"Select One","Select One","Select One",null,null,0,null,0,null,0,null,0,0,0]
[null,null,null,"Select One","Select One","Select One",null,null,0,null,0,null,0,null,0,0,0]
[null,null,null,"Select One","Select One","Select One",null,null,0,null,0,null,0,null,0,0,0]
[null,null,null,"Select One","Select One","Select One",null,null,0,null,0,null,0,null,0,0,0]
[null,null,null,"Select One","Select One","Select One",null,null,0,null,0,null,0,null,0,0,0]
[null,null,null,"Select One","Select One","Select One",null,null,0,null,0,null,0,null,0,0,0]
[null,null,null,"Select One","Select One","Select One",null,null,0,null,0,null,0,null,0,0,0]
[null,null,null,"Select One","Select One","Select One",null,null,0,null,0,null,0,null,0,0,0]
[null,null,null,"Select One","Select One","Select One",null,null,0,null,0,null,0,null,0,0,0]
[null,null,null,"Select One","Select One","Select One",null,null,0,null,0,null,0,null,0,0,0]
[null,null,null,"Select One","Select One","Select One",null,null,0,null,0,null,0,null,0,0,0]
[null,null,null,"Select One","Select One","Select One",null,null,0,null,0,null,0,null,0,0,0]
[null,null,null,"Select One","Select One","Select One",null,null,0,null,0,null,0,null,0,0,0]
[null,null,null,"Select One","Select One","Select One",null,null,0,null,{"$f":"IF(E220=\"Yes\",IFERROR($K$21/((IF($E$10 =\"Yes\", $E$12, $D$18))+$H$257), 0),0)","v":0},null,{"$f":"IF(F220=\"Yes\",IFERROR($L$21/((IF($F$10 =\"Yes\", $F$11, $D$17))+$E$257), 0),0)","v":0},null,0,0,0]
[null,null,null,"Select One","Select One","Select One",null,null,{"$f":"IF(D221=\"Yes\",IFERROR($J$21/((IF($D$10 =\"Yes\", $D$11, $D$17))+$G$257), 0),0)","v":0},null,0,null,0,null,{"$f":"IFERROR(IF(D221=\"Yes\", IF(J221>0, J221*G221, I221*G221), 0),0)","v":0},{"$f":"IFERROR(IF(E221=\"Yes\", IF(L221>0, L221*H221, K221*H221), 0),0)","v":0},{"$f":"IFERROR(IF(F221=\"Yes\", IF(N221>0, N221*G221, M221*G221), 0),0)","v":0}]
[null,null,null,"Select One","Select One","Select One",null,null,0,null,0,null,0,null,0,0,0]
[null,null,null,"Select One","Select One","Select One",null,null,0,null,0,null,0,null,0,0,0]
[null,null,null,"Select One","Select One","Select One",null,null,0,null,0,null,0,null,0,0,0]
[null,null,null,"Select One","Select One","Select One",null,null,0,null,0,null,0,null,0,0,0]
[null,null,null,"Select One","Select One","Select One",null,null,0,null,0,null,0,null,0,0,0]
[null,null,null,"Select One","Select One","Select One",null,null,0,null,0,null,0,null,0,0,0]
[null,null,null,"Select One","Select One","Select One",null,null,0,null,0,null,0,null,0,0,0]
[null,null,null,"Select One","Select One","Select One",null,null,0,null,0,null,0,null,0,0,0]
[null,null,null,"Select One","Select One","Select One",null,null,0,null,0,null,0,null,0,0,0]
[null,null,null,"Select One","Select One","Select One",null,null,0,null,0,null,0,null,0,0,0]
[null,null,null,"Select One","Select One","Select One",null,null,0,null,0,null,0,null,0,0,0]
[null,null,null,"Select One","Select One","Select One",null,null,0,null,0,null,0,null,0,0,0]
[null,null,null,"Select One","Select One","Select One",null,null,0,null,0,null,0,null,0,0,0]
[null,null,null,"Select One","Select One","Select One",null,null,0,null,0,null,0,null,0,0,0]
[null,null,null,"Select One","Select One","Select One",null,null,0,null,0,null,0,null,0,0,0]
[null,null,null,"Select One","Select One","Select One",null,null,0,null,0,null,0,null,0,0,0]
[null,null,null,"Select One","Select One","Select One",null,null,0,null,0,null,0,null,0,0,0]
[null,null,null,"Select One","Select One","Select One",null,null,0,null,0,null,0,null,0,0,0]
[null,null,null,"Select One","Select One","Select One",null,null,0,null,0,null,0,null,0,0,0]
[null,null,null,"Select One","Select One","Select One",null,null,0,null,0,null,0,null,0,0,0]
[null,null,null,"Select One","Select One","Select One",null,null,0,null,0,null,0,null,0,0,0]
[null,null,null,"Select One","Select One","Select One",null,null,0,null,0,null,0,null,0,0,0]
[null,null,null,"Select One","Select One","Select One",null,null,0,null,0,null,0,null,0,0,0]
[null,null,null,"Select One","Select One","Select One",null,null,0,null,0,null,0,null,0,0,0]
[null,null,null,"Select One","Select One","Select One",null,null,0,null,0,null,0,null,0,0,0]
[null,null,null,"Select One","Select One","Select One",null,null,0,null,0,null,0,null,0,0,0]
[null,null,null,"Select One","Select One","Select One",null,null,0,null,0,null,0,null,0,0,0]
[null,null,null,"Select One","Select One","Select One",null,null,0,null,0,null,0,null,0,0,0]
[null,null,null,"Select One","Select One","Select One",null,null,0,null,0,null,0,null,0,0,0]
[null,null,null,"Select One","Select One","Select One",null,null,0,null,0,null,0,null,0,0,0]
[null,null,null,"Select One","Select One","Select One",null,null,0,null,0,null,0,null,0,0,0]
[null,null,null,"Select One","Select One","Select One",null,null,0,null,0,null,0,null,0,0,0]
[null,null,null,"Select One","Select One","Select One",null,null,0,null,0,null,0,null,0,0,0]
[null,null,null,"Select One","Select One","Select One",null,null,0,null,0,null,0,null,{"$f":"IFERROR(IF(D255=\"Yes\", IF(J255>0, J255*G255, I255*G255), 0),0)","v":0},0,0]
[null,null,null,null,null,null,null,null,null,null,null,null,null,null,{"$f":"SUM(O156:O255)","v":0},{"$f":"SUM(P156:P255)","v":0},{"$f":"SUM(Q156:Q255)","v":0}]
[null,null,null,"Title IVA TotalPrivate School Participation",{"$f":"SUMIF(F156:F255, \"Yes\", G156:G255)","v":0},"Title IIA Total Private School Participation",{"$f":"SUMIF(D156:D255, \"Yes\", G156:G255)","v":0},{"$f":"SUMIF(E156:E255, \"Yes\", H156:H255)","v":0}]
[]
[null,null,null,null,null,null,null,null,null,null,"Title II, Part A","Title III, Part A","Title IV, Part A"]
[null,"Step 4.6\nEquitable Services\nAll  Title II, III, IV Districts with eligible private school students","  Has the district contacted all private schools located within district boundaries to inquire about their participation in Title II, Part A, \n  Title III, Part A, and/or Title IV, Part A services with evidence of such outreach on file?  (select yes/no/N/A) ",null,null,null,null,null,null,null,"Select One","Select One","Select One"]
[]
[null,null,"1. What Title II, Part A services will be provided to participating private schools? (Select primary service from dropdown menu; list additional services in \"Other\")."]
[]
[null,null,"Select One"]
[null,null,"2. How will the district assess the impact of Title IIA services on participating private school students?  (Choose primary source from dropdowns, and describe\n    additional sources under \"Other\")."]
[]
[null,null,"Select One"]
[]
[null,null,"1. What Title III, Part A services will be provided to participating private schools? (Select primary service from dropdown menu; list additional services in \"Other\")."]
[null,null,"Select One"]
[null,null,"2. How will the district assess the impact of Title III, Part A services on participating private school students? (Select primary source from dropdown menu; list additional sources in \"Other\")."]
[]
[null,null,"Select One"]
[null,null,"3.  How were private school English Learners identified? (Select primary means of identification from dropdown menu; list additional means in \"Other\")."]
[]
[null,null,"Select One"]
[]
[]
[null,null,"1. What Title IV, Part A services will be provided to participating private schools?  (Select primary service from dropdown menu; list additional services in \"Other\")."]
[]
[null,null,"Select One"]
[null,null,"2. How will the district assess the impact of Title IV, Part A services on participating private school students? (Choose primary source from dropdowns, and describe additional sources under \"Other\")."]
[]
[null,null,"Select One"]

{"sheet":"5. Districtwide Strategies","index":5,"n_rows":49,"n_cols":26,"rows_kept":49,"cut":false,"hidden":false,"merged":[[24,2,24,10],[3,2,3,22],[7,11,15,19],[5,10,5,14],[23,19,24,27],[7,2,9,6],[11,3,11,5],[10,7,10,9],[11,7,11,9],[12,3,12,4],[25,2,25,10],[29,17,29,22],[30,17,30,22],[29,2,29,8],[29,9,29,10],[30,9,30,10],[29,14,29,16],[30,14,30,16],[29,11,29,13],[30,11,30,13],[38,2,38,3],[45,4,45,11],[46,4,46,11],[37,2,37,3],[36,2,36,3],[39,2,39,3],[35,17,36,17],[34,13,34,23],[28,9,28,22],[16,14,16,20],[25,11,25,20],[21,14,21,20],[36,4,36,11],[35,22,36,22],[35,19,36,19],[35,20,36,20],[35,21,36,21],[35,13,36,13],[27,2,27,5],[30,2,30,8],[26,2,26,13],[34,2,35,11],[47,4,47,11],[48,4,48,11],[35,23,36,23],[44,4,44,11],[43,4,43,11],[42,4,42,11],[41,4,41,11],[40,4,40,11],[39,4,39,11],[37,4,37,11],[38,4,38,11],[35,14,36,14],[35,15,36,15],[35,16,36,16],[35,18,36,18],[34,12,36,12],[1,1,1,6],[7,7,9,9],[20,11,20,19],[19,2,19,10],[20,2,20,10],[19,11,19,19],[12,7,12,9],[13,7,13,9],[14,7,15,9],[5,2,5,9]]}
[]
[null,{"$f":"valDistrName & \" (\"&valorg4code&\")\"","v":"OrgName (DIST)"}]
[]
[null,null,"FY20 Districtwide Strategy and Planning"]
[]
[".","Step 5.1\nDistrict Strategic Plan\nAll Districts","Please identify the planning document that is the source for your district initiatives for FY20\n (i.e., District Improvement Plan, Strategic Plan, etc.):"]
[]
[null,null,"ESSA requires that the stakeholder groups below be consulted as part of the planning process for use of ESSA funds. Which of the following groups have you consulted with? (check all that apply)",null,null,null,null,"If you have not yet consulted with this group in planning for use of ESSA funds for FY20, when and how do you plan to get their input?",null,null,null,"Resources: Supporting Strategic Planning\n •  Planning for Success is a proven planning model supporting the process in addition to creation of multi- \n     year plans and annual action plans.  All components are available on DESE's website for getting started.\n\n •  RADAR (Resource Allocation and District Action Reports) is a new tool allowing districts to compare\n     their use of resources with up to ten districts, analyze trends over 5 years, and visualize resource data \n     in user-friendly formats.\n\n •   Curriculum collaboration:  To facilitate connections across districts using similar curriculum, the \n      Department has developed a tool showing the ELA/literacy, math, and STE materials in use across the \n      state. If your district’s data do not appear in the tool, be sure to complete this form."]
[]
[]
[null,null,null,"community partners and members",null,null,null,null,null,null,null,null,null,null,null,null,null,null,null,null,null,null,null,null,false,{"$f":"IF(Y11,\"\", \"Red\")","v":"Red"}]
[null,null,null,"families",null,null,null,null,null,null,null,null,null,null,null,null,null,null,null,null,null,null,null,null,false,{"$f":"IF(Y12,\"\", \"Red\")","v":"Red"}]
[null,null,null,"paraprofessionals",null,null,null,null,null,null,null,null,null,null,null,null,null,null,null,null,null,null,null,null,false,"Red"]
[null,null,null,"principals/other school leaders",null,null,null,null,null,null,null,null,null,null,null,null,null,null,null,null,null,null,null,null,false,"Red"]
[null,null,null,"teachers",null,null,null,null,null,null,null,null,null,null,null,null,null,null,null,null,null,null,null,null,false,"Red"]
[]
[]
[]
[]
[null,"Step 5.2\nTitle I Family Engagement\nTitle I Districts","Please describe your plan for having the 2019-20 school year's annual Title I meeting(s) for the families of all students participating in Title I programs to discuss Title I programming, asessments, and opportunities for family engagement."]
[null,null,"When and how do families provide input on the Title I family engagement policies (both school-level and district-level)?"]
[]
[]
[]
[null,"Step 5.3\nEquitable Access to Excellent Educators\nDistricts w/Equity Gaps","Is your district required to complete Step 5.3? \n For districts with a \"Required\" (indicating existing equity gaps per SLE data),  answer the question below.",null,null,null,null,null,null,null,null,{"$f":"IF(valSLE=\"Yes\", \"Required\", \"N/A\")","v":"N/A"}]
[null,null,"Based on the 2018-19 Student Learning Experience (SLE ) Summary Report (updated in July, 2019) using three years of history, your district has district-level and/or school-level equity gaps related to student assignment to experienced, in-field, and/or highly-rated teachers. Please answer the following:\n\n     1. What steps are you taking to address both school-level and district-level equity gaps identified in the SLE report?\n         If the district is choosing to prioritize particular equity gaps, please explain why.   \n "]
[]
[]
[null,null,null,null,null,null,null,null,null,"List at least one and up to three or more sources of data\nUse \"Other\" cell to describe sources of evidence not listed in dropdowns or to add sources."]
[null,"Step 5.4\nData and Evaluation\nAll Districts","List the principal sources of data used by the district to select strategies and activities listed below",null,null,null,null,null,null,"Select One",null,"Select One",null,null,"Select One"]
[null,null,"List the principal data that will be used to track progress and success for strategies and activities listed below",null,null,null,null,null,null,"Select One",null,"Select One",null,null,"Select One"]
[]
[]
[]
[null,"Step 5.5\nSchool Year 2019-2020:  District Activities and Strategies\nAll Districts","Input key initiatives from district improvement plan or other strategic plan to be implemented in the 2019-2020 school year using keywords/short title and then briefly describe strategies/activities.  \n\nPlease list all strategic initiatives for the upcoming year, even those not funded with federal program grant funds.   ",null,null,null,null,null,null,null,null,null,"Is this activity/strat-\negy explicitly connected to district efforts to close equity gaps?","Funding Source\n(Place an \"X\" in all funding sources that support each strategy/activity)"]
[null,null,null,null,null,null,null,null,null,null,null,null,null,"Title I, Part A","Title II, Part A","Title III, Part A","Title IV, Part A","Title V-B\n(REAP Grant)","School Redesign (Level 4 and 5 schools)","IDEA","Perkins","Other Federal ","State and/or Local","Private Funding"]
[null,null,"\n Initiative Keywords or \nShort Title ",null,"Strategies/Activities"]
[null,null,"Example: \nCo-Teaching for English Learners",null,"To meet academic and English language acquisition needs of English learners: (1) hire appropriately licensed and trained educators (ESL and core academic teachers), (2) provide ongoing professional learning and collaboration time for co-teachers, (3) adapting curricular materials to appropriately shelter English and integrate language acquisition, and (4) supporting co-teachers to assess student progress in both academic content and language acquisition. ",null,null,null,null,null,null,null,"Yes","x","x",null,null,null,null,null,null,null,"x"]
[null,null,"Example: \nMath Curriculum Selection",null,"Providing a committee of 8-10 educators and other stakeholders with the time, information, and support they need to (1) review available middle grades math curricula for their quality, alignment to Massachusetts standards, and suitability to the district’s context and (2) select one curriculum for use in grades 6-8 districtwide.",null,null,null,null,null,null,null,"Yes","x","x",null,null,null,null,null,null,null,"x"]
[null,null,"Example: \nSocial-Emotional Learning ",null,"(1) Establishing a district-wide team to develop a system for tracking the effectiveness of behavioral interventions and supports (2) Evaluating research-based SEL curricula in order to implement (3) Partnering with outside consultants to enhance the ESL curriculum by including SEL strategies.  ",null,null,null,null,null,null,null,"No","x",null,"x","x",null,null,null,null,null,"x"]
[null,null,1,null,null,null,null,null,null,null,null,null,"Select One"]
[null,null,2,null,null,null,null,null,null,null,null,null,"Select One"]
[null,null,3,null,null,null,null,null,null,null,null,null,"Select One"]
[null,null,4,null,null,null,null,null,null,null,null,null,"Select One"]
[null,null,5,null,null,null,null,null,null,null,null,null,"Select One"]
[null,null,6,null,null,null,null,null,null,null,null,null,"Select One"]
[null,null,7,null,null,null,null,null,null,null,null,null,"Select One"]
[null,null,8,null,null,null,null,null,null,null,null,null,"Select One"]
[null,null,9,null,null,null,null,null,null,null,null,null,"Select One"]

{"sheet":"data","index":6,"n_rows":410,"n_cols":2,"rows_kept":410,"cut":false,"hidden":true,"merged":[]}
["Select your organization","Org Code"]
["Abby Kelley Foster Charter Public (District)","04450000"]
["Abington","00010000"]
["Academy Of the Pacific Rim Charter Public (District)","04120000"]
["Acton-Boxborough","06000000"]
["Acushnet","00030000"]
["Adams-Cheshire","06030000"]
["Advanced Math and Science Academy Charter (District)","04300000"]
["Agawam","00050000"]
["Alma del Mar Charter School (District)","04090000"]
["Amesbury","00070000"]
["Amherst","00080000"]
["Amherst-Pelham","06050000"]
["Andover","00090000"]
["Argosy Collegiate Charter School (District)","35090000"]
["Arlington","00100000"]
["Ashburnham-Westminster","06100000"]
["Ashland","00140000"]
["Assabet Valley Regional Vocational Technical","08010000"]
["Athol-Royalston","06150000"]
["Atlantis Charter (District)","04910000"]
["Attleboro","00160000"]
["Auburn","00170000"]
["Avon","00180000"]
["Ayer Shirley School District","06160000"]
["Barnstable","00200000"]
["Barnstable Community Horace Mann Charter Public (District)","04270000"]
["Baystate Academy Charter Public School (District)","35020000"]
["Bedford","00230000"]
["Belchertown","00240000"]
["Bellingham","00250000"]
["Belmont","00260000"]
["Benjamin Banneker Charter Public (District)","04200000"]
["Benjamin Franklin Classical Charter Public (District)","04470000"]
["Bentley Academy Charter School (District)","35110000"]
["Berkley","00270000"]
["Berkshire Arts and Technology Charter Public (District)","04140000"]
["Berkshire Hills","06180000"]
["Berlin","00280000"]
["Berlin-Boylston","06200000"]
["Beverly","00300000"]
["Billerica","00310000"]
["Blackstone Valley Regional Vocational Technical","08050000"]
["Blackstone-Millville","06220000"]
["Blue Hills Regional Vocational Technical","08060000"]
["Boston","00350000"]
["Boston Collegiate Charter (District)","04490000"]
["Boston Day and Evening Academy Charter (District)","04240000"]
["Boston Green Academy Horace Mann Charter School (District)","04110000"]
["Boston Preparatory Charter Public (District)","04160000"]
["Boston Renaissance Charter Public (District)","04810000"]
["Bourne","00360000"]
["Boxford","00380000"]
["Boylston","00390000"]
["Braintree","00400000"]
["Brewster","00410000"]
["Bridge Boston Charter School (District)","04170000"]
["Bridgewater-Raynham","06250000"]
["Brimfield","00430000"]
["Bristol County Agricultural","09100000"]
["Bristol-Plymouth Regional Vocational Technical","08100000"]
["Brockton","00440000"]
["Brooke Charter School (District)","04280000"]
["Brookfield","00450000"]
["Brookline","00460000"]
["Burlington","00480000"]
["Cambridge","00490000"]
["Canton","00500000"]
["Cape Cod Lighthouse Charter (District)","04320000"]
["Cape Cod Regional Vocational Technical","08150000"]
["Carlisle","00510000"]
["Carver","00520000"]
["Central Berkshire","06350000"]
["Chelmsford","00560000"]
["Chelsea","00570000"]
["Chesterfield-Goshen","06320000"]
["Chicopee","00610000"]
["Christa McAuliffe Charter Public (District)","04180000"]
["City on a Hill Charter Public School Circuit Street (District)","04370000"]
["City on a Hill Charter Public School Dudley Square (District)","35040000"]
["City on a Hill Charter Public School New Bedford (District)","35070000"]
["Clarksburg","00630000"]
["Clinton","00640000"]
["Codman Academy Charter Public (District)","04380000"]
["Cohasset","00650000"]
["Collegiate Charter School of Lowell (District)","35030000"]
["Community Charter School of Cambridge (District)","04360000"]
["Community Day Charter Public School - Gateway (District)","04260000"]
["Community Day Charter Public School - Prospect (District)","04400000"]
["Community Day Charter Public School - R. Kingman Webster (District)","04310000"]
["Concord","00670000"]
["Concord-Carlisle","06400000"]
["Conservatory Lab Charter (District)","04390000"]
["Conway","00680000"]
["Danvers","00710000"]
["Dartmouth","00720000"]
["Dedham","00730000"]
["Deerfield","00740000"]
["Dennis-Yarmouth","06450000"]
["Dighton-Rehoboth","06500000"]
["Douglas","00770000"]
["Dover","00780000"]
["Dover-Sherborn","06550000"]
["Dracut","00790000"]
["Dudley Street Neighborhood Charter School (District)","04070000"]
["Dudley-Charlton Reg","06580000"]
["Duxbury","00820000"]
["East Bridgewater","00830000"]
["East Longmeadow","00870000"]
["Eastham","00850000"]
["Easthampton","00860000"]
["Easton","00880000"]
["Edgartown","00890000"]
["Edward M. Kennedy Academy for Health Careers (Horace Mann Charter) (District)","04520000"]
["Erving","00910000"]
["Essex North Shore Agricultural and Technical School District","08170000"]
["Everett","00930000"]
["Excel Academy Charter (District)","04100000"]
["Fairhaven","00940000"]
["Fall River","00950000"]
["Falmouth","00960000"]
["Farmington River Reg","06620000"]
["Fitchburg","00970000"]
["Florida","00980000"]
["Four Rivers Charter Public (District)","04130000"]
["Foxborough","00990000"]
["Foxborough Regional Charter (District)","04460000"]
["Framingham","01000000"]
["Francis W. Parker Charter Essential (District)","04780000"]
["Franklin","01010000"]
["Franklin County Regional Vocational Technical","08180000"]
["Freetown-Lakeville","06650000"]
["Frontier","06700000"]
["Gardner","01030000"]
["Gateway","06720000"]
["Georgetown","01050000"]
["Gill-Montague","06740000"]
["Global Learning Charter Public (District)","04960000"]
["Gloucester","01070000"]
["Gosnold","01090000"]
["Grafton","01100000"]
["Granby","01110000"]
["Greater Fall River Regional Vocational Technical","08210000"]
["Greater Lawrence Regional Vocational Technical","08230000"]
["Greater Lowell Regional Vocational Technical","08280000"]
["Greater New Bedford Regional Vocational Technical","08250000"]
["Greenfield","01140000"]
["Groton-Dunstable","06730000"]
["Hadley","01170000"]
["Halifax","01180000"]
["Hamilton-Wenham","06750000"]
["Hampden Charter School of Science (District)","04990000"]
["Hampden Charter School of Science West (District)","35160000"]
["Hampden-Wilbraham","06800000"]
["Hampshire","06830000"]
["Hancock","01210000"]
["Hanover","01220000"]
["Harvard","01250000"]
["Hatfield","01270000"]
["Haverhill","01280000"]
["Hawlemont","06850000"]
["Helen Y. Davis Leadership Academy Charter Public (District)","04190000"]
["Hill View Montessori Charter Public (District)","04550000"]
["Hilltown Cooperative Charter Public (District)","04500000"]
["Hingham","01310000"]
["Holbrook","01330000"]
["Holland","01350000"]
["Holliston","01360000"]
["Holyoke","01370000"]
["Holyoke Community Charter (District)","04530000"]
["Hopedale","01380000"]
["Hopkinton","01390000"]
["Hudson","01410000"]
["Hull","01420000"]
["Innovation Academy Charter (District)","04350000"]
["Institutional Schools","03700000"]
["Ipswich","01440000"]
["KIPP Academy Boston Charter School (District)","04630000"]
["KIPP Academy Lynn Charter (District)","04290000"]
["King Philip","06900000"]
["Kingston","01450000"]
["Lanesborough","01480000"]
["Lawrence","01490000"]
["Lawrence Family Development Charter (District)","04540000"]
["Lee","01500000"]
["Leicester","01510000"]
["Lenox","01520000"]
["Leominster","01530000"]
["Leverett","01540000"]
["Lexington","01550000"]
["Libertas Academy Charter School (District)","35140000"]
["Lincoln","01570000"]
["Lincoln-Sudbury","06950000"]
["Littleton","01580000"]
["Longmeadow","01590000"]
["Lowell","01600000"]
["Lowell Community Charter Public (District)","04560000"]
["Lowell Middlesex Academy Charter (District)","04580000"]
["Ludlow","01610000"]
["Lunenburg","01620000"]
["Lynn","01630000"]
["Lynnfield","01640000"]
["MATCH Charter Public School (District)","04690000"]
["Ma Academy for Math and Science","04680000"]
["Malden","01650000"]
["Manchester Essex Regional","06980000"]
["Mansfield","01670000"]
["Map Academy Charter School (District)","35170000"]
["Marblehead","01680000"]
["Marblehead Community Charter Public (District)","04640000"]
["Marion","01690000"]
["Marlborough","01700000"]
["Marshfield","01710000"]
["Martha's Vineyard","07000000"]
["Martha's Vineyard Charter (District)","04660000"]
["Martin Luther King Jr. Charter School of Excellence (District)","04920000"]
["Masconomet","07050000"]
["Mashpee","01720000"]
["Massachusetts Virtual Academy at Greenfield Commonwealth Virtual District","39010000"]
["Mattapoisett","01730000"]
["Maynard","01740000"]
["Medfield","01750000"]
["Medford","01760000"]
["Medway","01770000"]
["Melrose","01780000"]
["Mendon-Upton","07100000"]
["Methuen","01810000"]
["Middleborough","01820000"]
["Middleton","01840000"]
["Milford","01850000"]
["Millbury","01860000"]
["Millis","01870000"]
["Milton","01890000"]
["Minuteman Regional Vocational Technical","08300000"]
["Mohawk Trail","07170000"]
["Monomoy Regional School District","07120000"]
["Monson","01910000"]
["Montachusett Regional Vocational Technical","08320000"]
["Mount Greylock","07150000"]
["Mystic Valley Regional Charter (District)","04700000"]
["Nahant","01960000"]
["Nantucket","01970000"]
["Narragansett","07200000"]
["Nashoba","07250000"]
["Nashoba Valley Regional Vocational Technical","08520000"]
["Natick","01980000"]
["Nauset","06600000"]
["Needham","01990000"]
["Neighborhood House Charter (District)","04440000"]
["New Bedford","02010000"]
["New Heights Charter School of Brockton (District)","35130000"]
["New Salem-Wendell","07280000"]
["Newburyport","02040000"]
["Newton","02070000"]
["Norfolk","02080000"]
["Norfolk County Agricultural","09150000"]
["North Adams","02090000"]
["North Andover","02110000"]
["North Attleborough","02120000"]
["North Brookfield","02150000"]
["North Middlesex","07350000"]
["North Reading","02170000"]
["Northampton","02100000"]
["Northampton-Smith Vocational Agricultural","04060000"]
["Northboro-Southboro","07300000"]
["Northborough","02130000"]
["Northbridge","02140000"]
["Northeast Metropolitan Regional Vocational Technical","08530000"]
["Northern Berkshire Regional Vocational Technical","08510000"]
["Norton","02180000"]
["Norwell","02190000"]
["Norwood","02200000"]
["Oak Bluffs","02210000"]
["Old Colony Regional Vocational Technical","08550000"]
["Old Rochester","07400000"]
["Old Sturbridge Academy Charter Public School (District)","35150000"]
["Orange","02230000"]
["Orleans","02240000"]
["Oxford","02260000"]
["Palmer","02270000"]
["Pathfinder Regional Vocational Technical","08600000"]
["Paulo Freire Social Justice Charter School (District)","35010000"]
["Peabody","02290000"]
["Pelham","02300000"]
["Pembroke","02310000"]
["Pentucket","07450000"]
["Petersham","02340000"]
["Phoenix Academy Public Charter High School Springfield (District)","35080000"]
["Phoenix Charter Academy (District)","04930000"]
["Pioneer Charter School of Science (District)","04940000"]
["Pioneer Charter School of Science II (PCSS-II) (District)","35060000"]
["Pioneer Valley","07500000"]
["Pioneer Valley Chinese Immersion Charter (District)","04970000"]
["Pioneer Valley Performing Arts Charter Public (District)","04790000"]
["Pittsfield","02360000"]
["Plainville","02380000"]
["Plymouth","02390000"]
["Plympton","02400000"]
["Prospect Hill Academy Charter (District)","04870000"]
["Provincetown","02420000"]
["Quabbin","07530000"]
["Quaboag Regional","07780000"]
["Quincy","02430000"]
["Ralph C Mahar","07550000"]
["Randolph","02440000"]
["Reading","02460000"]
["Revere","02480000"]
["Richmond","02490000"]
["Rising Tide Charter Public (District)","04830000"]
["River Valley Charter (District)","04820000"]
["Rochester","02500000"]
["Rockland","02510000"]
["Rockport","02520000"]
["Rowe","02530000"]
["Roxbury Preparatory Charter (District)","04840000"]
["Sabis International Charter (District)","04410000"]
["Salem","02580000"]
["Salem Academy Charter (District)","04850000"]
["Sandwich","02610000"]
["Saugus","02620000"]
["Savoy","02630000"]
["Scituate","02640000"]
["Seekonk","02650000"]
["Seven Hills Charter Public (District)","04860000"]
["Sharon","02660000"]
["Shawsheen Valley Regional Vocational Technical","08710000"]
["Sherborn","02690000"]
["Shrewsbury","02710000"]
["Shutesbury","02720000"]
["Silver Hill Horace Mann Charter (District)","04770000"]
["Silver Lake","07600000"]
["Sizer School: A North Central Charter Essential (District)","04740000"]
["Somerset","02730000"]
["Somerset Berkley Regional School District","07630000"]
["Somerville","02740000"]
["South Hadley","02780000"]
["South Middlesex Regional Vocational Technical","08290000"]
["South Shore Charter Public (District)","04880000"]
["South Shore Regional Vocational Technical","08730000"]
["Southampton","02750000"]
["Southborough","02760000"]
["Southbridge","02770000"]
["Southeastern Regional Vocational Technical","08720000"]
["Southern Berkshire","07650000"]
["Southern Worcester County Regional Vocational Technical","08760000"]
["Southwick-Tolland-Granville Regional School District","07660000"]
["Spencer-E Brookfield","07670000"]
["Springfield","02810000"]
["Springfield Preparatory Charter School (District)","35100000"]
["Stoneham","02840000"]
["Stoughton","02850000"]
["Sturbridge","02870000"]
["Sturgis Charter Public (District)","04890000"]
["Sudbury","02880000"]
["Sunderland","02890000"]
["Sutton","02900000"]
["Swampscott","02910000"]
["Swansea","02920000"]
["TEC Connections Academy Commonwealth Virtual School District","39020000"]
["Tantasqua","07700000"]
["Taunton","02930000"]
["Tewksbury","02950000"]
["Tisbury","02960000"]
["Topsfield","02980000"]
["Tri-County Regional Vocational Technical","08780000"]
["Triton","07730000"]
["Truro","03000000"]
["Tyngsborough","03010000"]
["UP Academy Charter School of Boston (District)","04800000"]
["UP Academy Charter School of Dorchester (District)","35050000"]
["Up-Island Regional","07740000"]
["Upper Cape Cod Regional Vocational Technical","08790000"]
["Uxbridge","03040000"]
["Veritas Preparatory Charter School (District)","04980000"]
["Wachusett","07750000"]
["Wakefield","03050000"]
["Wales","03060000"]
["Walpole","03070000"]
["Waltham","03080000"]
["Ware","03090000"]
["Wareham","03100000"]
["Watertown","03140000"]
["Wayland","03150000"]
["Webster","03160000"]
["Wellesley","03170000"]
["Wellfleet","03180000"]
["West Boylston","03220000"]
["West Bridgewater","03230000"]
["West Springfield","03320000"]
["Westborough","03210000"]
["Westfield","03250000"]
["Westford","03260000"]
["Westhampton","03270000"]
["Weston","03300000"]
["Westport","03310000"]
["Westwood","03350000"]
["Weymouth","03360000"]
["Whately","03370000"]
["Whitman-Hanson","07800000"]
["Whittier Regional Vocational Technical","08850000"]
["Williamsburg","03400000"]
["Williamstown","03410000"]
["Wilmington","03420000"]
["Winchendon","03430000"]
["Winchester","03440000"]
["Winthrop","03460000"]
["Woburn","03470000"]
["Worcester","03480000"]
["Worthington","03490000"]
["Wrentham","03500000"]

{"sheet":"ForImport","index":7,"n_rows":2,"n_cols":12,"rows_kept":2,"cut":false,"hidden":true,"merged":[]}
["org8code","centralofficepersonnel","community-based partners","communitymembers","paraprofessionals","principals_schooladministrators","schoolcouncil","schoolcounselors","students","teachers","town_cityofficials","others"]
[{"$f":"valorg8code","v":{"$error":"#NAME?"}},true,false,false,false,false,false,false,false,true,false,false]

{"sheet":"6. Title I, A & D Narrative","index":8,"n_rows":66,"n_cols":20,"rows_kept":66,"cut":false,"hidden":false,"merged":[[1,1,1,7],[10,2,10,15],[27,12,27,13],[11,2,11,3],[11,4,11,11],[11,12,11,13],[27,8,27,9],[3,2,3,4],[5,2,5,14],[22,4,22,11],[12,12,12,13],[22,12,22,13],[17,4,17,11],[3,5,3,12],[12,2,12,3],[26,10,26,11],[20,12,20,13],[12,15,12,16],[10,1,11,1],[25,1,26,1],[29,3,29,7],[26,2,26,7],[6,2,6,5],[13,4,13,11],[13,12,13,13],[12,4,12,11],[19,4,19,11],[19,12,19,13],[28,3,28,7],[28,8,28,9],[21,4,21,11],[21,12,21,13],[25,2,25,15],[27,3,27,7],[26,14,26,15],[26,12,26,13],[17,12,17,13],[18,4,18,11],[18,12,18,13],[20,4,20,11],[57,2,57,9],[40,2,40,4],[42,2,42,14],[40,5,40,14],[51,2,52,9],[54,10,55,13],[51,10,51,11],[52,10,52,11],[54,2,55,9],[49,4,49,8],[44,4,44,8],[44,9,44,10],[44,11,44,12],[44,13,44,14],[45,13,45,14],[46,13,46,14],[47,13,47,14],[48,13,48,14],[49,13,49,14],[49,9,49,10],[45,11,45,12],[46,11,46,12],[47,11,47,12],[12,17,12,18],[11,15,11,16],[11,17,11,18],[35,8,35,9],[35,14,35,15],[26,8,26,9],[27,10,27,11],[27,14,27,15],[28,14,28,15],[29,8,29,9],[29,14,29,15],[15,4,15,11],[15,12,15,13],[16,4,16,11],[16,12,16,13],[31,3,31,7],[30,14,30,15],[32,14,32,15],[14,12,14,13],[14,4,14,11],[33,14,33,15],[33,8,33,9],[31,14,31,15],[32,3,32,7],[30,3,30,7],[33,3,33,7],[31,8,31,9],[32,8,32,9],[36,8,36,9],[30,8,30,9],[34,8,34,9],[40,1,41,1],[44,2,49,3],[37,8,37,9],[36,14,36,15],[35,3,35,7],[34,3,34,7],[34,14,34,15],[48,11,48,12],[49,11,49,12],[45,9,45,10],[46,9,46,10],[47,9,47,10],[48,9,48,10],[37,3,37,7],[36,3,36,7],[45,4,45,8],[46,4,46,8],[47,4,47,8],[48,4,48,8],[37,14,37,15]]}
[]
[null,{"$f":"valDistrName & \" (\"&valorg4code&\")\"","v":"OrgName (DIST)"}]
[]
[null,null,"Title I, Part A",null,null,"Improving Basic Programs (Fund Code 305)"]
[]
[null,null,"   Program Purpose:\n   To provide all children significant opportunity to receive a fair, equitable, and high-quality education, and to close educational achievement gaps."]
[]
[]
[]
[]
[null,"Step 6.1\nTitle I, Part A-funded activities from Tab 5. District Strategies\nTitle I Districts","From Tab 5:  District Activities and Strategies\nColumns A & B will populate automatically from Tab 5, Step 5.5, for any activity that you indicate includes Title I, Part A funding.  Starting with Column C, describe only those activities from each strategy/activity that will be funded in whole or in part with Title I, Part A funds."]
[null,null,"A",null,"B",null,null,null,null,null,null,null,"C",null,"D","E",null,"F",null,"G"]
[null,null,"Strategy/Activity",null,"Description ",null,null,null,null,null,null,null,"Briefly describe specific activities funded by Title I based on assessment of needs",null,"Grades served by this activity","What data prompted this activity?\n(Select at least one source for each activity; report additional sources/explanation in \"Other\" box at row's end)",null,"What data will you use to determine progress and attainment of goals?\n(Select at least one source for each activity; report additional sources/explanation in \"Other\" box at row's end)",null,"If  you selected \"Other\" in Column E or F,  please describe data that you will use here"]
[null,{"$f":"IF(AND(E14=\"\",D14=\"\"),1,0)","v":1},1,{"$f":"IF(ISBLANK('5. Districtwide Strategies'!D41),\"\",IF('5. Districtwide Strategies'!N41<>\"\",'5. Districtwide Strategies'!D41,\"\"))","v":""},{"$f":"IF(ISBLANK('5. Districtwide Strategies'!E41),\"\",IF('5. Districtwide Strategies'!N41<>\"\",'5. Districtwide Strategies'!E41,\"\"))","v":""},null,null,null,null,null,null,null,null,null,null,"Select One","Select One","Select One","Select One"]
[null,{"$f":"IF(AND(E15=\"\",D15=\"\"),1,0)","v":1},2,{"$f":"IF(ISBLANK('5. Districtwide Strategies'!D42),\"\",IF('5. Districtwide Strategies'!N42<>\"\",'5. Districtwide Strategies'!D42,\"\"))","v":""},{"$f":"IF(ISBLANK('5. Districtwide Strategies'!E42),\"\",IF('5. Districtwide Strategies'!N42<>\"\",'5. Districtwide Strategies'!E42,\"\"))","v":""},null,null,null,null,null,null,null,null,null,null,"Select One","Select One","Select One","Select One"]
[null,1,3,{"$f":"IF(ISBLANK('5. Districtwide Strategies'!D43),\"\",IF('5. Districtwide Strategies'!N43<>\"\",'5. Districtwide Strategies'!D43,\"\"))","v":""},{"$f":"IF(ISBLANK('5. Districtwide Strategies'!E43),\"\",IF('5. Districtwide Strategies'!N43<>\"\",'5. Districtwide Strategies'!E43,\"\"))","v":""},null,null,null,null,null,null,null,null,null,null,"Select One","Select One","Select One","Select One"]
[null,1,4,{"$f":"IF(ISBLANK('5. Districtwide Strategies'!D44),\"\",IF('5. Districtwide Strategies'!N44<>\"\",'5. Districtwide Strategies'!D44,\"\"))","v":""},{"$f":"IF(ISBLANK('5. Districtwide Strategies'!E44),\"\",IF('5. Districtwide Strategies'!N44<>\"\",'5. Districtwide Strategies'!E44,\"\"))","v":""},null,null,null,null,null,null,null,null,null,null,"Select One","Select One","Select One","Select One"]
[null,1,5,{"$f":"IF(ISBLANK('5. Districtwide Strategies'!D45),\"\",IF('5. Districtwide Strategies'!N45<>\"\",'5. Districtwide Strategies'!D45,\"\"))","v":""},{"$f":"IF(ISBLANK('5. Districtwide Strategies'!E45),\"\",IF('5. Districtwide Strategies'!N45<>\"\",'5. Districtwide Strategies'!E45,\"\"))","v":""},null,null,null,null,null,null,null,null,null,null,"Select One","Select One","Select One","Select One"]
[null,1,6,{"$f":"IF(ISBLANK('5. Districtwide Strategies'!D46),\"\",IF('5. Districtwide Strategies'!N46<>\"\",'5. Districtwide Strategies'!D46,\"\"))","v":""},{"$f":"IF(ISBLANK('5. Districtwide Strategies'!E46),\"\",IF('5. Districtwide Strategies'!N46<>\"\",'5. Districtwide Strategies'!E46,\"\"))","v":""},null,null,null,null,null,null,null,null,null,null,"Select One","Select One","Select One","Select One"]
[null,1,7,{"$f":"IF(ISBLANK('5. Districtwide Strategies'!D47),\"\",IF('5. Districtwide Strategies'!N47<>\"\",'5. Districtwide Strategies'!D47,\"\"))","v":""},{"$f":"IF(ISBLANK('5. Districtwide Strategies'!E47),\"\",IF('5. Districtwide Strategies'!N47<>\"\",'5. Districtwide Strategies'!E47,\"\"))","v":""},null,null,null,null,null,null,null,null,null,null,"Select One","Select One","Select One","Select One"]
[null,1,8,{"$f":"IF(ISBLANK('5. Districtwide Strategies'!D48),\"\",IF('5. Districtwide Strategies'!N48<>\"\",'5. Districtwide Strategies'!D48,\"\"))","v":""},{"$f":"IF(ISBLANK('5. Districtwide Strategies'!E48),\"\",IF('5. Districtwide Strategies'!N48<>\"\",'5. Districtwide Strategies'!E48,\"\"))","v":""},null,null,null,null,null,null,null,null,null,null,"Select One","Select One","Select One","Select One"]
[null,{"$f":"IF(AND(E22=\"\",D22=\"\"),1,0)","v":1},9,{"$f":"IF(ISBLANK('5. Districtwide Strategies'!D49),\"\",IF('5. Districtwide Strategies'!N49<>\"\",'5. Districtwide Strategies'!D49,\"\"))","v":""},{"$f":"IF(ISBLANK('5. Districtwide Strategies'!E49),\"\",IF('5. Districtwide Strategies'!N49<>\"\",'5. Districtwide Strategies'!E49,\"\"))","v":""},null,null,null,null,null,null,null,null,null,null,"Select One","Select One","Select One","Select One"]
[null,1,10,{"$f":"IF(ISBLANK('5. Districtwide Strategies'!D50),\"\",IF('5. Districtwide Strategies'!N50<>\"\",'5. Districtwide Strategies'!D50,\"\"))","v":""},{"$f":"IF(ISBLANK('5. Districtwide Strategies'!E50),\"\",IF('5. Districtwide Strategies'!N50<>\"\",'5. Districtwide Strategies'!E50,\"\"))","v":""},null,null,null,null,null,null,null,null,null,null,"Select One","Select One","Select One","Select One"]
[]
[]
[null,"Step 6.2\nTitle I, Part A-funded activities not included in Tab 5. District Strategies\nTitle I Districts","Title I-funded activities not listed above from Tab 5.\nStarting with Column A, describe  activities not listed above that will be funded in whole or in part with Title I , Part A funds. "]
[null,null,"Describe activities funded by Title I not listed above",null,null,null,null,null,"Grades served by these activities",null,"What data prompted this activity?\n(Select at least one source for each activity; report additional sources/explanation in \"Other\" box at row's end)",null,"What data will you use to determine progress and attainment of goals?\n(Select at least one source for each activity; report additional sources/explanation in \"Other\" box at row's end)",null,"If  you selected \"Other\" in Column C or D,  please describe data that you will use here"]
[null,null,null,"A",null,null,null,null,"B",null,"C",null,"D",null,"E"]
[null,null,1,null,null,null,null,null,null,null,"Select One","Select One","Select One","Select One"]
[null,null,2,null,null,null,null,null,null,null,"Select One","Select One","Select One","Select One"]
[null,null,3,null,null,null,null,null,null,null,"Select One","Select One","Select One","Select One"]
[null,null,4,null,null,null,null,null,null,null,"Select One","Select One","Select One","Select One"]
[null,null,5,null,null,null,null,null,null,null,"Select One","Select One","Select One","Select One"]
[null,null,6,null,null,null,null,null,null,null,"Select One","Select One","Select One","Select One"]
[null,null,7,null,null,null,null,null,null,null,"Select One","Select One","Select One","Select One"]
[null,null,8,null,null,null,null,null,null,null,"Select One","Select One","Select One","Select One"]
[null,null,9,null,null,null,null,null,null,null,"Select One","Select One","Select One","Select One"]
[null,null,10,null,null,null,null,null,null,null,"Select One","Select One","Select One","Select One"]
[]
[]
[null,"Step 6.3\nTitle I, Part D, Subpart 2\nDistricts with residential facilities providing services N or D children and youth ","Title I, Part D\nSubpart 2",null,null,"Prevention and Intervention Programs for Children and Youth Who Are Neglected, Delinquent or At Risk"]
[]
[null,null,"   Program Purpose:\n   (1) to improve educational services for children and youth in local, tribal, and State institutions for neglected or delinquent children and youth so that such children and youth \n         have the opportunity to meet the same challenging State academic standards that all children in the State are expected to meet;\n   (2) to provide such children and youth with the services needed to make a successful transition from institutionalization to further schooling or employment;  and\n   (3) to prevent at-risk youth from dropping out of school, and to provide dropouts, and children and youth returning  from correctional facilities or institutions for neglected or\n         delinquent children and youth, with a support system to  ensure their continued education and the involvement of their families and communities.\n  "]
[]
[null,null,"Please list and provide contact information for the residential facility or facilities in your school district",null,"Name of Facility",null,null,null,null,"Name and Title of Contact",null,"Email Address",null,"Phone Number"]
[]
[]
[]
[]
[]
[null,null," "]
[null,null,"Have you uploaded the following documents regarding any residential facility providing services to neglected or delinquent children and youth in your district with this application as an attachment in EdGrants: \n\n(If your district exceeds space limitations for uploading documents in EdGrants, please contact your DESE grants liaison for alternatives).",null,null,null,null,null,null,null,"Formal agreement"]
[null,null,null,null,null,null,null,null,null,null,"Budget showing how Title I \nPart D-2 funds will be spent"]
[]
[null,null,"\nIf you have not uploaded your formal agreement and/or budget, please explain."]
[]
[]
[null,null,"Referring to your formal agreement for services for FY20, please check all information contained in the agreement:"]
[]
[null,null,null,"Description of all services to be provided to neglected or delinquent youth"]
[null,null,null,"How participating schools and facilities will coordinate work with neglected or delinquent youth, including coordination with social, health and other service providers"]
[null,null,null,"How transitions will be coordinated between schools and facilities for children returning from correctional facilities"]
[null,null,null,"How students with different characteristics and needs will be served, including making the facilities aware of existing individualized education programs"]
[null,null,null,"Any partnerships with local business to provide training and other services for participating students"]
[null,null,null,"How the program will involve parents in improvement efforts for participants"]
[null,null,null,"How this program will be coordinated with other federal, state and local programs serving at-risk children and youth"]

{"sheet":"7. Title I, A Reservations","index":9,"n_rows":43,"n_cols":8,"rows_kept":43,"cut":false,"hidden":false,"merged":[[8,9,43,16],[20,4,20,5],[29,1,31,1],[40,3,40,6],[29,3,29,7],[31,3,31,5],[35,3,35,5],[37,3,37,5],[39,3,39,5],[25,3,25,5],[21,3,21,5],[26,3,26,7],[42,3,42,6],[1,1,1,5],[2,6,2,7],[12,3,12,5],[13,3,13,5],[5,1,5,4],[7,1,7,3],[3,1,3,7],[5,6,5,7],[8,3,9,7],[10,3,10,5],[11,3,11,5],[8,1,10,1]]}
[]
[null,{"$f":"valDistrName & \" (\"&valorg4code&\")\"","v":"OrgName (DIST)"}]
[]
[null,"FY20 Title I District Reservation Worksheet "]
[]
[null,null,null,null,null,"Title I Grant Allocation:",{"$f":"valAllocationFlexT1","v":0}]
[]
[]
[null,"Step 7.1",null,"Enter district reservations as appropriate"]
[]
[null,null,null,"Equitable participation for private school students (populated from private schools worksheet)",null,null,{"$f":"valPrivateSchoolT1","v":0},{"$f":"IF($G$6=0,0,G11/$G$6)","v":0}]
[null,null,null,"Family engagement (at least 1% required for districts with allocations of $500,000 or greater)",null,null,null,{"$f":"IF($G$6=0,0,G12/$G$6)","v":0}]
[null,null,null,"Services for locally operated institutions for neglected or delinquent children and youth (districts with local N/D institutions only)",null,null,null,0]
[null,null,null,"Administrative services (optional)",null,null,null,0]
[null,null,null,"Preschool programs (optional)",null,null,null,0]
[null,null,null,"Services for homeless students (see TIP, please describe any non-Title I services for homeless students below)",null,null,null,0]
[null,null,null,"  District enrollment: homeless students (Spring 2019):",null,{"$f":" valHomeless","v":"HOMELESS, K-12"}]
[null,null,null,"Foster care transportation (optional)",null,null,null,0]
[null,null,null,"Indirect costs (optional, but may not exceed district rate.  See budget tab for more information)",null,null,null,0]
[null,null,null,"MTRS (optional)",null,null,null,0]
[null,null,null,"Other (describe)",null,null,null,0]
[null,null,null,"TOTAL reservation ",null,null,{"$f":"SUM(G11:G21)","v":0},0]
[]
[null,null,null,"Balance remaining for school allocations:",null,null,{"$f":"G6-G22","v":0}]
[]
[null,null,null,"Please describe any non-Title-I services that the district is providing to students who are homeless to meet assessed needs:"]
[]
[]
[]
[null,"Step 7.2",null,"Confirm minimum per-pupil amount for school allocations"]
[]
[null,null,null,"Total number of children from low-income families districtwide",null,null,{"$f":"TotalLowInc","v":0}]
[]
[null,null,"*","Minimum per pupil amount for districts serving any school below 35% poverty ",null,null,{"$f":"IF('8. Title I, A School Funding'!U160=0,0,IF('8. Title I, A School Funding'!U160<>valSwitchFormula, (G6/G32)*1.25,\"\"))","v":0}]
[]
[null,null,"*","Minimum per pupil amount for districts serving only schools at/above 35% poverty\n",null,null,{"$f":"IF('8. Title I, A School Funding'!U160=0,0,IF(valSwitchFormula='8. Title I, A School Funding'!U160,G24/G32,\"\"))","v":0}]
[]
[null,null,null,"Districts serving only schools at/above 35% poverty may select their own district-determined amount:",null,null,0]
[]
[null,null,null," (If a district-determined amount was selected, please describe method below)"]
[]
[]
[null,null,"*","Note: Minimum per pupil calculations are not complete until program type (Column 3b/Title I School Funding worksheet, Tab 8) has been selected for all served schools. "]

{"sheet":"8. Title I, A School Funding","index":10,"n_rows":249,"n_cols":21,"rows_kept":249,"cut":false,"hidden":false,"merged":[[4,3,4,5],[5,3,5,6],[5,9,5,11],[6,3,6,5],[180,1,196,14],[13,4,15,4],[13,14,15,14],[10,10,11,14],[13,3,15,3],[13,1,14,2],[13,10,15,10],[165,1,179,14],[160,2,160,14],[247,1,247,21],[248,1,248,21],[197,1,232,21],[1,1,1,5],[9,1,9,7],[158,1,158,7],[13,6,15,6],[13,13,15,13],[13,5,15,5],[13,7,15,7],[13,8,15,8],[13,9,15,9],[13,12,15,12],[13,11,15,11],[4,13,4,14],[9,10,9,14]]}
[]
[null,{"$f":"valDistrName & \" (\"&valorg4code&\")\"","v":"OrgName (DIST)"}]
[null,"FY20 Title I School Funding Worksheet"]
[]
[null,null,"SW","Schoolwide Program",null,null,null,null,null,"     District-Wide Low-Income Percentage:",null,null,null,{"$f":"IFERROR(TotalLowInc/J159,\"\")","v":""}]
[null,null,"TA","Targeted Assistance Program",null,null,null,null,null,"     Minimum Per Pupil Amount:",null,null,{"$f":"IF(PPMinbelow<>\"\", PPMinbelow,PPMinabove)","v":0}]
[null,null,"NT","Non-Title I "]
[null,null,"CL","Closed School"]
[]
[null,"Step 8.1: Select low-income data source & click OK \n(Default low-income enrollment is March Eco Dis x 1.6)\nIf you select \"Other\" for your district's low income poverty source, explain your method in Step 8.4\nand contact your liaison to modify your workbook to allow insertion of low-income enrollment.",null,null,null,null,null,null,null,null,"\n                                 Step 8.2: Method of qualifying Title I Schools\nIf a school you want to serve with Title I funds does not meet the poverty threshold using any of the qualifying methods, consider requesting an  Ed-Flex waiver to reach that school.  Contact your liaison to discuss a waiver.\n"]
[]
[]
[]
[null,"Step 8.3: \nEnter FY20 Title I status in column 3b and additional data for district schools  \nDo Not Cut and Paste",null,"Grand-fathered Schools\n\n(place \"x\" in box, see Tip) ","Prioritized HS with >50% low-income enrollment\n (place \"x\" in box, see Tip)","Grade Span Grouping ","Grades Served by School","FY19 Program Type ","FY20 Program Type ","Total # of Children Enrolled in School, \nK-12 ","Total # of Children From Low-Income Families,\nK-12","Maximum Low-Income Enrollment,\nK-12 \n(may not exceed Col. 4, see Tip)","Percent Low-Income,\nK-12 ","Enter Allocation for Each Title I School \n","Per Pupil Amount \n(Col. 8/Col. 6, see above box for min. per pupil amount)"]
[]
[]
[null,"School Name 1(a)","School Code 1(b)","1(c)","1(d)","2(a)","2(b)","3(a)","3(b)","4","5","6","7","8","9","Copy to Master","Grade Order","75% rule","Sort Order",null,"Switchformula"]
[null,null,null,null,null,null,null,null,null,null,null,{"$f":"IF(K18>J18, J18,K18)","v":0},{"$f":"IFERROR(L18/J18,\" \")","v":" "}]
[null,null,null,null,null,null,null,null,null,null,null,{"$f":"IF(K19>J19, J19,K19)","v":0},{"$f":"IFERROR(L19/J19,\" \")","v":" "},null,{"$f":"IF(OR(L19=\"\",N19=\"\"),\"\",IFERROR(N19/L19,\"\"))","v":""},{"$f":"IF(C19=\"\",0,1)","v":0},7,1,17,{"$f":"(K19/J19)*100","v":{"$error":"#DIV/0!"}},{"$f":"IF(OR(C19=\"\",I19=\"NT\",I19=\"\",I19=\"CL\"),\"\",IF(OR(I19=\"SW\", I19=\"TA\"),IF(M19>=0.35,1,0),0))","v":""}]
[null,null,null,null,null,null,null,null,null,null,null,0," ",null,"",0,2,1,121.12676056338027,{"$error":"#DIV/0!"},""]
[null,null,null,null,null,null,null,null,null,null,null,0," ",null,"",0,5,1,96.326530612244895,{"$error":"#DIV/0!"},""]
[null,null,null,null,null,null,null,null,null,null,null,0," ",null,"",0,5,1,88.132911392405063,{"$error":"#DIV/0!"},""]
[null,null,null,null,null,null,null,null,null,null,null,0," ",null,"",0,6,1,81.948424068767906,{"$error":"#DIV/0!"},""]
[null,null,null,null,null,null,null,null,null,null,null,0," ",null,"",0,5,1,81.156069364161851,{"$error":"#DIV/0!"},""]
[null,null,null,null,null,null,null,null,null,null,null,0," ",null,"",0,5,1,77.672955974842779,{"$error":"#DIV/0!"},""]
[null,null,null,null,null,null,null,null,null,null,null,0," ",null,"",0,5,0,5,{"$error":"#DIV/0!"},""]
[null,null,null,null,null,null,null,null,null,null,null,0," ",null,"",0,3,0,3,{"$error":"#DIV/0!"},""]
[null,null,null,null,null,null,null,null,null,null,null,{"$f":"IF(K28>J28, J28,K28)","v":0},{"$f":"IFERROR(L28/J28,\" \")","v":" "},null,{"$f":"IF(OR(L28=\"\",N28=\"\"),\"\",IFERROR(N28/L28,\"\"))","v":""},{"$f":"IF(C28=\"\",0,1)","v":0},7,1,null,{"$f":"(K28/J28)*100","v":{"$error":"#DIV/0!"}},{"$f":"IF(OR(C28=\"\",I28=\"NT\",I28=\"\",I28=\"CL\"),\"\",IF(OR(I28=\"SW\", I28=\"TA\"),IF(M28>=0.35,1,0),0))","v":""}]
[null,null,null,null,null,null,null,null,null,null,null,0," ",null,"",0,3,1,null,{"$error":"#DIV/0!"},""]
[null,null,null,null,null,null,null,null,null,null,null,0," ",null,"",0,5,1,null,{"$error":"#DIV/0!"},""]
[null,null,null,null,null,null,null,null,null,null,null,0," ",null,"",0,5,1,null,{"$error":"#DIV/0!"},""]
[null,null,null,null,null,null,null,null,null,null,null,0," ",null,"",0,4,1,null,{"$error":"#DIV/0!"},""]
[null,null,null,null,null,null,null,null,null,null,null,0," ",null,"",0,6,1,null,{"$error":"#DIV/0!"},""]
[null,null,null,null,null,null,null,null,null,null,null,0," ",null,"",0,5,1,null,{"$error":"#DIV/0!"},""]
[null,null,null,null,null,null,null,null,null,null,null,0," ",null,"",0,4,1,null,{"$error":"#DIV/0!"},""]
[null,null,null,null,null,null,null,null,null,null,null,0," ",null,"",0,5,1,null,{"$error":"#DIV/0!"},""]
[null,null,null,null,null,null,null,null,null,null,null,0," ",null,"",0,6,1,null,{"$error":"#DIV/0!"},""]
[null,null,null,null,null,null,null,null,null,null,null,0," ",null,"",0,3,1,null,{"$error":"#DIV/0!"},""]
[null,null,null,null,null,null,null,null,null,null,null,0," ",null,"",0,6,1,null,{"$error":"#DIV/0!"},""]
[null,null,null,null,null,null,null,null,null,null,null,0," ",null,"",0,6,1,null,{"$error":"#DIV/0!"},""]
[null,null,null,null,null,null,null,null,null,null,null,0," ",null,"",0,6,1,null,{"$error":"#DIV/0!"},""]
[null,null,null,null,null,null,null,null,null,null,null,0," ",null,"",0,3,1,null,{"$error":"#DIV/0!"},""]
[null,null,null,null,null,null,null,null,null,null,null,0," ",null,"",0,3,1,null,{"$error":"#DIV/0!"},""]
[null,null,null,null,null,null,null,null,null,null,null,0," ",null,"",0,2,1,null,{"$error":"#DIV/0!"},""]
[null,null,null,null,null,null,null,null,null,null,null,0," ",null,"",0,7,1,null,{"$error":"#DIV/0!"},""]
[null,null,null,null,null,null,null,null,null,null,null,0," ",null,"",0,6,1,null,{"$error":"#DIV/0!"},""]
[null,null,null,null,null,null,null,null,null,null,null,0," ",null,"",0,6,1,null,{"$error":"#DIV/0!"},""]
[null,null,null,null,null,null,null,null,null,null,null,0," ",null,"",0,6,1,null,{"$error":"#DIV/0!"},""]
[null,null,null,null,null,null,null,null,null,null,null,0," ",null,"",0,4,1,null,{"$error":"#DIV/0!"},""]
[null,null,null,null,null,null,null,null,null,null,null,0," ",null,"",0,6,1,null,{"$error":"#DIV/0!"},""]
[null,null,null,null,null,null,null,null,null,null,null,{"$f":"IF(K51>J51, J51,K51)","v":0},{"$f":"IFERROR(L51/J51,\" \")","v":" "},null,{"$f":"IF(OR(L51=\"\",N51=\"\"),\"\",IFERROR(N51/L51,\"\"))","v":""},{"$f":"IF(C51=\"\",0,1)","v":0},5,1,null,{"$f":"(K51/J51)*100","v":{"$error":"#DIV/0!"}},{"$f":"IF(OR(C51=\"\",I51=\"NT\",I51=\"\",I51=\"CL\"),\"\",IF(OR(I51=\"SW\", I51=\"TA\"),IF(M51>=0.35,1,0),0))","v":""}]
[null,null,null,null,null,null,null,null,null,null,null,0," ",null,"",0,3,1,null,{"$error":"#DIV/0!"},""]
[null,null,null,null,null,null,null,null,null,null,null,0," ",null,"",0,3,1,null,{"$error":"#DIV/0!"},""]
[null,null,null,null,null,null,null,null,null,null,null,0," ",null,"",0,5,1,null,{"$error":"#DIV/0!"},""]
[null,null,null,null,null,null,null,null,null,null,null,0," ",null,"",0,4,1,null,{"$error":"#DIV/0!"},""]
[null,null,null,null,null,null,null,null,null,null,null,0," ",null,"",0,4,1,null,{"$error":"#DIV/0!"},""]
[null,null,null,null,null,null,null,null,null,null,null,0," ",null,"",0,3,1,null,{"$error":"#DIV/0!"},""]
[null,null,null,null,null,null,null,null,null,null,null,0," ",null,"",0,7,1,null,{"$error":"#DIV/0!"},""]
[null,null,null,null,null,null,null,null,null,null,null,0," ",null,"",0,2,1,null,{"$error":"#DIV/0!"},""]
[null,null,null,null,null,null,null,null,null,null,null,0," ",null,"",0,3,1,null,{"$error":"#DIV/0!"},""]
[null,null,null,null,null,null,null,null,null,null,null,0," ",null,"",0,5,1,null,{"$error":"#DIV/0!"},""]
[null,null,null,null,null,null,null,null,null,null,null,0," ",null,"",0,6,1,null,{"$error":"#DIV/0!"},""]
[null,null,null,null,null,null,null,null,null,null,null,0," ",null,"",0,3,1,null,{"$error":"#DIV/0!"},""]
[null,null,null,null,null,null,null,null,null,null,null,0," ",null,"",0,3,1,null,{"$error":"#DIV/0!"},""]
[null,null,null,null,null,null,null,null,null,null,null,0," ",null,"",0,5,1,null,{"$error":"#DIV/0!"},""]
[null,null,null,null,null,null,null,null,null,null,null,0," ",null,"",0,6,1,null,{"$error":"#DIV/0!"},""]
[null,null,null,null,null,null,null,null,null,null,null,0," ",null,"",0,7,1,null,{"$error":"#DIV/0!"},""]
[null,null,null,null,null,null,null,null,null,null,null,0," ",null,"",0,6,1,null,{"$error":"#DIV/0!"},""]
[null,null,null,null,null,null,null,null,null,null,null,0," ",null,"",0,6,1,null,{"$error":"#DIV/0!"},""]
[null,null,null,null,null,null,null,null,null,null,null,0," ",null,"",0,6,1,null,{"$error":"#DIV/0!"},""]
[null,null,null,null,null,null,null,null,null,null,null,0," ",null,"",0,6,1,null,{"$error":"#DIV/0!"},""]
[null,null,null,null,null,null,null,null,null,null,null,0," ",null,"",0,3,1,null,{"$error":"#DIV/0!"},""]
[null,null,null,null,null,null,null,null,null,null,null,0," ",null,"",0,5,1,null,{"$error":"#DIV/0!"},""]
[null,null,null,null,null,null,null,null,null,null,null,0," ",null,"",0,5,1,null,{"$error":"#DIV/0!"},""]
[null,null,null,null,null,null,null,null,null,null,null,0," ",null,"",0,6,1,null,{"$error":"#DIV/0!"},""]
[null,null,null,null,null,null,null,null,null,null,null,0," ",null,"",0,6,1,null,{"$error":"#DIV/0!"},""]
[null,null,null,null,null,null,null,null,null,null,null,0," ",null,"",0,6,1,null,{"$error":"#DIV/0!"},""]
[null,null,null,null,null,null,null,null,null,null,null,0," ",null,"",0,2,1,null,{"$error":"#DIV/0!"},""]
[null,null,null,null,null,null,null,null,null,null,null,0," ",null,"",0,5,1,null,{"$error":"#DIV/0!"},""]
[null,null,null,null,null,null,null,null,null,null,null,0," ",null,"",0,3,1,null,{"$error":"#DIV/0!"},""]
[null,null,null,null,null,null,null,null,null,null,null,0," ",null,"",0,3,1,null,{"$error":"#DIV/0!"},""]
[null,null,null,null,null,null,null,null,null,null,null,0," ",null,"",0,3,1,null,{"$error":"#DIV/0!"},""]
[null,null,null,null,null,null,null,null,null,null,null,{"$f":"IF(K83>J83, J83,K83)","v":0},{"$f":"IFERROR(L83/J83,\" \")","v":" "},null,{"$f":"IF(OR(L83=\"\",N83=\"\"),\"\",IFERROR(N83/L83,\"\"))","v":""},{"$f":"IF(C83=\"\",0,1)","v":0},5,1,null,{"$f":"(K83/J83)*100","v":{"$error":"#DIV/0!"}},{"$f":"IF(OR(C83=\"\",I83=\"NT\",I83=\"\",I83=\"CL\"),\"\",IF(OR(I83=\"SW\", I83=\"TA\"),IF(M83>=0.35,1,0),0))","v":""}]
[null,null,null,null,null,null,null,null,null,null,null,0," ",null,"",0,3,1,null,{"$error":"#DIV/0!"},""]
[null,null,null,null,null,null,null,null,null,null,null,0," ",null,"",0,5,1,null,{"$error":"#DIV/0!"},""]
[null,null,null,null,null,null,null,null,null,null,null,0," ",null,"",0,3,1,null,{"$error":"#DIV/0!"},""]
[null,null,null,null,null,null,null,null,null,null,null,0," ",null,"",0,3,1,null,{"$error":"#DIV/0!"},""]
[null,null,null,null,null,null,null,null,null,null,null,0," ",null,"",0,6,1,null,{"$error":"#DIV/0!"},""]
[null,null,null,null,null,null,null,null,null,null,null,0," ",null,"",0,5,1,null,{"$error":"#DIV/0!"},""]
[null,null,null,null,null,null,null,null,null,null,null,0," ",null,"",0,6,1,null,{"$error":"#DIV/0!"},""]
[null,null,null,null,null,null,null,null,null,null,null,0," ",null,"",0,6,1,null,{"$error":"#DIV/0!"},""]
[null,null,null,null,null,null,null,null,null,null,null,0," ",null,"",0,5,1,null,{"$error":"#DIV/0!"},""]
[null,null,null,null,null,null,null,null,null,null,null,0," ",null,"",0,3,1,null,{"$error":"#DIV/0!"},""]
[null,null,null,null,null,null,null,null,null,null,null,0," ",null,"",0,6,1,null,{"$error":"#DIV/0!"},""]
[null,null,null,null,null,null,null,null,null,null,null,0," ",null,"",0,6,1,null,{"$error":"#DIV/0!"},""]
[null,null,null,null,null,null,null,null,null,null,null,0," ",null,"",0,3,1,null,{"$error":"#DIV/0!"},""]
[null,null,null,null,null,null,null,null,null,null,null,0," ",null,"",0,6,1,null,{"$error":"#DIV/0!"},""]
[null,null,null,null,null,null,null,null,null,null,null,0," ",null,"",0,3,1,null,{"$error":"#DIV/0!"},""]
[null,null,null,null,null,null,null,null,null,null,null,0," ",null,"",0,2,1,null,{"$error":"#DIV/0!"},""]
[null,null,null,null,null,null,null,null,null,null,null,0," ",null,"",0,5,1,null,{"$error":"#DIV/0!"},""]
[null,null,null,null,null,null,null,null,null,null,null,0," ",null,"",0,2,1,null,{"$error":"#DIV/0!"},""]
[null,null,null,null,null,null,null,null,null,null,null,0," ",null,"",0,5,1,null,{"$error":"#DIV/0!"},""]
[null,null,null,null,null,null,null,null,null,null,null,0," ",null,"",0,6,1,null,{"$error":"#DIV/0!"},""]
[null,null,null,null,null,null,null,null,null,null,null,0," ",null,"",0,6,1,null,{"$error":"#DIV/0!"},""]
[null,null,null,null,null,null,null,null,null,null,null,0," ",null,"",0,7,1,null,{"$error":"#DIV/0!"},""]
[null,null,null,null,null,null,null,null,null,null,null,0," ",null,"",0,2,1,null,{"$error":"#DIV/0!"},""]
[null,null,null,null,null,null,null,null,null,null,null,0," ",null,"",0,6,1,null,{"$error":"#DIV/0!"},""]
[null,null,null,null,null,null,null,null,null,null,null,0," ",null,"",0,6,1,null,{"$error":"#DIV/0!"},""]
[null,null,null,null,null,null,null,null,null,null,null,0," ",null,"",0,3,1,null,{"$error":"#DIV/0!"},""]
[null,null,null,null,null,null,null,null,null,null,null,0," ",null,"",0,5,1,null,{"$error":"#DIV/0!"},""]
[null,null,null,null,null,null,null,null,null,null,null,0," ",null,"",0,5,1,null,{"$error":"#DIV/0!"},""]
[null,null,null,null,null,null,null,null,null,null,null,0," ",null,"",0,5,1,null,{"$error":"#DIV/0!"},""]
[null,null,null,null,null,null,null,null,null,null,null,0," ",null,"",0,6,1,null,{"$error":"#DIV/0!"},""]
[null,null,null,null,null,null,null,null,null,null,null,0," ",null,"",0,6,1,null,{"$error":"#DIV/0!"},""]
[null,null,null,null,null,null,null,null,null,null,null,{"$f":"IF(K115>J115, J115,K115)","v":0},{"$f":"IFERROR(L115/J115,\" \")","v":" "},null,{"$f":"IF(OR(L115=\"\",N115=\"\"),\"\",IFERROR(N115/L115,\"\"))","v":""},{"$f":"IF(C115=\"\",0,1)","v":0},5,1,null,{"$f":"(K115/J115)*100","v":{"$error":"#DIV/0!"}},{"$f":"IF(OR(C115=\"\",I115=\"NT\",I115=\"\",I115=\"CL\"),\"\",IF(OR(I115=\"SW\", I115=\"TA\"),IF(M115>=0.35,1,0),0))","v":""}]
[null,null,null,null,null,null,null,null,null,null,null,0," ",null,"",0,3,0,null,{"$error":"#DIV/0!"},""]
[null,null,null,null,null,null,null,null,null,null,null,0," ",null,"",0,5,0,null,{"$error":"#DIV/0!"},""]
[null,null,null,null,null,null,null,null,null,null,null,0," ",null,"",0,6,0,null,{"$error":"#DIV/0!"},""]
[null,null,null,null,null,null,null,null,null,null,null,0," ",null,"",0,2,0,null,{"$error":"#DIV/0!"},""]
[null,null,null,null,null,null,null,null,null,null,null,0," ",null,"",0,5,0,null,{"$error":"#DIV/0!"},""]
[null,null,null,null,null,null,null,null,null,null,null,0," ",null,"",0,6,0,null,{"$error":"#DIV/0!"},""]
[null,null,null,null,null,null,null,null,null,null,null,0," ",null,"",0,5,0,null,{"$error":"#DIV/0!"},""]
[null,null,null,null,null,null,null,null,null,null,null,0," ",null,"",0,5,0,null,{"$error":"#DIV/0!"},""]
[null,null,null,null,null,null,null,null,null,null,null,0," ",null,"",0,7,0,null,{"$error":"#DIV/0!"},""]
[null,null,null,null,null,null,null,null,null,null,null,0," ",null,"",0,7,0,null,{"$error":"#DIV/0!"},""]
[null,null,null,null,null,null,null,null,null,null,null,0," ",null,"",0,7,0,null,{"$error":"#DIV/0!"},""]
[null,null,null,null,null,null,null,null,null,null,null,0," ",null,"",0,5,0,null,{"$error":"#DIV/0!"},""]
[null,null,null,null,null,null,null,null,null,null,null,0," ",null,"",0,6,0,null,{"$error":"#DIV/0!"},""]
[null,null,null,null,null,null,null,null,null,null,null,0," ",null,"",0,6,0,null,{"$error":"#DIV/0!"},""]
[null,null,null,null,null,null,null,null,null,null,null,0," ",null,"",0,2,0,null,{"$error":"#DIV/0!"},""]
[null,null,null,null,null,null,null,null,null,null,null,0," ",null,"",0,6,0,null,{"$error":"#DIV/0!"},""]
[null,null,null,null,null,null,null,null,null,null,null,0," ",null,"",0,5,0,null,{"$error":"#DIV/0!"},""]
[null,null,null,null,null,null,null,null,null,null,null,0," ",null,"",0,5,0,null,{"$error":"#DIV/0!"},""]
[null,null,null,null,null,null,null,null,null,null,null,0," ",null,"",0,5,0,null,{"$error":"#DIV/0!"},""]
[null,null,null,null,null,null,null,null,null,null,null,0," ",null,"",0,2,0,null,{"$error":"#DIV/0!"},""]
[null,null,null,null,null,null,null,null,null,null,null,{"$f":"IF(K136>J136, J136,K136)","v":0},{"$f":"IFERROR(L136/J136,\" \")","v":" "},null,{"$f":"IF(OR(L136=\"\",N136=\"\"),\"\",IFERROR(N136/L136,\"\"))","v":""},{"$f":"IF(C136=\"\",0,1)","v":0},2,0,null,{"$f":"(K136/J136)*100","v":{"$error":"#DIV/0!"}},{"$f":"IF(OR(C136=\"\",I136=\"NT\",I136=\"\",I136=\"CL\"),\"\",IF(OR(I136=\"SW\", I136=\"TA\"),IF(M136>=0.35,1,0),0))","v":""}]
[null,null,null,null,null,null,null,null,null,null,null,{"$f":"IF(K137>J137, J137,K137)","v":0},{"$f":"IFERROR(L137/J137,\" \")","v":" "},null,{"$f":"IF(OR(L137=\"\",N137=\"\"),\"\",IFERROR(N137/L137,\"\"))","v":""},{"$f":"IF(C137=\"\",0,1)","v":0},null,null,null,{"$error":"#DIV/0!"},{"$f":"IF(OR(C137=\"\",I137=\"NT\",I137=\"\",I137=\"CL\"),\"\",IF(OR(I137=\"SW\", I137=\"TA\"),IF(M137>=0.35,1,0),0))","v":""}]
[null,null,null,null,null,null,null,null,null,null,null,0," ",null,"",0,null,null,null,{"$error":"#DIV/0!"},""]
[null,null,null,null,null,null,null,null,null,null,null,0," ",null,"",0,null,null,null,{"$error":"#DIV/0!"},""]
[null,null,null,null,null,null,null,null,null,null,null,0," ",null,"",0,null,null,null,{"$error":"#DIV/0!"},""]
[null,null,null,null,null,null,null,null,null,null,null,0," ",null,"",0,null,null,null,{"$error":"#DIV/0!"},""]
[null,null,null,null,null,null,null,null,null,null,null,0," ",null,"",0,null,null,null,{"$error":"#DIV/0!"},""]
[null,null,null,null,null,null,null,null,null,null,null,0," ",null,"",0,null,null,null,{"$error":"#DIV/0!"},""]
[null,null,null,null,null,null,null,null,null,null,null,0," ",null,"",0,null,null,null,{"$error":"#DIV/0!"},""]
[null,null,null,null,null,null,null,null,null,null,null,0," ",null,"",0,null,null,null,{"$error":"#DIV/0!"},""]
[null,null,null,null,null,null,null,null,null,null,null,0,{"$f":"IFERROR(L146/J146,\" \")","v":" "},null,"",0,null,null,null,{"$error":"#DIV/0!"},""]
[null,null,null,null,null,null,null,null,null,null,null,0," ",null,"",{"$f":"IF(C147=\"\",0,1)","v":0},null,null,null,{"$error":"#DIV/0!"},""]
[null,null,null,null,null,null,null,null,null,null,null,0," ",null,{"$f":"IF(OR(L148=\"\",N148=\"\"),\"\",IFERROR(N148/L148,\"\"))","v":""},0,null,null,null,{"$f":"(K148/J148)*100","v":{"$error":"#DIV/0!"}},{"$f":"IF(OR(C148=\"\",I148=\"NT\",I148=\"\",I148=\"CL\"),\"\",IF(OR(I148=\"SW\", I148=\"TA\"),IF(M148>=0.35,1,0),0))","v":""}]
[null,null,null,null,null,null,null,null,null,null,null,0," ",null,"",0,null,null,null,{"$error":"#DIV/0!"},""]
[null,null,null,null,null,null,null,null,null,null,null,0," ",null,"",0,null,null,null,{"$error":"#DIV/0!"},""]
[null,null,null,null,null,null,null,null,null,null,null,0," ",null,"",0,null,null,null,{"$error":"#DIV/0!"},""]
[null,null,null,null,null,null,null,null,null,null,null,0," ",null,"",0,null,null,null,{"$error":"#DIV/0!"},""]
[null,null,null,null,null,null,null,null,null,null,null,0," ",null,"",0,null,null,null,{"$error":"#DIV/0!"},""]
[null,null,null,null,null,null,null,null,null,null,null,0," ",null,"",0,null,null,null,{"$error":"#DIV/0!"},""]
[null,null,null,null,null,null,null,null,null,null,null,0," ",null,"",0,null,null,null,{"$error":"#DIV/0!"},""]
[null,null,null,null,null,null,null,null,null,null,null,0," ",null,"",0,null,null,null,{"$error":"#DIV/0!"},""]
[null,null,null,null,null,null,null,null,null,null,null,0," ",null,"",0,null,null,null,{"$error":"#DIV/0!"},""]
[null,null,null,null,null,null,null,null,null,null,null,0," ",null,"",0,null,null,null,{"$error":"#DIV/0!"},""]
[null,null,null,null,null,null,null,null,null,{"$f":"ROUND(SUMIF(I19:I158,{\"TA\"},J19:J158)+SUMIF(I19:I158,{\"SW\"},J19:J158)+SUMIF(I19:I158,{\"NT\"},J19:J158)+SUMIF(I19:I158,{\"\"}, J19:J158),0)","v":0},{"$f":"ROUND(SUMIF(I19:I158,{\"TA\"},K19:K158)+SUMIF(I19:I158,{\"SW\"},K19:K158)+SUMIF(I19:I158,{\"NT\"},K19:K158)+SUMIF(I19:I158,{\"\"},K19:K158),0)","v":0},{"$f":"ROUND(SUMIF(I19:I158,{\"TA\"},L19:L158)+SUMIF(I19:I158,{\"SW\"},L19:L158)+SUMIF(I19:I158,{\"NT\"},L19:L158)+SUMIF(I19:I158,{\"\"},L19:L158),0)","v":0},null,{"$f":"SUM($N$19:$N$158)","v":0},null,null,null,null,null,{"$error":"#DIV/0!"},{"$f":"SUM(U19:U158)","v":0}]
[null,null,null,null,null,null,null,null,null,null,null,null,null,null,null,null,null,null,null,null,{"$f":"COUNTIF(U19:U158, 0)+COUNTIF(U19:U158,1)","v":0}]
[null,"Step  8.4: \nDistricts selecting \"Other\" as the source of low-income data in Step 8.1, explain method here"]
[]
[]
[null,null,null,null,null,null,null,null,null,null,null,null,{"$f":"ROUND(SUMIF(I19:I158,{\"TA\"},L19:L158)+SUMIF(I19:I158,{\"SW\"},L19:L158), 0)","v":0}]
[]
[null,"Instructions:  \n\nThe School Funding worksheet has three main sections:\n\n• Step 8.1: The district selects the date and type of the low-income data the district is using to determine schools eligible to be served with Title I funds. Click the OK button to proceed.\n• Step 8.2: The district chooses a method for qualifying Title I schools. Click the OK button to proceed.\n• Step 8.3: The district designates schools as Title I and enters additional data for the district’s schools.  Once this section is complete, the district will be able to see the required amount reserved for private schools in Step 7.1 of the District Reservation tab. \n• Step 8.4: For any district selecting \"Other\" as the source of data for low-income enrollment must complete this step, explaining the data used to determine low income numbers for each school.  See below for details on the 5 acceptable methods of determing low-income status of students.\n\nStep 8.1:  Select the type of poverty data used to identify eligible schools:  Federal law requires the district to rank all of its school attendance areas (the geographic area from which a public school draws its children) according to their percent of poverty. The first task is to select the source of the poverty data the district is using to identify eligible schools using the drop-down menu in Step 8.1. The default source of enrollment and poverty data that will automatically populate when the district name is chosen on the cover page is the March Economically Disadvantaged data multiplied by 1.6.  Selecting Economically Disadvantaged data as an option automatically populates Column 4 (Total Number of Children Enrolled in Schools in Column 1). The School Funding worksheet automatically calculates the poverty percentage of each school. However, if you chose \"other\" for poverty data source, contact your liaison to adjust your workbook.\n\n\n"]
[]
[]
[]
[]
[]
[]
[]
[]
[]
[]
[]
[]
[]
[]
[null,"\nStep 8.2:  Using the drop-down menu, select a method of qualifying Title I schools that allows the district to appropriately allocate resources to the school attendance areas that would benefit most from Title I funds. Broadly speaking, the district may choose to use a district-wide ranking or rank school attendance areas by grade span groupings. \n\n• Option 1 is the district-wide low-income percentage method. Under this qualifying method, schools at or above the district-wide poverty average are eligible for services; as such, money may run out before serving all of these schools. If selected, the School Funding worksheet will automatically sort all schools in rank order by low-income percentage based on the data source used to determine eligible Title I school attendance areas.\n• Option 2 is the grade span grouping/district-wide percentage method. Under this qualifying method, schools serving the same grades are grouped together, and any school at or above the district-wide poverty average in each group is eligible for services. If selected, the School Funding worksheet will automatically sort the schools by grade span and then by low-income percentage based on the data source used to determine eligible Title I school attendance areas.\n• Option 3 is the 35% rule. Under this qualifying method, all district schools at or above 35% poverty are eligible for services; as such, funds may be insufficient to serve all schools down to the 35% poverty level.\n• Option 4 is the grade span grouping/35% rule. Under this qualifying method, schools with similar grade spans are grouped together and any school at or above 35% poverty in each group is eligible for services. \n• Option 5 is the grade span grouping/group-wide percentage method. Under this qualifying method, schools serving the same grades are grouped together and any school at or above the group-wide poverty average in each group is eligible for services.\n• Options 6 and 7 apply to smaller districts and single-school districts. If the district contains one school per grade span or if the total enrollment of the district is less than 1,000 students, then the district is not required to rank-order schools and consequently may serve any school.  Districts in this category with more than one school should be able to justify which schools will be served by Title I. \n Note:  If a school you want to serve with Title I funds does not meet the poverty threshold using any of the qualifying methods, consider requesting an  Ed-Flex waiver to reach that school.  Contact your liaison to discuss the waiver.\n"]
[]
[]
[]
[]
[]
[]
[]
[]
[]
[]
[]
[]
[]
[]
[]
[]
[null,"General Rules for 8.2: \n\n• Because the district may only use the grade span grouping option after schools above 75% poverty are served regardless of grade span (and, at the district's option, high schools with > 50% poverty), the School Funding worksheet will always first rank schools above 75% poverty, regardless of grade span.\n\n• A district that opts to serve schools at or below 75 percent poverty using grade-span groupings may determine higher or lower per-pupil amounts for different grade spans as long as those amounts do not exceed the amount allocated to any area or school above 75 percent poverty. Per-pupil amounts within grade spans may vary, but the district may not allocate higher per-pupil amounts to areas or schools with lower poverty rates within grade spans.\n\n• The same method of qualifying schools must be used for all groupings. For example, if there are three grade span groupings, all three must use the 35% rule, or all three must use district-wide poverty average, or each must use its group-wide poverty average.\n \nStep 8.3\nIndicate which schools will receive Title I, Part A services by clicking a cell and selecting from one of four options (select this coming school year’s (FY19) program type in column 3b):\n\n• Select “SW” (schoolwide) if the school will conduct a schoolwide program as defined under federal regulations in the coming school year. As a general rule, only schools with 40% or higher poverty percentages can implement schoolwide programs. For detailed information on schoolwide programs, go here.\n• Select “TA” (Targeted Assistance) if the school will conduct a targeted assistance program in the coming school year.\n• Select “NT” (Non-Title I) if the school will not receive Title I funding.\n• Select “CL” (Closed) if the school will be closed in the coming school year.\n\nNote:   The district may elect to “skip” an eligible school attendance area or school that has a higher percentage of children from low-income families than a school that is served only if the following criteria are met: (1) The school meets the Title I comparability requirements; (2) The school is receiving supplemental funds from other State or local sources that are spent according to the requirements of Section 1114 or 1115 of Title I, Part A; and (3) The funds expended from such other sources equal or exceed the amount that would be provided under Title I, Part A.\nPlease note, however, that eligible private school children who reside in a “skipped” attendance area must be provided Title I services even though the public school attendance area is skipped.\n\nIndicate “grandfathered” and/or preferred high schools (>50% poverty), if applicable.  Districts may designate and serve a school attendance area or school that is not eligible this year, but that was eligible and served in the preceding fiscal year, but only for one (1) additional fiscal year.  Districts may also prioritize high schools with greater than 50% poverty (these schools should be ranked in order after schools with 75% poverty or greater). Place an “X” in Column 1(c) for any grandfathered school and in 1(d) for any high school above 50% poverty that the district chooses to prioritize.\n\nEnter the actual Title I allocation per school in the appropriate cell in Column 8. Keep in mind the two basic rules of allocation. First, all school allocations, except for the last served, must meet minimum per-pupil amounts figured on Tab 7 and appearing in the box at the upper right of this tab). Title I, A District Reservations. Second, barring allowable exceptions (i.e., districts containing one school per grade span or districts with a total enrollment of less than 1,000 students), higher poverty schools must receive the same or greater amount per-pupil than lower poverty schools in your rank order. \n\nThe total amount allocated for schools in Column 8 must equal the balance of funds available for school allocations after reservations from Tab 7.\n\n"]
[]
[]
[]
[]
[]
[]
[]
[]
[]
[]
[]
[]
[]
[]
[]
[]
[]
[]
[]
[]
[]
[]
[]
[]
[]
[]
[]
[]
[]
[]
[]
[]
[]
[]
[]
[null,"Step 8.4"]
[null,"Indicate which method or methods of determing low-income enrollment were used for ranking and allocating funds to each school.  Note that the only acceptable measures are:"]
[null,"                - Children ages 5-17 in poverty as counted in the most recent census data approved  by the Secretary. "]
[null,"                - Children eligible for free and reduced-priced lunches under the Richard B. Russell National School Lunch Act."]
[null,"                - Children in families receiving assistance under the State program funded under Title IV, Part A of the Social Security Act (Temporary Assistance for Needy Families). "]
[null,"                - Children eligible to receive medical assistance under the Medicaid program."]
[null,"                - A composite of any of the above measures"]
[]
[null,"An LEA must use the same measure of poverty for: "]
[null,"- Identifying eligible school attendance areas. "]
[null,"- Determining the ranking of each area. "]
[null,"- Determining the allocation for each area. "]
[]
[null,"Notes:"]
[null,"•  Column 9 automatically displays the actual per-pupil amount based on the allocation amounts and the total (maximum) number of low-income children in Column 6.  Note that districts electing to use the 1.6 multiplier cannot exceed the actual number of children enrolled in each school.  If your district has multiple schools at 100% low-income enrollment due to the 1.6 mulitplier, schools will be ranked based on the percentage of poverty in each school absent the 1.6 multiplier."]
[null,"•  The District-Wide Low-Income Percentage is displayed in the box above the columns on the right hand side of the worksheet. Remember that a district may rank its schools by either the district-wide low-income percentage or low-income percentages within grade span groupings."]

{"sheet":"9. Title I, Part A Budget ","index":11,"n_rows":127,"n_cols":33,"rows_kept":127,"cut":false,"hidden":false,"merged":[[126,25,126,26],[104,3,104,30],[105,3,106,30],[122,25,122,26],[123,25,123,26],[124,25,124,26],[125,25,125,26],[110,20,110,23],[111,20,112,23],[113,20,113,23],[114,20,114,23],[115,20,115,23],[116,20,116,23],[117,20,117,23],[118,20,118,23],[119,20,119,23],[120,20,120,23],[121,20,121,23],[122,20,122,23],[123,20,123,23],[124,20,124,23],[125,20,125,23],[111,25,112,26],[113,25,113,26],[114,25,114,26],[115,25,115,26],[116,25,116,26],[117,25,117,26],[118,25,118,26],[119,25,119,26],[120,25,120,26],[121,25,121,26],[125,5,125,6],[125,7,125,8],[116,5,116,6],[116,7,116,8],[117,5,117,6],[117,7,117,8],[118,5,118,6],[118,7,118,8],[126,5,126,6],[126,7,126,8],[122,5,122,6],[122,7,122,8],[123,5,123,6],[123,7,123,8],[124,5,124,6],[124,7,124,8],[119,5,119,6],[119,7,119,8],[120,5,120,6],[120,7,120,8],[121,5,121,6],[121,7,121,8],[113,5,113,6],[113,7,113,8],[114,5,114,6],[114,7,114,8],[115,5,115,6],[115,7,115,8],[107,3,107,10],[111,5,112,6],[111,7,112,8],[111,10,112,16],[95,25,96,27],[100,4,100,12],[100,20,100,24],[13,1,14,1],[104,1,105,1],[135,4,135,7],[5,7,6,8],[5,4,6,6],[89,5,89,12],[89,22,89,23],[90,22,90,23],[91,5,91,11],[91,22,91,23],[92,22,92,23],[80,5,80,11],[80,22,80,23],[81,5,81,11],[81,22,81,23],[82,4,82,12],[84,10,84,11],[85,10,85,11],[86,10,86,11],[76,5,76,11],[76,22,76,23],[65,5,65,11],[65,22,65,23],[77,5,77,11],[77,22,77,23],[78,5,78,11],[78,22,78,23],[79,5,79,11],[79,22,79,23],[75,22,75,23],[66,5,66,7],[68,5,68,11],[68,22,68,23],[69,5,69,11],[69,22,69,23],[70,5,70,11],[71,5,71,11],[72,5,72,11],[72,22,72,23],[73,4,73,12],[70,22,70,23],[71,22,71,23],[46,22,46,23],[47,5,47,12],[47,22,47,23],[61,22,61,23],[62,5,62,11],[62,22,62,23],[63,5,63,11],[63,22,63,23],[64,5,64,11],[64,22,64,23],[44,5,44,12],[44,22,44,23],[45,22,45,23],[56,22,56,23],[57,5,57,8],[57,22,57,23],[58,5,58,8],[58,22,58,23],[59,4,59,12],[52,22,52,23],[53,5,53,8],[53,22,53,23],[54,5,54,8],[54,22,54,23],[55,5,55,8],[55,22,55,23],[56,5,56,8],[48,5,48,12],[48,22,48,23],[49,5,49,12],[49,22,49,23],[50,4,50,12],[45,5,45,12],[46,5,46,12],[41,5,41,8],[41,22,41,23],[42,4,42,12],[43,4,43,8],[32,5,32,8],[32,22,32,23],[33,5,33,8],[33,22,33,23],[34,5,34,8],[34,22,34,23],[35,4,35,12],[36,4,36,8],[37,22,37,23],[38,5,38,8],[38,22,38,23],[39,5,39,8],[39,22,39,23],[40,5,40,8],[40,22,40,23],[28,5,28,8],[28,22,28,23],[29,4,29,12],[29,22,29,23],[30,4,30,8],[31,5,31,8],[31,22,31,23],[25,5,25,8],[25,22,25,23],[26,5,26,8],[26,22,26,23],[27,5,27,8],[27,22,27,23],[19,5,19,8],[19,22,19,23],[20,22,20,23],[21,4,21,8],[22,22,22,23],[23,5,23,8],[23,22,23,23],[24,5,24,8],[24,22,24,23],[17,5,17,8],[17,22,17,23],[18,5,18,8],[18,22,18,23],[7,4,7,6],[7,7,7,8],[3,3,3,30],[1,3,1,11],[2,22,2,23],[6,9,6,10],[6,11,6,12],[13,3,13,25],[14,4,14,12],[14,22,14,23],[16,5,16,8],[16,22,16,23]]}
[]
[null,null,null,{"$f":"valDistrName & \" (\"&valorg4code&\")\"","v":"OrgName (DIST)"}]
[]
[null,null,null,"FY20 Title I, Part A (Fund Code 305) Budget Worksheet"]
[]
[null,null,null,null,"Allocation \n(before any flexing)",null,null,{"$f":"valAllocationT1","v":0}]
[]
[null,null,null,null,"Reservation for Equitable (Private-School) Services",null,null,{"$f":"ROUND(valPrivateSchoolT1, 0)","v":0}]
[]
[null,null,null,null,null,null,null,null,null,null,null,{"$f":"valDistrName","v":"OrgName"},null,null,null,null,null,null,null,null,{"$f":"valDistrName & \" (\"&valorg4code&\")\"","v":"OrgName (DIST)"}]
[null,null,null,null,null,null,null,null,null,null,{"$f":"valDistrName","v":"OrgName"}]
[]
[]
[null,"Step 9.1\nAll Title I Districts"]
[null,null,null,null,"Line Item Category: Select an option from the drop down menu.",null,null,null,null,null,null,null,null,null,"Amount",null,"Expenditures (whole numbers)",null,null,null,"Primary Function",null,"Comments",null,null,null,"Amount Included in this expenditure for Equitable Services "]
[]
[null,null,null,null,1,"ADMINISTRATOR SALARIES:",null,null,null,null,"# of staff","Total FTE","MTRS",null,null,null,"Amount",null,null,null,"Select from Drop Down List",null,"Budget Detail",null,null,null,"Amount"]
[null,null,null,null,null,"Select One",null,null,null,null,null,null,null,false,{"$f":"IF(N18,Q18,0)","v":0},null,null,null,null,null,"Select One"]
[null,null,null,null,null,"Select One",null,null,null,null,null,null,null,false,{"$f":"IF(N19,Q19,0)","v":0},null,null,null,null,null,"Select One"]
[null,null,null,null,null,"Select One",null,null,null,null,null,null,null,false,{"$f":"IF(N20,Q20,0)","v":0},null,null,null,null,null,"Select One"]
[]
[null,null,null,null,"SUB-TOTAL",null,null,null,null,null,{"$f":"SUM(K18:K20)","v":0},{"$f":"SUM(L18:L20)","v":0},null,null,{"$f":"SUM(O18:O20)","v":0},null,{"$f":"SUM(Q18:Q20)","v":0},null,null,null,null,null,null,null,null,null,{"$f":"SUM(AA18:AA20)","v":0}]
[null,null,null,null,2,"INSTRUCTIONAL/PROF STAFF:",null,null,null,null,"# of staff","Total FTE","MTRS",null,null,null,"Amount",null,null,null,"Select from Drop Down List",null,"Budget Detail",null,null,null,"Amount"]
[null,null,null,null,null,"Select One",null,null,null,null,null,null,null,false,{"$f":"IF(N24, Q24,0)","v":0},null,null,null,null,null,"Select One"]
[null,null,null,null,null,"Select One",null,null,null,null,null,null,null,false,0,null,null,null,null,null,"Select One"]
[null,null,null,null,null,"Select One",null,null,null,null,null,null,null,false,0,null,null,null,null,null,"Select One"]
[null,null,null,null,null,"Select One",null,null,null,null,null,null,null,false,0,null,null,null,null,null,"Select One"]
[null,null,null,null,null,"Select One",null,null,null,null,null,null,null,false,0,null,null,null,null,null,"Select One"]
[null,null,null,null,null,"Select One",null,null,null,null,null,null,null,false,0,null,null,null,null,null,"Select One"]
[]
[null,null,null,null,"SUB-TOTAL",null,null,null,null,null,{"$f":"SUM(K24:K29)","v":0},{"$f":"SUM(L24:L29)","v":0},null,null,{"$f":"SUM(O24:O29)","v":0},null,{"$f":"SUM(Q24:Q29)","v":0},null,null,null,null,null,null,null,null,null,{"$f":"SUM(AA24:AA29)","v":0}]
[null,null,null,null,3,"SUPPORT STAFF SALARIES:",null,null,null,null,"# of staff","Total FTE","MTRS",null,null,null,"Amount",null,null,null,"Select from Drop Down List",null,"Budget Detail",null,null,null,"Amount"]
[null,null,null,null,null,"Select One",null,null,null,null,null,null,null,false,{"$f":"IF(N33, Q33,0)","v":0},null,null,null,null,null,"Select One"]
[null,null,null,null,null,"Select One",null,null,null,null,null,null,null,false,{"$f":"IF(N34, Q34,0)","v":0},null,null,null,null,null,"Select One"]
[null,null,null,null,null,"Select One",null,null,null,null,null,null,null,false,0,null,null,null,null,null,"Select One"]
[]
[null,null,null,null,"SUB-TOTAL",null,null,null,null,null,{"$f":"SUM(K33:K35)","v":0},{"$f":"SUM(L33:L35)","v":0},null,null,{"$f":"SUM(O33:O35)","v":0},null,{"$f":"SUM(Q33:Q35)","v":0},null,null,null,null,null,null,null,null,null,{"$f":"SUM(AA33:AA35)","v":0}]
[null,null,null,null,4,"STIPENDS:",null,null,null,"# of staff","Rate","Rate Type","MTRS",null,null,null,"Amount",null,null,null,"Select from Drop Down List",null,"Budget Detail",null,null,null,"Amount"]
[null,null,null,null,null,"Select One",null,null,null,null,null,"select",null,false,{"$f":"IF(N39, Q39,0)","v":0},null,null,null,null,null,"Select One"]
[null,null,null,null,null,"Select One",null,null,null,null,null,"select",null,false,{"$f":"IF(N40, Q40,0)","v":0},null,null,null,null,null,"Select One"]
[null,null,null,null,null,"Select One",null,null,null,null,null,"select",null,false,0,null,null,null,null,null,"Select One"]
[null,null,null,null,null,"Select One",null,null,null,null,null,"select",null,false,0,null,null,null,null,null,"Select One"]
[]
[null,null,null,null,"SUB-TOTAL",null,null,null,null,null,null,null,null,null,{"$f":"SUM(O39:O42)","v":0},null,{"$f":"SUM(Q39:Q42)","v":0},null,null,null,null,null,null,null,null,null,{"$f":"SUM(AA39:AA42)","v":0}]
[null,null,null,null,5,"FRINGE BENEFITS:",null,null,null,null,null,null,null,null,null,null,"Amount",null,null,null,"Brief Description",null,"Budget Detail",null,null,null,"Amount"]
[null,null,null,null,null,"5a  MTRS (automatically calculated if MTRS box is checked above)  ",null,null,null,null,null,null,null,null,null,null,{"$f":"ROUND((SUM(O37,O44,O31,O22))*0.09,0)","v":0}]
[null,null,null,null,null,"5b  Other",null,null,null,null,null,null,null,null,null,null,{"$f":"SUM(Q48:Q50)","v":0}]
[null,null,null,null,null,"Health Insurance"]
[null,null,null,null,null,"Other Retirement Systems"]
[null,null,null,null,null,"Federal Insurance Contributions Act (FICA)"]
[]
[null,null,null,null,"SUB-TOTAL",null,null,null,null,null,null,null,null,null,null,null,{"$f":"SUM(Q46:Q47)","v":0},null,null,null,null,null,null,null,null,null,{"$f":"SUM(AA46, AA48:AA50)","v":0}]
[null,null,null,null,6,"CONTRACTUAL SERVICES:",null,null,null,null,"Rate","Rate Type",null,null,null,null,"Amount",null,null,null,"Select from Drop Down List",null,"Budget Detail",null,null,null,"Amount"]
[null,null,null,null,null,"Select One",null,null,null,null,null,"select",null,null,null,null,null,null,null,null,"Select One"]
[null,null,null,null,null,"Select One",null,null,null,null,null,"select",null,null,null,null,null,null,null,null,"Select One"]
[null,null,null,null,null,"Select One",null,null,null,null,null,"select",null,null,null,null,null,null,null,null,"Select One"]
[null,null,null,null,null,"Select One",null,null,null,null,null,"select",null,null,null,null,null,null,null,null,"Select One"]
[null,null,null,null,null,"Select One",null,null,null,null,null,"select",null,null,null,null,null,null,null,null,"Select One"]
[null,null,null,null,null,"Select One",null,null,null,null,null,"select",null,null,null,null,null,null,null,null,"Select One"]
[]
[null,null,null,null,"SUB-TOTAL",null,null,null,null,null,null,null,null,null,null,null,{"$f":"SUM(Q54:Q59)","v":0},null,null,null,null,null,null,null,null,null,{"$f":"SUM(AA54:AA59)","v":0}]
[null,null,null,null,7,"SUPPLIES AND MATERIALS:",null,null,null,null,null,null,null,null,null,null,"Amount",null,null,null,"Select from Drop Down List",null,"Budget Detail",null,null,null,"Amount"]
[null,null,null,null,null,"Select One",null,null,null,null,null,null,null,null,null,null,null,null,null,null,"Select One"]
[null,null,null,null,null,"Select One",null,null,null,null,null,null,null,null,null,null,null,null,null,null,"Select One"]
[null,null,null,null,null,"Select One",null,null,null,null,null,null,null,null,null,null,null,null,null,null,"Select One"]
[null,null,null,null,null,"Select One",null,null,null,null,null,null,null,null,null,null,null,null,null,null,"Select One"]
[]
[null,null,null,null,"SUB-TOTAL",null,null,null,null,null,null,null,null,null,null,null,{"$f":"SUM(Q63:Q66)","v":0},null,null,null,null,null,null,null,null,null,{"$f":"SUM(AA63:AA66)","v":0}]
[null,null,null,null,8,"TRAVEL:  (mileage, conference registration, courses, hotels, etc.)",null,null,null,null,null,null,null,null,null,null,"Amount",null,null,null,"Select from Drop Down List",null,"Budget Detail",null,null,null,"Amount"]
[null,null,null,null,null,"Select One",null,null,null,null,null,null,null,null,null,null,null,null,null,null,"Select One"]
[null,null,null,null,null,"Select One",null,null,null,null,null,null,null,null,null,null,null,null,null,null,"Select One"]
[null,null,null,null,null,"Select One",null,null,null,null,null,null,null,null,null,null,null,null,null,null,"Select One"]
[null,null,null,null,null,"Select One",null,null,null,null,null,null,null,null,null,null,null,null,null,null,"Select One"]
[]
[null,null,null,null,"SUB-TOTAL",null,null,null,null,null,null,null,null,null,null,null,{"$f":"SUM(Q70:Q73)","v":0},null,null,null,null,null,null,null,null,null,{"$f":"SUM(AA70:AA73)","v":0}]
[null,null,null,null,9,"OTHER COSTS:",null,null,null,null,null,null,null,null,null,null,"Amount",null,null,null,"Select from Drop Down List",null,"Budget Detail",null,null,null,"Amount"]
[null,null,null,null,null,"Select One",null,null,null,null,null,null,null,null,null,null,null,null,null,null,"Select One"]
[null,null,null,null,null,"Select One",null,null,null,null,null,null,null,null,null,null,null,null,null,null,"Select One"]
[null,null,null,null,null,"Select One",null,null,null,null,null,null,null,null,null,null,null,null,null,null,"Select One"]
[null,null,null,null,null,"Select One",null,null,null,null,null,null,null,null,null,null,null,null,null,null,"Select One"]
[null,null,null,null,null,"Select One",null,null,null,null,null,null,null,null,null,null,null,null,null,null,"Select One"]
[null,null,null,null,null,"Select One",null,null,null,null,null,null,null,null,null,null,null,null,null,null,"Select One"]
[]
[null,null,null,null,"SUB-TOTAL",null,null,null,null,null,null,null,null,null,null,null,{"$f":"SUM(Q77:Q82)","v":0},null,null,null,null,null,null,null,null,null,{"$f":"SUM(AA77:AA82)","v":0}]
[null,null,null,null,null,null,null,null,"(a) rate (%)",null,"(b) eligible allocation less indirect",null,null,null,null,null,"Amount"]
[null,null,null,null,10,"INDIRECT COSTS *",null,null,null,null,{"$f":"IF(I86=\"\",\"\", (H6-IndExclT1)/(1+I86))","v":""}]
[null,null,null,null,null,null,null,null," (a x b)",null,{"$f":"IFERROR(K86*I86,\"\")","v":""}]
[null,null,null,null,null,null,null,null,null,null,"   maximum allowed"]
[]
[null,null,null,null,11,"EQUIPMENT:\nItems costing $5,000+ per unit and having a useful life more than 1 year should also be listed",null,null,null,null,null,null,null,null,null,null,"Amount",null,null,null,"Select from Drop Down List",null,"Budget Detail",null,null,null,"Amount"]
[null,null,null,null,null,"individually in Step 11.2, below (these expenditures are not eligible for recovery of indirect cost).",null,null,null,null,null,null,null,null,null,null,null,null,null,null,"Select One"]
[null,null,null,null,null,null,null,null,null,null,null,null,null,null,null,null,null,null,null,null,"Select One"]
[]
[null,null,null,null,"SUB-TOTAL",null,null,null,null,null,null,null,null,null,null,null,{"$f":"SUM(Q91:Q92)","v":0},null,null,null,null,null,null,null,null,null,{"$f":"SUM(AA91:AA92)","v":0}]
[]
[null,null,null,null,null,null,null,null,null,null,null,null,null,null,null,null,null,null,null,null,null,null,null,null,null,"Total for Equitable Services  "]
[null,null,null,null,null,null,null,null,null,null,null,null,"         TOTAL FUNDS REQUESTED "]
[]
[null,null,null,null,null,null,null,null,null,null,null,null,null,null,null,null,{"$f":"Q94+Q86+Q84+Q75+Q68+Q61+Q52+Q44+Q37+Q31+Q22","v":0},null,null,null,null,null,null,null,null,null,{"$f":"SUM(AA94+AA84+AA75+AA68+AA61+AA52+AA44+AA37+AA31+AA22)","v":0}]
[]
[null,null,null,null,"                                    DISCREPANCY:  Difference between allocation and budgeted total, if any",null,null,null,null,null,null,null,null,null,null,null,{"$f":"IFERROR(IF(Q99<>valAllocationT1,Q99-valAllocationT1,\"\"),\"\")","v":""},null,null,null,"                                                DISCREPANCY:  Difference between reservation and budgeted total, if any",null,null,null,null,null,{"$f":"IF(AA99<>H8, AA99-H8, \"\")","v":""}]
[]
[]
[]
[null,"Step 9.2\n Title I Districts taking Indirect Costs",null,"Indirect Costs:  Major contracts and equipment"]
[null,null,null,"\nIndirect costs are those expenses of doing business that are not readily identifed with a particular grant, contract, project fund or activity, but are necessary for the general operation of the organization and the conduct of the activities it performs.  Because these expenses are difficult to track with precision across all benefiting sources, federal grants allow use of a rate as a mechanism for fairly and conveniently apportioning indirect costs across all programs within the boundaries of sound administrative principles.  \nSee U.S. Department of Education, Indirect Cost Overview (https://www2.ed.gov/about/offices/list/ocfo/intro.html). \n\nFor this grant, indirect costs must be consistent with the rate established by DESE's Office of School Finance.  Note that districts are allowed to take less than the maximum allowable for indirect costs. The decision to recover indirect costs using these established rates is a local option.  If indirect costs are recovered, they shall be returned to the general fund of the city or town in  accordance with G.L. Chapter 44, Section 53.  In the case of regional schools, indirect costs shall be returned to the regional school general fund.  www.doe.mass.edu/Grants/essential.html\n\nIn calculating the indirect cost allowable for a particular grant, some expenditures are not included.  Two such exclusions include a portion of major subawards or subcontracts (those exceeding $25,000), and capital costs (equipment purchases of $5,000 or more).  \nSee, U. S. Department of Education, Cost Allocation Guide for State and Local Governments.  https://www2.ed.gov/about/offices/list/ocfo/fipao/guideigcwebsite.pdf\n\n                                        •  Contracts:  For major contracts exceeding $25,000, districts may recover indirect costs on only the first $25,000 of each contract.   The remainder of the contract amount is excluded from application of the indirect cost rate.  Note that for contracts \n                                            for professional services normally provided in-house, such as a speech pathologist or school nurse, this exclusion does not apply, even if the contract exceeds $25,000.  Of course, these expenses are also subject to all other grant requirements \n                                            (allowability, allocability, necessarily and reasonable, etc.) to be properly chargeable to the grant as well.\n\n                                        • Equipment:  All equipment costing $5,000 or more and having a useful life of more than 1 year is considered a capital expenditure and not eligible for recovery of indirect cost.  The total for equipment should match the total entered in Line 11, above.\n\nDirections:  List contracts exceeding $25,000 below (but not those for professional services normally provided in house) and the amount to be excluded will be calculated automatically.  The excluded amount will be added to the equipment total (Line 11) and subtracted from your district's allocation before calculating your district's maximum allowable indirect cost on Line 10."]
[]
[]
[null,null,null,null," "]
[null,null,null,null,null,"Contracts exceeding $25,000 (include in budget categories above in addition to listing individually here)",null,null,null,null,null,null,null,null,null,null,null,"  Equipment:  (from Line 11, above)\n\n",null,null,"Equipment:  (from Line 11, above)"]
[null,null,null,null,null,null,null,null,null,null,null,null,null,null,null,null,null,"    List Items costing $5,000+ per unit and having a useful life of more than 1 year.  ",null,null,"List Items costing $5,000+ per unit and having a useful life of more than 1 year.  "]
[null,null,null,null,null,"Amount of contract:",null,"Amount excluded from indirect cost:",null,null,"  Description:",null,null,null,null,null,null,null,null,null,"  Description:",null,null,null,null,"Amount:"]
[]
[null,null,null,null,null,null,null,{"$f":"IF((F114-25000)>0, (F114-25000), \"\")","v":""}]
[null,null,null,null,null,null,null,{"$f":"IF((F115-25000)>0, (F115-25000), \"\")","v":""}]
[null,null,null,null,null,null,null,""]
[null,null,null,null,null,null,null,""]
[null,null,null,null,null,null,null,""]
[null,null,null,null,null,null,null,""]
[null,null,null,null,null,null,null,""]
[null,null,null,null,null,null,null,""]
[null,null,null,null,null,null,null,""]
[null,null,null,null,null,null,null,""]
[null,null,null,null,null,null,null,""]
[null,null,null,null,null,null,null,""]
[null,null,null,null,null,null,null,"",null,null,null,null,null,null,null,null,null,null,null,null,null,null,null,null,null,null,null,null,null,null,null,null,{"$f":"IndConT1+IndEquipT1","v":0}]
[null,null,null,null,"SUB-TOTAL",{"$f":"SUM(F114:G126)","v":0},null,{"$f":"SUM(H114:I126)","v":0},null,null,null,null,null,null,null,null,null,null,null,null,null,null,null,"SUB-TOTAL",null,{"$f":"SUM(Z114:Z126)","v":0}]

{"sheet":"10. Title II, Part A Narrative","index":12,"n_rows":67,"n_cols":25,"rows_kept":67,"cut":false,"hidden":false,"merged":[[34,9,34,10],[32,9,32,10],[33,9,33,10],[36,3,36,4],[32,3,32,4],[33,3,33,4],[34,3,34,4],[19,16,19,18],[16,4,16,5],[16,6,16,15],[17,4,17,5],[17,6,17,15],[18,4,18,5],[18,6,18,15],[22,4,22,5],[30,16,31,18],[29,12,29,13],[22,16,22,18],[32,16,32,18],[33,16,33,18],[34,16,34,18],[51,18,51,19],[50,18,50,19],[47,18,47,19],[48,18,48,19],[49,18,49,19],[47,4,47,12],[48,4,48,12],[49,4,49,12],[50,4,50,12],[51,4,51,12],[11,17,11,18],[25,3,25,5],[26,3,26,19],[9,3,9,5],[8,3,8,6],[10,3,10,24],[12,22,12,23],[11,22,11,23],[21,4,21,5],[21,6,21,15],[21,16,21,18],[20,4,20,5],[20,6,20,15],[20,16,20,18],[12,16,12,18],[13,16,13,18],[14,16,14,18],[15,16,15,18],[13,4,13,5],[14,4,14,5],[15,4,15,5],[19,4,19,5],[19,6,19,15],[16,16,16,18],[52,18,52,19],[45,18,45,19],[41,18,41,19],[43,18,43,19],[44,18,44,19],[29,3,29,4],[29,6,29,10],[30,5,31,5],[12,6,12,15],[13,6,13,15],[14,6,14,15],[15,6,15,15],[22,6,22,15],[44,4,44,12],[39,3,39,16],[28,3,28,16],[35,3,35,4],[29,16,29,18],[30,14,31,15],[30,12,31,13],[30,3,31,4],[30,6,31,10],[17,16,17,18],[18,16,18,18],[58,3,60,8],[58,17,60,17],[58,10,60,15],[58,16,60,16],[57,10,57,15],[56,3,57,5],[40,3,40,10],[41,14,41,15],[41,16,41,17],[40,14,40,15],[40,16,40,17],[41,3,41,12],[43,4,43,12],[45,4,45,12],[46,4,46,12],[52,4,52,12],[1,1,1,7],[3,5,3,17],[5,1,5,15],[10,1,11,2],[26,1,27,2],[56,1,58,2],[46,18,46,19],[11,20,11,21],[35,16,35,18],[36,16,36,18],[35,6,35,8],[36,6,36,8],[35,9,35,10],[36,9,36,10],[34,6,34,8],[29,14,29,15],[30,11,31,11],[32,6,32,8],[40,18,40,19],[33,6,33,8],[12,3,12,5],[12,20,12,21],[11,6,11,16],[58,9,60,9]]}
[]
[null,{"$f":"valDistrName & \" (\"&valorg4code&\")\"","v":"OrgName (DIST)"}]
[]
[null,"Title II, Part A",null,null,null,"Educator Effectiveness (Fund Code 140)"]
[]
[null,"   Program Purpose\n    1) to increase student achievement consistent with challenging state standards;\n    2) to improve the quality and effectiveness of teachers, principals, and other school leaders;\n    3) to increase the number of teachers, principals, and other school leaders who are effective in improving student academic achievement in schools; and\n    4) provide low-income and minority students greater access to effective teachers, principals and other school leaders."]
[]
[]
[]
[]
[null,"Step 10.1\nDescribe Title II, Part A funded activities from Tab 5\nAll Title II Districts",null,"From Tab 5:  District Activities and Strategies\nColumns A & B will populate automatically from Tab 5, Step 5.5 for any activity that you indicate includes Title II, Part A funding.  Starting with Column C, describe only those activities from each strategy/activity that will be funded in whole or in part with Title II, Part A funds."]
[null,null,null,null,null,"A","B",null,null,null,null,null,null,null,null,null,null,"C",null,"E","F",null,"G",null,"H"]
[null,null,null,"Strategy/Activity",null,null,"Description ",null,null,null,null,null,null,null,null,null,"Describe specific activities funded by Title IIA ",null,null,"Is this activity/strategy explicitly connected to district efforts to close equity gaps?","What data prompted this activity?\n(Select at least one source for each activity; report additional sources/explanation in \"Other\" box at row's end)",null,"What data will you use to determine progress and attainment of goals for these activities?\n(Select at least one source for each activity; report additional sources/explanation in \"Other\" box at row's end)",null,"If  you selected \"Other\" in Column F or G,  please describe data that you will use here"]
[null,null,{"$f":"IF(AND(G14=\"\",E14=\"\"),1,0)","v":1},1,{"$f":"IF(ISBLANK('5. Districtwide Strategies'!D41),\"\",IF('5. Districtwide Strategies'!$O41<>\"\",'5. Districtwide Strategies'!D41,\"\"))","v":""},null,{"$f":"IF(ISBLANK('5. Districtwide Strategies'!E41),\"\",IF('5. Districtwide Strategies'!$O41<>\"\",'5. Districtwide Strategies'!E41,\"\"))","v":""},null,null,null,null,null,null,null,null,null,null,null,null,"Select One","Select One","Select One","Select One","Select One"]
[null,null,{"$f":"IF(AND(G15=\"\",E15=\"\"),1,0)","v":1},2,{"$f":"IF(ISBLANK('5. Districtwide Strategies'!D42),\"\",IF('5. Districtwide Strategies'!$O42<>\"\",'5. Districtwide Strategies'!D42,\"\"))","v":""},null,{"$f":"IF(ISBLANK('5. Districtwide Strategies'!E42),\"\",IF('5. Districtwide Strategies'!$O42<>\"\",'5. Districtwide Strategies'!E42,\"\"))","v":""},null,null,null,null,null,null,null,null,null,null,null,null,"Select One","Select One","Select One","Select One","Select One"]
[null,null,{"$f":"IF(AND(G16=\"\",E16=\"\"),1,0)","v":1},3,{"$f":"IF(ISBLANK('5. Districtwide Strategies'!D43),\"\",IF('5. Districtwide Strategies'!$O43<>\"\",'5. Districtwide Strategies'!D43,\"\"))","v":""},null,{"$f":"IF(ISBLANK('5. Districtwide Strategies'!E43),\"\",IF('5. Districtwide Strategies'!$O43<>\"\",'5. Districtwide Strategies'!E43,\"\"))","v":""},null,null,null,null,null,null,null,null,null,null,null,null,"Select One","Select One","Select One","Select One","Select One"]
[null,null,{"$f":"IF(AND(G17=\"\",E17=\"\"),1,0)","v":1},4,{"$f":"IF(ISBLANK('5. Districtwide Strategies'!D44),\"\",IF('5. Districtwide Strategies'!$O44<>\"\",'5. Districtwide Strategies'!D44,\"\"))","v":""},null,{"$f":"IF(ISBLANK('5. Districtwide Strategies'!E44),\"\",IF('5. Districtwide Strategies'!$O44<>\"\",'5. Districtwide Strategies'!E44,\"\"))","v":""},null,null,null,null,null,null,null,null,null,null,null,null,"Select One","Select One","Select One","Select One","Select One"]
[null,null,1,5,{"$f":"IF(ISBLANK('5. Districtwide Strategies'!D45),\"\",IF('5. Districtwide Strategies'!$O45<>\"\",'5. Districtwide Strategies'!D45,\"\"))","v":""},null,{"$f":"IF(ISBLANK('5. Districtwide Strategies'!E45),\"\",IF('5. Districtwide Strategies'!$O45<>\"\",'5. Districtwide Strategies'!E45,\"\"))","v":""},null,null,null,null,null,null,null,null,null,null,null,null,"Select One","Select One","Select One","Select One","Select One"]
[null,null,1,6,{"$f":"IF(ISBLANK('5. Districtwide Strategies'!D46),\"\",IF('5. Districtwide Strategies'!$O46<>\"\",'5. Districtwide Strategies'!D46,\"\"))","v":""},null,{"$f":"IF(ISBLANK('5. Districtwide Strategies'!E46),\"\",IF('5. Districtwide Strategies'!$O46<>\"\",'5. Districtwide Strategies'!E46,\"\"))","v":""},null,null,null,null,null,null,null,null,null,null,null,null,"Select One","Select One","Select One","Select One","Select One"]
[null,null,1,7,{"$f":"IF(ISBLANK('5. Districtwide Strategies'!D47),\"\",IF('5. Districtwide Strategies'!$O47<>\"\",'5. Districtwide Strategies'!D47,\"\"))","v":""},null,{"$f":"IF(ISBLANK('5. Districtwide Strategies'!E47),\"\",IF('5. Districtwide Strategies'!$O47<>\"\",'5. Districtwide Strategies'!E47,\"\"))","v":""},null,null,null,null,null,null,null,null,null,null,null,null,"Select One","Select One","Select One","Select One","Select One"]
[null,null,1,8,{"$f":"IF(ISBLANK('5. Districtwide Strategies'!D48),\"\",IF('5. Districtwide Strategies'!$O48<>\"\",'5. Districtwide Strategies'!D48,\"\"))","v":""},null,{"$f":"IF(ISBLANK('5. Districtwide Strategies'!E48),\"\",IF('5. Districtwide Strategies'!$O48<>\"\",'5. Districtwide Strategies'!E48,\"\"))","v":""},null,null,null,null,null,null,null,null,null,null,null,null,"Select One","Select One","Select One","Select One","Select One"]
[null,null,1,9,{"$f":"IF(ISBLANK('5. Districtwide Strategies'!D49),\"\",IF('5. Districtwide Strategies'!$O49<>\"\",'5. Districtwide Strategies'!D49,\"\"))","v":""},null,{"$f":"IF(ISBLANK('5. Districtwide Strategies'!E49),\"\",IF('5. Districtwide Strategies'!$O49<>\"\",'5. Districtwide Strategies'!E49,\"\"))","v":""},null,null,null,null,null,null,null,null,null,null,null,null,"Select One","Select One","Select One","Select One","Select One"]
[null,null,1,10,{"$f":"IF(ISBLANK('5. Districtwide Strategies'!D50),\"\",IF('5. Districtwide Strategies'!$O50<>\"\",'5. Districtwide Strategies'!D50,\"\"))","v":""},null,{"$f":"IF(ISBLANK('5. Districtwide Strategies'!E50),\"\",IF('5. Districtwide Strategies'!$O50<>\"\",'5. Districtwide Strategies'!E50,\"\"))","v":""},null,null,null,null,null,null,null,null,null,null,null,null,"Select One","Select One","Select One","Select One","Select One"]
[]
[]
[]
[null,"Step 10.2\nDescribe Title II, Part A funded activities not included in Tab 5\nAll Title II Districts",null,"Title II, Part A-funded activities not listed above from Tab 5.\nStarting with Column A, describe  activities not listed above that will be funded in whole or in part with Title II, Part A funds. "]
[]
[null,null,null,"Menu:  Please use menu and dropdown options for any Title II, Part A-funded activities in which your district plans to engage in FY20. Use the Narrative section, below, to describe Title II, Part A-funded activities not listed here."]
[null,null,null,"A",null,"B","C",null,null,null,null,"D","E",null,"F",null,"G"]
[null,null,null,"Is your district using  Title II, Part A funds to engage in any of these activities ?\n",null,"Yes or No?","Is your district using any of these substrategies?\n(Choose up to 2, if applicable. If you select  \"Other,\" please explain in the box at the row's end)",null,null,null,null,"Is this activity/strategy explicitly connected to district efforts to close equity gaps?","What data prompted this activity?\n(Select at least one source for each activity; report additional sources/explanation in \"Other\" box at row's end)",null,"What data will you use to determine progress and attainment of goals?\n(Select at least one source for each activity; report additional sources/explanation in \"Other\" box at row's end)",null,"If  you selected \"Other\" in Column C,G, or H,  please describe data that you will use here"]
[]
[null,null,null,"Cultivating a pipeline of educators through partnerships with preparation providers",null,"Select One","Select One",null,null,"Select One",null,"Select One","Select One","Select One","Select One","Select One"]
[null,null,null,"Implementing Induction & Mentoring Programs",null,"Select One","Select One",null,null,"Select One",null,"Select One","Select One","Select One","Select One","Select One"]
[null,null,null,"Implementing an Education Evaluation System that includes measures of student learning and staff/student feedback",null,"Select One","Select One",null,null,"Select One",null,"Select One","Select One","Select One","Select One","Select One"]
[null,null,null,"Providing High-Quality Professional Development",null,"Select One","Select One",null,null,"Select One",null,"Select One","Select One","Select One","Select One","Select One"]
[null,null,null,"Advancing and Recognizing educators",null,"Select One","Select One",null,null,"Select One",null,"Select One","Select One","Select One","Select One","Select One"]
[]
[]
[null,null,null,"Narrative:  For Title II, Part A-funded activities not listed above, please describe below in narrative format."]
[null,null,null,"A",null,null,null,null,null,null,null,null,null,"B","C",null,"D",null,"E"]
[null,null,null,"Describe activities funded by Title II, Part A not listed above",null,null,null,null,null,null,null,null,null,"Is this activity/strat-\negy explicitly connected to district efforts to close equity gaps?\n","What data prompted this activity?\n(Select at least one source for each activity; report additional sources/explanation in \"Other\" box at row's end)",null,"What data will you use to determine progress and attainment of goals?\n(Select at least one source for each activity; report additional sources/explanation in \"Other\" box at row's end)",null,"If  you selected \"Other\" in Column C or D,  please describe data/evidence here"]
[null,null,null,null,1]
[null,null,{"$f":"IF(E44=\"\",\"\",1)","v":""},1,null,null,null,null,null,null,null,null,null,"Select One","Select One","Select One","Select One","Select One"]
[null,null,"",2,null,null,null,null,null,null,null,null,null,"Select One","Select One","Select One","Select One","Select One"]
[null,null,"",3,null,null,null,null,null,null,null,null,null,"Select One","Select One","Select One","Select One","Select One"]
[null,null,"",4,null,null,null,null,null,null,null,null,null,"Select One","Select One","Select One","Select One","Select One"]
[null,null,"",5,null,null,null,null,null,null,null,null,null,"Select One","Select One","Select One","Select One","Select One"]
[null,null,"",6,null,null,null,null,null,null,null,null,null,"Select One","Select One","Select One","Select One","Select One"]
[null,null,"",7,null,null,null,null,null,null,null,null,null,"Select One","Select One","Select One","Select One","Select One"]
[null,null,"",8,null,null,null,null,null,null,null,null,null,"Select One","Select One","Select One","Select One","Select One"]
[null,null,"",9,null,null,null,null,null,null,null,null,null,"Select One","Select One","Select One","Select One","Select One"]
[null,null,"",10,null,null,null,null,null,null,null,null,null,"Select One","Select One","Select One","Select One","Select One"]
[]
[]
[]
[null,"Step 10.3\nTitle II Districts Using Funds for Class-Size Reduction"]
[null,null,null,null,null,null,null,null,null,"Y or N?","If \"yes,\" please cite the evidence supporting your decision to reduce class size and explain how the evidence supports your circumstances."]
[null,null,null,"Are you using Title II, Part A funds for class-size reduction?",null,null,null,null,null,"Select One",null,null,null,null,null,null,"Do you have enrollment data showing that class-size reduction is not supplanting use of state or local funds?","Select One"]
[]
[]
[]
[]
[]
[]
[]
[null,null,null,null,null,null,null,null,null,null,null,null,null,null,null,null,null," "]

{"sheet":"11. Title II, Part A Budget","index":13,"n_rows":126,"n_cols":31,"rows_kept":126,"cut":false,"hidden":false,"merged":[[90,21,90,22],[91,21,91,22],[89,21,89,22],[90,5,90,12],[63,21,63,22],[64,21,64,22],[65,21,65,22],[69,21,69,22],[70,21,70,22],[71,21,71,22],[72,21,72,22],[76,21,76,22],[77,21,77,22],[68,21,68,22],[75,21,75,22],[49,21,49,22],[53,21,53,22],[54,21,54,22],[55,21,55,22],[56,21,56,22],[57,21,57,22],[58,21,58,22],[62,21,62,22],[52,21,52,22],[61,21,61,22],[25,21,25,22],[26,21,26,22],[27,21,27,22],[28,21,28,22],[48,21,48,22],[32,21,32,22],[33,21,33,22],[34,21,34,22],[38,21,38,22],[39,21,39,22],[40,21,40,22],[41,21,41,22],[44,21,44,22],[45,21,45,22],[46,21,46,22],[47,21,47,22],[31,21,31,22],[37,21,37,22],[13,1,14,1],[99,4,99,12],[57,5,57,8],[58,5,58,8],[55,5,55,8],[56,5,56,8],[45,5,45,12],[47,5,47,12],[41,5,41,8],[48,5,48,12],[49,5,49,12],[38,5,38,8],[39,5,39,8],[40,5,40,8],[53,5,53,8],[54,5,54,8],[32,5,32,8],[33,5,33,8],[34,5,34,8],[28,5,28,8],[25,5,25,8],[26,5,26,8],[27,5,27,8],[19,5,19,8],[94,26,95,26],[99,19,99,24],[89,5,89,11],[69,5,69,11],[70,5,70,11],[71,5,71,11],[72,5,72,11],[62,5,62,11],[63,5,63,11],[64,5,64,11],[65,5,65,11],[80,5,80,11],[81,5,81,11],[84,10,84,11],[85,10,85,11],[86,10,86,11],[76,5,76,11],[77,5,77,11],[78,5,78,11],[79,5,79,11],[78,21,78,22],[79,21,79,22],[80,21,80,22],[81,21,81,22],[118,5,118,6],[118,7,118,8],[118,19,118,22],[118,24,118,25],[119,5,119,6],[119,7,119,8],[119,19,119,22],[119,24,119,25],[120,5,120,6],[120,7,120,8],[120,19,120,22],[120,24,120,25],[125,5,125,6],[125,7,125,8],[125,24,125,25],[134,4,134,7],[121,5,121,6],[121,7,121,8],[121,19,121,22],[121,24,121,25],[122,5,122,6],[122,7,122,8],[122,19,122,22],[122,24,122,25],[123,5,123,6],[123,7,123,8],[123,19,123,22],[123,24,123,25],[124,5,124,6],[124,7,124,8],[124,19,124,22],[124,24,124,25],[117,5,117,6],[117,7,117,8],[117,19,117,22],[117,24,117,25],[112,5,112,6],[112,7,112,8],[112,19,112,22],[112,24,112,25],[113,5,113,6],[113,7,113,8],[113,19,113,22],[113,24,113,25],[114,5,114,6],[114,7,114,8],[114,19,114,22],[114,24,114,25],[115,5,115,6],[115,7,115,8],[115,19,115,22],[115,24,115,25],[116,5,116,6],[116,7,116,8],[116,19,116,22],[116,24,116,25],[103,1,104,1],[103,3,103,29],[104,3,105,29],[106,3,106,10],[109,19,109,22],[110,5,111,6],[110,7,111,8],[110,10,111,16],[110,19,111,22],[110,24,111,25],[23,5,23,8],[24,5,24,8],[1,3,1,11],[1,21,1,25],[2,21,2,22],[6,9,6,10],[6,11,6,12],[14,4,14,12],[14,21,14,22],[17,5,17,8],[18,5,18,8],[16,5,16,8],[3,3,3,24],[5,7,6,8],[5,4,6,6],[16,21,16,22],[7,4,7,6],[7,7,7,8],[17,21,17,22],[18,21,18,22],[19,21,19,22],[23,21,23,22],[24,21,24,22],[22,21,22,22]]}
[]
[null,null,null,{"$f":"valDistrName & \" (\"&valorg4code&\")\"","v":"OrgName (DIST)"}]
[]
[null,null,null,"FY20 Title II, Part A (Fund Code 140) Budget Worksheet"]
[]
[null,null,null,null,"Allocation (before any flexing)",null,null,{"$f":"valAllocationT2","v":0}]
[]
[null,null,null,null,"Reservation for Equitable (Private-School) Services",null,null,{"$f":"ROUND(valPrivateSchoolT2, 0)","v":0}]
[]
[null,null,null,null,null,null,null,null,null,null,null,{"$f":"valDistrName","v":"OrgName"}]
[null,null,null,null,null,null,null,null,null,null,{"$f":"valDistrName","v":"OrgName"}]
[]
[]
[null,"Step 11.1\nAll Title II Districts"]
[null,null,null,null,"Line Item Category: Select an option from the drop down menu.",null,null,null,null,null,null,null,null,null,"Amount",null,"Expenditures (whole numbers)",null,null,"Primary Function",null,"Comments",null,null,"Flexed Funds \n(Which Title program rec'd Title II, Part A funds?)",null,"Amount Included in this expenditure for Equitable Services "]
[]
[null,null,null,null,1,"ADMINISTRATOR SALARIES:",null,null,null,null,"# of staff","Total FTE","MTRS",null,null,null,"Amount",null,null,"Select from Drop Down List",null,"Budget Detail",null,null,"Flexed Funds",null,"Amount"]
[null,null,null,null,null,"Select One",null,null,null,null,null,null,null,false,{"$f":"IF(N18,Q18,0)","v":0},null,null,null,null,"Select One",null,null,null,null,"Select, if applicable"]
[null,null,null,null,null,"Select One",null,null,null,null,null,null,null,false,{"$f":"IF(N19,Q19,0)","v":0},null,null,null,null,"Select One",null,null,null,null,"Select, if applicable"]
[null,null,null,null,null,"Select One",null,null,null,null,null,null,null,false,{"$f":"IF(N20,Q20,0)","v":0},null,null,null,null,"Select One",null,null,null,null,"Select, if applicable"]
[]
[null,null,null,null,"SUB-TOTAL",null,null,null,null,null,{"$f":"SUM(K18:K20)","v":0},{"$f":"SUM(L18:L20)","v":0},null,null,{"$f":"SUM(O18:O20)","v":0},null,{"$f":"SUM(Q18:Q20)","v":0},null,null,null,null,null,null,null,null,null,{"$f":"SUM(AA18:AA20)","v":0}]
[null,null,null,null,2,"INSTRUCTIONAL/PROF STAFF:",null,null,null,null,"# of staff","Total FTE","MTRS",null,null,null,"Amount",null,null,"Select from Drop Down List",null,"Budget Detail",null,null,"Flexed Funds",null,"Amount"]
[null,null,null,null,null,"Select One",null,null,null,null,null,null,null,false,{"$f":"IF(N24, Q24,0)","v":0},null,null,null,null,"Select One",null,null,null,null,"Select, if applicable"]
[null,null,null,null,null,"Select One",null,null,null,null,null,null,null,false,0,null,null,null,null,"Select One",null,null,null,null,"Select, if applicable"]
[null,null,null,null,null,"Select One",null,null,null,null,null,null,null,false,0,null,null,null,null,"Select One",null,null,null,null,"Select, if applicable"]
[null,null,null,null,null,"Select One",null,null,null,null,null,null,null,false,0,null,null,null,null,"Select One",null,null,null,null,"Select, if applicable"]
[null,null,null,null,null,"Select One",null,null,null,null,null,null,null,false,0,null,null,null,null,"Select One",null,null,null,null,"Select, if applicable"]
[null,null,null,null,null,"Select One",null,null,null,null,null,null,null,false,0,null,null,null,null,"Select One",null,null,null,null,"Select, if applicable"]
[]
[null,null,null,null,"SUB-TOTAL",null,null,null,null,null,{"$f":"SUM(K24:K29)","v":0},{"$f":"SUM(L24:L29)","v":0},null,null,{"$f":"SUM(O24:O29)","v":0},null,{"$f":"SUM(Q24:Q29)","v":0},null,null,null,null,null,null,null,null,null,{"$f":"SUM(AA24:AA29)","v":0}]
[null,null,null,null,3,"SUPPORT STAFF SALARIES:",null,null,null,null,"# of staff","Total FTE","MTRS",null,null,null,"Amount",null,null,"Select from Drop Down List",null,"Budget Detail",null,null,"Flexed Funds",null,"Amount"]
[null,null,null,null,null,"Select One",null,null,null,null,null,null,null,false,{"$f":"IF(N33,Q33,0)","v":0},null,null,null,null,"Select One",null,null,null,null,"Select, if applicable"]
[null,null,null,null,null,"Select One",null,null,null,null,null,null,null,false,{"$f":"IF(N34,Q34,0)","v":0},null,null,null,null,"Select One",null,null,null,null,"Select, if applicable"]
[null,null,null,null,null,"Select One",null,null,null,null,null,null,null,false,0,null,null,null,null,"Select One",null,null,null,null,"Select, if applicable"]
[]
[null,null,null,null,"SUB-TOTAL",null,null,null,null,null,{"$f":"SUM(K33:K35)","v":0},{"$f":"SUM(L33:L35)","v":0},null,null,{"$f":"SUM(O33:O35)","v":0},null,{"$f":"SUM(Q33:Q35)","v":0},null,null,null,null,null,null,null,null,null,{"$f":"SUM(AA33:AA35)","v":0}]
[null,null,null,null,4,"STIPENDS:",null,null,null,"# of Staff","Rate","Rate Type","MTRS",null,null,null,"Amount",null,null,"Select from Drop Down List",null,"Budget Detail",null,null,"Flexed Funds",null,"Amount"]
[null,null,null,null,null,"Select One",null,null,null,null,null,"select",null,false,{"$f":"IF(N39,Q39,0)","v":0},null,null,null,null,"Select One",null,null,null,null,"Select, if applicable"]
[null,null,null,null,null,"Select One",null,null,null,null,null,"select",null,false,{"$f":"IF(N40,Q40,0)","v":0},null,null,null,null,"Select One",null,null,null,null,"Select, if applicable"]
[null,null,null,null,null,"Select One",null,null,null,null,null,"select",null,false,0,null,null,null,null,"Select One",null,null,null,null,"Select, if applicable"]
[null,null,null,null,null,"Select One",null,null,null,null,null,"select",null,false,0,null,null,null,null,"Select One",null,null,null,null,"Select, if applicable"]
[]
[null,null,null,null,"SUB-TOTAL",null,null,null,null,null,null,null,null,null,{"$f":"SUM(O39:O42)","v":0},null,{"$f":"SUM(Q39:Q42)","v":0},null,null,null,null,null,null,null,null,null,{"$f":"SUM(AA39:AA42)","v":0}]
[null,null,null,null,5,"FRINGE BENEFITS:",null,null,null,null,null,null,null,null,null,null,"Amount",null,null,"Brief Description",null,"Budget Detail",null,null,"Flexed Funds",null,"Amount"]
[null,null,null,null,null,"5a  MTRS (automatically calculated if MTRS box is checked)  ",null,null,null,null,null,null,null,null,null,null,{"$f":"ROUND((SUM(O44,O37,O31,O22))*0.09,0)","v":0},null,null,null,null,null,null,null,"Select, if applicable"]
[null,null,null,null,null,"5b  Other",null,null,null,null,null,null,null,null,null,null,{"$f":"SUM(Q48:Q50)","v":0},null,null,null,null,null,null,null,"Select, if applicable"]
[null,null,null,null,null,"Health Insurance",null,null,null,null,null,null,null,null,null,null,null,null,null,null,null,null,null,null,"Select, if applicable"]
[null,null,null,null,null,"Other Retirement Systems",null,null,null,null,null,null,null,null,null,null,null,null,null,null,null,null,null,null,"Select, if applicable"]
[null,null,null,null,null,"Federal Insurance Contributions Act (FICA)",null,null,null,null,null,null,null,null,null,null,null,null,null,null,null,null,null,null,"Select, if applicable"]
[]
[null,null,null,null,"SUB-TOTAL",null,null,null,null,null,null,null,null,null,null,null,{"$f":"SUM(Q46:Q47)","v":0},null,null,null,null,null,null,null,null,null,{"$f":"SUM(AA46, AA48:AA50)","v":0}]
[null,null,null,null,6,"CONTRACTUAL SERVICES:",null,null,null,null,"Rate","Rate Type",null,null,null,null,"Amount",null,null,"Select from Drop Down List",null,"Budget Detail",null,null,"Flexed Funds",null,"Amount"]
[null,null,null,null,null,"Select One",null,null,null,null,null,"select",null,null,null,null,null,null,null,"Select One",null,null,null,null,"Select, if applicable"]
[null,null,null,null,null,"Select One",null,null,null,null,null,"select",null,null,null,null,null,null,null,"Select One",null,null,null,null,"Select, if applicable"]
[null,null,null,null,null,"Select One",null,null,null,null,null,"select",null,null,null,null,null,null,null,"Select One",null,null,null,null,"Select, if applicable"]
[null,null,null,null,null,"Select One",null,null,null,null,null,"select",null,null,null,null,null,null,null,"Select One",null,null,null,null,"Select, if applicable"]
[null,null,null,null,null,"Select One",null,null,null,null,null,"select",null,null,null,null,null,null,null,"Select One",null,null,null,null,"Select, if applicable"]
[null,null,null,null,null,"Select One",null,null,null,null,null,"select",null,null,null,null,null,null,null,"Select One",null,null,null,null,"Select, if applicable"]
[]
[null,null,null,null,"SUB-TOTAL",null,null,null,null,null,null,null,null,null,null,null,{"$f":"SUM(Q54:Q59)","v":0},null,null,null,null,null,null,null,null,null,{"$f":"SUM(AA54:AA59)","v":0}]
[null,null,null,null,7,"SUPPLIES AND MATERIALS:",null,null,null,null,null,null,null,null,null,null,"Amount",null,null,"Select from Drop Down List",null,"Budget Detail",null,null,"Flexed Funds",null,"Amount"]
[null,null,null,null,null,"Select One",null,null,null,null,null,null,null,null,null,null,null,null,null,"Select One",null,null,null,null,"Select, if applicable"]
[null,null,null,null,null,"Select One",null,null,null,null,null,null,null,null,null,null,null,null,null,"Select One",null,null,null,null,"Select, if applicable"]
[null,null,null,null,null,"Select One",null,null,null,null,null,null,null,null,null,null,null,null,null,"Select One",null,null,null,null,"Select, if applicable"]
[null,null,null,null,null,"Select One",null,null,null,null,null,null,null,null,null,null,null,null,null,"Select One",null,null,null,null,"Select, if applicable"]
[]
[null,null,null,null,"SUB-TOTAL",null,null,null,null,null,null,null,null,null,null,null,{"$f":"SUM(Q63:Q66)","v":0},null,null,null,null,null,null,null,null,null,{"$f":"SUM(AA63:AA66)","v":0}]
[null,null,null,null,8,"TRAVEL:  (mileage, conference registration, courses, hotels, etc.)",null,null,null,null,null,null,null,null,null,null,"Amount",null,null,"Select from Drop Down List",null,"Budget Detail",null,null,"Flexed Funds",null,"Amount"]
[null,null,null,null,null,"Select One",null,null,null,null,null,null,null,null,null,null,null,null,null,"Select One",null,null,null,null,"Select, if applicable"]
[null,null,null,null,null,"Select One",null,null,null,null,null,null,null,null,null,null,null,null,null,"Select One",null,null,null,null,"Select, if applicable"]
[null,null,null,null,null,"Select One",null,null,null,null,null,null,null,null,null,null,null,null,null,"Select One",null,null,null,null,"Select, if applicable"]
[null,null,null,null,null,"Select One",null,null,null,null,null,null,null,null,null,null,null,null,null,"Select One",null,null,null,null,"Select, if applicable"]
[]
[null,null,null,null,"SUB-TOTAL",null,null,null,null,null,null,null,null,null,null,null,{"$f":"SUM(Q70:Q73)","v":0},null,null,null,null,null,null,null,null,null,{"$f":"SUM(AA70:AA73)","v":0}]
[null,null,null,null,9,"OTHER COSTS:",null,null,null,null,null,null,null,null,null,null,"Amount",null,null,"Select from Drop Down List",null,"Budget Detail",null,null,"Flexed Funds",null,"Amount"]
[null,null,null,null,null,"Select One",null,null,null,null,null,null,null,null,null,null,null,null,null,"Select One",null,null,null,null,"Select, if applicable"]
[null,null,null,null,null,"Select One",null,null,null,null,null,null,null,null,null,null,null,null,null,"Select One",null,null,null,null,"Select, if applicable"]
[null,null,null,null,null,"Select One",null,null,null,null,null,null,null,null,null,null,null,null,null,"Select One",null,null,null,null,"Select, if applicable"]
[null,null,null,null,null,"Select One",null,null,null,null,null,null,null,null,null,null,null,null,null,"Select One",null,null,null,null,"Select, if applicable"]
[null,null,null,null,null,"Select One",null,null,null,null,null,null,null,null,null,null,null,null,null,"Select One",null,null,null,null,"Select, if applicable"]
[null,null,null,null,null,"Select One",null,null,null,null,null,null,null,null,null,null,null,null,null,"Select One",null,null,null,null,"Select, if applicable"]
[]
[null,null,null,null,"SUB-TOTAL",null,null,null,null,null,null,null,null,null,null,null,{"$f":"SUM(Q77:Q82)","v":0},null,null,null,null,null,null,null,null,null,{"$f":"SUM(AA77:AA82)","v":0}]
[null,null,null,null,null,null,null,null,"(a) rate (%)",null,"(b) eligible allocation less indirect"]
[null,null,null,null,10,"INDIRECT COSTS *",null,null,null,null,{"$f":"IF(I86=\"\",\"\", (H6-IndExclT2)/(1+I86))","v":""}]
[null,null,null,null,null,null,null,null," (a x b)",null,{"$f":"IFERROR(K86*I86,\"\")","v":""}]
[null,null,null,null,null,null,null,null,null,null,"   maximum allowed"]
[]
[null,null,null,null,11,"EQUIPMENT:\nItems costing $5,000+ per unit and having a useful life more than 1 year should also be listed",null,null,null,null,null,null,null,null,null,null,"Amount",null,null,"Select from Drop Down List",null,"Budget Detail",null,null,"Flexed Funds",null,"Amount"]
[null,null,null,null,null,"individually in Step 11.2, below (these expenditures are not eligible for recovery of indirect cost).",null,null,null,null,null,null,null,null,null,null,null,null,null,"Select One",null,null,null,null,"Select, if applicable"]
[null,null,null,null,null,null,null,null,null,null,null,null,null,null,null,null,null,null,null,"Select One",null,null,null,null,"Select, if applicable"]
[]
[null,null,null,null,"SUB-TOTAL",null,null,null,null,null,null,null,null,null,null,null,{"$f":"SUM(Q91:Q92)","v":0},null,null,null,null,null,null,null,null,null,{"$f":"SUM(AA91:AA92)","v":0}]
[null,null,null,null,null,null,null,null,null,null,null,null,null,null,null,null,null,null,null,null,null,null,null,null,null,null,"Total for Equitable Services  "]
[null,null,null,null,null,null,null,null,null,null,null,null,"         TOTAL FUNDS REQUESTED "]
[]
[null,null,null,null,null,null,null,null,null,null,null,null,null,null,null,null,{"$f":"Q94+Q86+Q84+Q75+Q68+Q61+T89+Q52+Q44+Q37+Q31+Q22","v":0},null,null,null,null,null,null,null,null,null,{"$f":"SUM(AA94+AA84+AA75+AA68+AA61+AA52+AA44+AA37+AA31+AA22)","v":0}]
[]
[null,null,null,null,"                                    DISCREPANCY:  Difference between allocation and budgeted total, if any",null,null,null,null,null,null,null,null,null,null,null,{"$f":"IFERROR(IF(Q98<>valAllocationT2,Q98-valAllocationT2,\"\"),\"\")","v":""},null,null,"                                            DISCREPANCY:  Difference between reservation and budgeted total, if any",null,null,null,null,null,null,{"$f":"IF(AA98<>H8,AA98-H8, \"\")","v":""}]
[]
[]
[]
[null,"Step 11.2\nTitle II Districts taking Indirect Costs",null,"Indirect Costs:  Major contracts and equipment"]
[null,null,null,"\nIndirect costs are those expenses of doing business that are not readily identifed with a particular grant, contract, project fund or activity, but are necessary for the general operation of the organization and the conduct of the activities it performs.  Because these expenses are difficult to track with precision across all benefiting sources, federal grants allow use of a rate as a mechanism for fairly and conveniently apportioning indirect costs across all programs within the boundaries of sound administrative principles.  \nSee U.S. Department of Education, Indirect Cost Overview (https://www2.ed.gov/about/offices/list/ocfo/intro.html). \n\nFor this grant, indirect costs must be consistent with the rate established by DESE's Office of School Finance.  Note that districts are allowed to take less than the maximum allowable for indirect costs. The decision to recover indirect costs using these established rates is a local option.  If indirect costs are recovered, they shall be returned to the general fund of the city or town in  accordance with G.L. Chapter 44, Section 53.  In the case of regional schools, indirect costs shall be returned to the regional school general fund.  www.doe.mass.edu/Grants/essential.html\n\nIn calculating the indirect cost allowable for a particular grant, some expenditures are not included.  Two such exclusions include a portion of major subawards or subcontracts (those exceeding $25,000), and capital costs (equipment purchases of $5,000 or more).  \nSee, U. S. Department of Education, Cost Allocation Guide for State and Local Governments.  https://www2.ed.gov/about/offices/list/ocfo/fipao/guideigcwebsite.pdf\n\n                                        •  Contracts:  For major contracts exceeding $25,000, districts may recover indirect costs on only the first $25,000 of each contract.   The remainder of the contract amount is excluded from application of the indirect cost rate.  Note that for contracts \n                                            for professional services normally provided in-house, such as a speech pathologist or school nurse, this exclusion does not apply, even if the contract exceeds $25,000.  Of course, these expenses are also subject to all other grant requirements \n                                            (allowability, allocability, necessarily and reasonable, etc.) to be properly chargeable to the grant as well.\n\n                                        • Equipment:  All equipment costing $5,000 or more and having a useful life of more than 1 year is considered a capital expenditure and not eligible for recovery of indirect cost.  The total for equipment should match the total entered in Line 11, above.\n\nDirections:  List contracts exceeding $25,000 below (but not those for professional services normally provided in house) and the amount to be excluded will be calculated automatically.  The excluded amount will be added to the equipment total (Line 11) and subtracted from your district's allocation before calculating your district's maximum allowable indirect cost on Line 10."]
[]
[]
[null,null,null,null," "]
[null,null,null,null,null,"Contracts exceeding $25,000 (include in budget categories above in addition to listing individually here)",null,null,null,null,null,null,null,null,null,null,null,null,null,"Equipment:  (from Line 11, above)"]
[null,null,null,null,null,null,null,null,null,null,null,null,null,null,null,null,null,"    List Items costing $5,000+ per unit and having a useful life of more than 1 year.  ",null,"List Items costing $5,000+ per unit and having a useful life of more than 1 year.  "]
[null,null,null,null,null,"Amount of contract:",null,"Amount excluded from indirect cost:",null,null,"  Description:",null,null,null,null,null,null,null,null,"  Description:",null,null,null,null,"Amount:"]
[]
[null,null,null,null,null,null,null,{"$f":"IF((F113-25000)>0, (F113-25000), \"\")","v":""}]
[null,null,null,null,null,null,null,{"$f":"IF((F114-25000)>0, (F114-25000), \"\")","v":""}]
[null,null,null,null,null,null,null,""]
[null,null,null,null,null,null,null,""]
[null,null,null,null,null,null,null,""]
[null,null,null,null,null,null,null,""]
[null,null,null,null,null,null,null,""]
[null,null,null,null,null,null,null,""]
[null,null,null,null,null,null,null,""]
[null,null,null,null,null,null,null,""]
[null,null,null,null,null,null,null,""]
[null,null,null,null,null,null,null,""]
[null,null,null,null,null,null,null,"",null,null,null,null,null,null,null,null,null,null,null,null,null,null,null,null,null,null,null,null,null,null,{"$f":"IndKT2+IndEquipT2","v":0}]
[null,null,null,null,"SUB-TOTAL",{"$f":"SUM(F113:G125)","v":0},null,{"$f":"SUM(H113:I125)","v":0},null,null,null,null,null,null,null,null,null,null,null,null,null,null,"SUB-TOTAL",null,{"$f":"SUM(Y113:Y125)","v":0}]

{"sheet":"12. Title III, Part A Narrative","index":14,"n_rows":37,"n_cols":22,"rows_kept":37,"cut":false,"hidden":false,"merged":[[8,1,9,1],[24,1,25,1],[31,16,31,18],[32,3,32,6],[32,8,32,9],[32,10,32,11],[32,16,32,18],[29,16,29,18],[30,3,30,6],[30,8,30,9],[30,10,30,11],[30,16,30,18],[26,10,26,11],[10,4,10,11],[25,12,25,13],[25,2,25,6],[13,21,13,26],[14,4,14,11],[14,12,14,13],[14,21,14,26],[15,4,15,11],[15,12,15,13],[15,21,15,26],[16,21,16,26],[17,4,17,11],[17,12,17,13],[17,21,17,26],[29,3,29,6],[29,8,29,9],[29,10,29,11],[31,3,31,6],[31,8,31,9],[31,10,31,11],[12,4,12,11],[11,12,11,13],[12,12,12,13],[16,4,16,11],[16,12,16,13],[13,4,13,11],[13,12,13,13],[1,2,1,7],[36,16,36,18],[24,2,24,18],[25,16,25,18],[25,7,25,11],[36,3,36,6],[26,14,26,15],[25,14,25,15],[35,3,35,6],[34,8,34,9],[33,16,33,18],[34,16,34,18],[35,16,35,18],[2,2,2,4],[2,5,2,13],[10,2,10,3],[11,21,11,26],[12,21,12,26],[33,10,33,11],[26,16,26,18],[28,16,28,18],[18,21,18,26],[19,21,19,26],[20,21,20,26],[18,12,18,13],[19,12,19,13],[20,12,20,13],[18,4,18,11],[19,4,19,11],[20,4,20,11],[28,8,28,9],[11,4,11,11],[4,2,4,13],[10,12,10,13],[8,2,8,26],[9,21,9,23],[10,17,10,18],[10,19,10,20],[10,21,10,26],[39,2,45,4],[39,5,45,14],[26,12,26,13],[38,2,38,4],[36,8,36,9],[36,10,36,11],[26,8,26,9],[35,8,35,9],[35,10,35,11],[28,3,28,6],[33,3,33,6],[34,3,34,6],[28,10,28,11],[33,8,33,9],[34,10,34,11],[26,2,26,6]]}
[]
[null,null,{"$f":"valDistrName & \" (\"&valorg4code&\")\"","v":"OrgName (DIST)"}]
[null,null,"Title III, Part A",null,null,"Support for English Learners (Fund Code 180)"]
[]
[null,null,"   Program Purpose\n       1) to help ensure that English learners, including immigrant children and youth, attain English proficiency and develop high levels of academic\n             achievement in English;\n       2) to assist all English learners, including immigrant children and youth, to achieve at high levels in academic subjects so that all English learners \n             can meet the same  challenging State academic standards that all children are expected to meet;\n       3) to assist teachers (including preschool teachers), principals and other school leaders, State educational agencies, local educational agencies, \n             and schools in establishing, implementing, and sustaining effective language instruction educational programs designed to assist in teaching\n             English learners, including immigrant children and youth;\n       4) to assist teachers (including preschool teachers), principals and other school leaders, State educational agencies, and local educational agencies \n             to develop and enhance their capacity to provide effective instructional programs designed to prepare English learners, including immigrant children\n             and youth, to enter all-English instructional settings;  and\n       5) to promote parental, family, and community participation in language instruction educational programs for the parents, families, and communities of\n              English  learners."]
[]
[]
[]
[null,"Step 12.1\n(All Title III, Part A Recipients must complete)","From Tab 5:  District Activities and Strategies\nColumns A & B will populate automatically from Tab 5, Step 5.5 for any activity that you indicate includes Title III, Part A funding.  Starting with Column C, describe only those activities from each strategy/activity that will be funded in whole or in part with Title III, Part A funds."]
[null,null,null,"A",null,null,null,null,"B",null,null,null,null,"C","D","E","F",null,"G",null,"H","I"]
[null,null,"Strategy/Activity",null,"Description ",null,null,null,null,null,null,null,"Describe specific activities or aspects of activities funded by Title III, Part A",null,"Supplemental to federal, state, and local funding?\n","This activity is intended to help English Learners increase their English language proficiency\n","This activity is intended to help English Learners meet standards in Massachusetts Curriculum Frameworks\n","What data prompted this activity?\n(Select at least one source for each activity; report additional sources/explanation in \"Other\" box at row's end)",null,"What data will you use to determine progress and attainment of goals?\n(Select at least one source for each activity; report additional sources/explanation in \"Other\" box at row's end)",null,"If  you selected \"Other\" in Column G  or H,  please describe data that you will use here"]
[null,{"$f":"IF(AND(D12=\"\",E12=\"\"),1,0)","v":1},1,{"$f":"IF(ISBLANK('5. Districtwide Strategies'!D41),\"\",IF('5. Districtwide Strategies'!P41<>\"\",'5. Districtwide Strategies'!D41,\"\"))","v":""},{"$f":"IF(ISBLANK('5. Districtwide Strategies'!E41),\"\",IF('5. Districtwide Strategies'!P41<>\"\",'5. Districtwide Strategies'!E41,\"\"))","v":""},null,null,null,null,null,null,null,null,null,"Select One","Select One","Select One","Select One","Select One","Select One","Select One"]
[null,1,2,{"$f":"IF(ISBLANK('5. Districtwide Strategies'!D42),\"\",IF('5. Districtwide Strategies'!P42<>\"\",'5. Districtwide Strategies'!D42,\"\"))","v":""},{"$f":"IF(ISBLANK('5. Districtwide Strategies'!E42),\"\",IF('5. Districtwide Strategies'!P42<>\"\",'5. Districtwide Strategies'!E42,\"\"))","v":""},null,null,null,null,null,null,null,null,null,"Select One","Select One","Select One","Select One","Select One","Select One","Select One"]
[null,{"$f":"IF(AND(D14=\"\",E14=\"\"),1,0)","v":1},3,{"$f":"IF(ISBLANK('5. Districtwide Strategies'!D43),\"\",IF('5. Districtwide Strategies'!P43<>\"\",'5. Districtwide Strategies'!D43,\"\"))","v":""},{"$f":"IF(ISBLANK('5. Districtwide Strategies'!E43),\"\",IF('5. Districtwide Strategies'!P43<>\"\",'5. Districtwide Strategies'!E43,\"\"))","v":""},null,null,null,null,null,null,null,null,null,"Select One","Select One","Select One","Select One","Select One","Select One","Select One"]
[null,{"$f":"IF(AND(D15=\"\",E15=\"\"),1,0)","v":1},4,{"$f":"IF(ISBLANK('5. Districtwide Strategies'!D44),\"\",IF('5. Districtwide Strategies'!P44<>\"\",'5. Districtwide Strategies'!D44,\"\"))","v":""},{"$f":"IF(ISBLANK('5. Districtwide Strategies'!E44),\"\",IF('5. Districtwide Strategies'!P44<>\"\",'5. Districtwide Strategies'!E44,\"\"))","v":""},null,null,null,null,null,null,null,null,null,"Select One","Select One","Select One","Select One","Select One","Select One","Select One"]
[null,1,5,{"$f":"IF(ISBLANK('5. Districtwide Strategies'!D45),\"\",IF('5. Districtwide Strategies'!P45<>\"\",'5. Districtwide Strategies'!D45,\"\"))","v":""},{"$f":"IF(ISBLANK('5. Districtwide Strategies'!E45),\"\",IF('5. Districtwide Strategies'!P45<>\"\",'5. Districtwide Strategies'!E45,\"\"))","v":""},null,null,null,null,null,null,null,null,null,"Select One","Select One","Select One","Select One","Select One","Select One","Select One"]
[null,1,6,{"$f":"IF(ISBLANK('5. Districtwide Strategies'!D46),\"\",IF('5. Districtwide Strategies'!P46<>\"\",'5. Districtwide Strategies'!D46,\"\"))","v":""},{"$f":"IF(ISBLANK('5. Districtwide Strategies'!E46),\"\",IF('5. Districtwide Strategies'!P46<>\"\",'5. Districtwide Strategies'!E46,\"\"))","v":""},null,null,null,null,null,null,null,null,null,"Select One","Select One","Select One","Select One","Select One","Select One","Select One"]
[null,1,7,{"$f":"IF(ISBLANK('5. Districtwide Strategies'!D47),\"\",IF('5. Districtwide Strategies'!P47<>\"\",'5. Districtwide Strategies'!D47,\"\"))","v":""},{"$f":"IF(ISBLANK('5. Districtwide Strategies'!E47),\"\",IF('5. Districtwide Strategies'!P47<>\"\",'5. Districtwide Strategies'!E47,\"\"))","v":""},null,null,null,null,null,null,null,null,null,"Select One","Select One","Select One","Select One","Select One","Select One","Select One"]
[null,1,8,{"$f":"IF(ISBLANK('5. Districtwide Strategies'!D48),\"\",IF('5. Districtwide Strategies'!P48<>\"\",'5. Districtwide Strategies'!D48,\"\"))","v":""},{"$f":"IF(ISBLANK('5. Districtwide Strategies'!E48),\"\",IF('5. Districtwide Strategies'!P48<>\"\",'5. Districtwide Strategies'!E48,\"\"))","v":""},null,null,null,null,null,null,null,null,null,"Select One","Select One","Select One","Select One","Select One","Select One","Select One"]
[null,1,9,{"$f":"IF(ISBLANK('5. Districtwide Strategies'!D49),\"\",IF('5. Districtwide Strategies'!P49<>\"\",'5. Districtwide Strategies'!D49,\"\"))","v":""},{"$f":"IF(ISBLANK('5. Districtwide Strategies'!E49),\"\",IF('5. Districtwide Strategies'!P49<>\"\",'5. Districtwide Strategies'!E49,\"\"))","v":""},null,null,null,null,null,null,null,null,null,"Select One","Select One","Select One","Select One","Select One","Select One","Select One"]
[null,1,10,{"$f":"IF(ISBLANK('5. Districtwide Strategies'!D50),\"\",IF('5. Districtwide Strategies'!P50<>\"\",'5. Districtwide Strategies'!D50,\"\"))","v":""},{"$f":"IF(ISBLANK('5. Districtwide Strategies'!E50),\"\",IF('5. Districtwide Strategies'!P50<>\"\",'5. Districtwide Strategies'!E50,\"\"))","v":""},null,null,null,null,null,null,null,null,null,"Select One","Select One","Select One","Select One","Select One","Select One","Select One"]
[]
[]
[]
[null,"Step 12.2\n(All Title III, Part A Recipients must complete)","Title III, Part A-funded activities not listed above from Tab 5.\nStarting with Column A, describe  activities not listed above that will be funded in whole or in part with Title III, Part A funds. "]
[null,null,"A",null,null,null,null,"B",null,null,null,null,"C",null,"D",null,"E"]
[null,null,"Describe activities funded by Title III not  listed above",null,null,null,null,"Supplemental to federal, state, and local funding?\n","This activity is intended to help English Learners increase their English language proficiency\n",null,"This activity is intended to help English Learners meet standards in Massachusetts Curriculum Frameworks",null,"What data prompted this activity?\n(Select at least one source for each activity; report additional sources/explanation in \"Other\" box at row's end)",null,"What data will you use to determine progress and attainment of goals?\n(Select at least one source for each activity; report additional sources/explanation in \"Other\" box at row's end)",null,"If  you selected \"Other\" in Column C or D,  please describe data that you will use  here"]
[null,null,null,"A"]
[null,null,1,null,null,null,null,"Select One","Select One",null,"Select One",null,"Select One","Select One","Select One","Select One"]
[null,null,2,null,null,null,null,"Select One","Select One",null,"Select One",null,"Select One","Select One","Select One","Select One"]
[null,null,3,null,null,null,null,"Select One","Select One",null,"Select One",null,"Select One","Select One","Select One","Select One"]
[null,null,4,null,null,null,null,"Select One","Select One",null,"Select One",null,"Select One","Select One","Select One","Select One"]
[null,null,5,null,null,null,null,"Select One","Select One",null,"Select One",null,"Select One","Select One","Select One","Select One"]
[null,null,6,null,null,null,null,"Select One","Select One",null,"Select One",null,"Select One","Select One","Select One","Select One"]
[null,null,7,null,null,null,null,"Select One","Select One",null,"Select One",null,"Select One","Select One","Select One","Select One"]
[null,null,8,null,null,null,null,"Select One","Select One",null,"Select One",null,"Select One","Select One","Select One","Select One"]
[null,null,9,null,null,null,null,"Select One","Select One",null,"Select One",null,"Select One","Select One","Select One","Select One"]

{"sheet":"13. Title III, Part A Budget","index":15,"n_rows":128,"n_cols":32,"rows_kept":128,"cut":false,"hidden":false,"merged":[[96,22,97,27],[99,23,99,25],[101,23,101,25],[126,5,126,6],[126,7,126,8],[126,19,126,22],[126,24,126,25],[127,5,127,6],[127,7,127,8],[127,24,127,25],[125,5,125,6],[125,7,125,8],[125,19,125,22],[125,24,125,25],[117,7,117,8],[117,19,117,22],[117,24,117,25],[118,5,118,6],[118,7,118,8],[118,19,118,22],[118,24,118,25],[119,5,119,6],[119,7,119,8],[119,19,119,22],[14,1,15,1],[101,4,101,12],[97,12,97,18],[123,5,123,6],[123,7,123,8],[123,19,123,22],[123,24,123,25],[124,5,124,6],[124,7,124,8],[124,19,124,22],[124,24,124,25],[120,5,120,6],[120,7,120,8],[120,19,120,22],[120,24,120,25],[121,5,121,6],[121,7,121,8],[121,19,121,22],[121,24,121,25],[122,5,122,6],[122,7,122,8],[122,19,122,22],[122,24,122,25],[117,5,117,6],[119,24,119,25],[114,5,114,6],[114,7,114,8],[114,19,114,22],[114,24,114,25],[115,5,115,6],[115,7,115,8],[115,19,115,22],[115,24,115,25],[116,5,116,6],[116,7,116,8],[116,19,116,22],[116,24,116,25],[105,1,106,1],[105,3,105,29],[106,3,107,29],[108,3,108,10],[111,19,111,22],[112,5,113,6],[112,7,113,8],[112,10,113,16],[112,19,113,22],[112,24,113,25],[90,5,90,12],[90,21,90,22],[91,5,91,11],[91,21,91,22],[92,5,92,11],[92,21,92,22],[93,21,93,22],[81,5,81,11],[81,21,81,22],[82,5,82,11],[82,21,82,22],[83,4,83,12],[85,10,85,11],[86,10,86,11],[87,10,87,11],[66,5,66,11],[66,21,66,22],[80,21,80,22],[76,21,76,22],[67,5,67,7],[69,5,69,11],[69,21,69,22],[70,5,70,11],[70,21,70,22],[71,5,71,11],[72,5,72,11],[73,5,73,11],[73,21,73,22],[74,4,74,12],[71,21,71,22],[72,21,72,22],[77,5,77,11],[77,21,77,22],[78,5,78,11],[78,21,78,22],[79,5,79,11],[79,21,79,22],[80,5,80,11],[47,21,47,22],[48,5,48,12],[48,21,48,22],[62,21,62,22],[63,5,63,11],[63,21,63,22],[64,5,64,11],[64,21,64,22],[65,5,65,11],[65,21,65,22],[45,5,45,12],[45,21,45,22],[46,21,46,22],[57,21,57,22],[58,5,58,8],[58,21,58,22],[59,5,59,8],[59,21,59,22],[60,4,60,12],[53,21,53,22],[54,5,54,8],[54,21,54,22],[55,5,55,8],[55,21,55,22],[56,5,56,8],[56,21,56,22],[57,5,57,8],[49,5,49,12],[49,21,49,22],[50,5,50,12],[50,21,50,22],[51,4,51,12],[46,5,46,12],[47,5,47,12],[42,5,42,8],[42,21,42,22],[43,4,43,12],[44,4,44,8],[33,5,33,8],[33,21,33,22],[34,5,34,8],[34,21,34,22],[35,5,35,8],[35,21,35,22],[36,4,36,12],[37,4,37,8],[38,21,38,22],[39,5,39,8],[39,21,39,22],[40,5,40,8],[40,21,40,22],[41,5,41,8],[41,21,41,22],[29,5,29,8],[29,21,29,22],[30,4,30,12],[30,21,30,22],[31,4,31,8],[32,5,32,8],[32,21,32,22],[26,5,26,8],[26,21,26,22],[27,5,27,8],[27,21,27,22],[28,5,28,8],[28,21,28,22],[20,5,20,8],[20,21,20,22],[21,21,21,22],[22,4,22,8],[23,21,23,22],[24,5,24,8],[24,21,24,22],[25,5,25,8],[25,21,25,22],[18,5,18,8],[18,21,18,22],[19,5,19,8],[19,21,19,22],[1,3,1,11],[2,21,2,22],[3,3,3,22],[6,9,6,10],[6,11,6,12],[15,4,15,12],[15,21,15,22],[17,5,17,8],[17,21,17,22],[5,7,6,8],[5,4,6,6],[7,4,7,6],[7,7,7,8]]}
[]
[null,null,null,{"$f":"valDistrName & \" (\"&valorg4code&\")\"","v":"OrgName (DIST)"}]
[]
[null,null,null,"FY20 Title III, Part A (Fund Code 180) Budget Worksheet"]
[]
[null,null,null,null,"Allocation (before any flexing)",null,null,{"$f":"valAllocationT3","v":0}]
[]
[null,null,null,null,"Reservation for Equitable (Private-School) Services",null,null,{"$f":"ROUND(valPrivateSchoolT3, 0)","v":0}]
[]
[]
[null,null,null,null,null,null,null,null,null,null,null,{"$f":"valDistrName","v":"OrgName"}]
[null,null,null,null,null,null,null,null,null,null,{"$f":"valDistrName","v":"OrgName"}]
[]
[]
[null,"Step 13.1\nAll Title III Districts"]
[null,null,null,null,"Line Item Category: Select an option from the drop down menu.",null,null,null,null,null,null,null,null,null,"Amount",null,"Expenditures (whole numbers)",null,null,"Primary Function",null,"Comments",null,null,null,"Amount Included in this expenditure for Equitable Services "]
[]
[null,null,null,null,1,"ADMINISTRATOR SALARIES:",null,null,null,null,"# of staff","Total FTE","MTRS",null,null,null,"Amount",null,null,"Select from Drop Down List",null,"Budget Detail",null,null,null,"Amount"]
[null,null,null,null,null,"Select One",null,null,null,null,null,null,null,false,{"$f":"IF(N19,Q19,0)","v":0},null,null,null,null,"Select One"]
[null,null,null,null,null,"Select One",null,null,null,null,null,null,null,false,{"$f":"IF(N20,Q20,0)","v":0},null,null,null,null,"Select One"]
[null,null,null,null,null,"Select One",null,null,null,null,null,null,null,false,{"$f":"IF(N21,Q21,0)","v":0},null,null,null,null,"Select One"]
[]
[null,null,null,null,"SUB-TOTAL",null,null,null,null,null,{"$f":"SUM(K19:K21)","v":0},{"$f":"SUM(L19:L21)","v":0},null,null,{"$f":"SUM(O19:O21)","v":0},null,{"$f":"SUM(Q19:Q21)","v":0},null,null,null,null,null,null,null,null,{"$f":"SUM(Z19:Z21)","v":0}]
[null,null,null,null,2,"INSTRUCTIONAL/PROF STAFF:",null,null,null,null,"# of staff","Total FTE","MTRS",null,null,null,"Amount",null,null,"Select from Drop Down List",null,"Budget Detail",null,null,null,"Amount"]
[null,null,null,null,null,"Select One",null,null,null,null,null,null,null,true,{"$f":"IF(N25, Q25,0)","v":0},null,null,null,null,"Select One"]
[null,null,null,null,null,"Select One",null,null,null,null,null,null,null,true,{"$f":"IF(N26, Q26,0)","v":0},null,null,null,null,"Select One"]
[null,null,null,null,null,"Select One",null,null,null,null,null,null,null,true,0,null,null,null,null,"Select One"]
[null,null,null,null,null,"Select One",null,null,null,null,null,null,null,false,0,null,null,null,null,"Select One"]
[null,null,null,null,null,"Select One",null,null,null,null,null,null,null,false,0,null,null,null,null,"Select One"]
[null,null,null,null,null,"Select One",null,null,null,null,null,null,null,true,{"$f":"IF(N30, Q30,0)","v":0},null,null,null,null,"Select One"]
[]
[null,null,null,null,"SUB-TOTAL",null,null,null,null,null,{"$f":"SUM(K25:K30)","v":0},{"$f":"SUM(L25:L30)","v":0},null,null,{"$f":"SUM(O25:O30)","v":0},null,{"$f":"SUM(Q25:Q30)","v":0},null,null,null,null,null,null,null,null,{"$f":"SUM(Z25:Z30)","v":0}]
[null,null,null,null,3,"SUPPORT STAFF SALARIES:",null,null,null,null,"# of staff","Total FTE","MTRS",null,null,null,"Amount",null,null,"Select from Drop Down List",null,"Budget Detail",null,null,null,"Amount"]
[null,null,null,null,null,"Select One",null,null,null,null,null,null,null,false,{"$f":"IF(N34, Q34, 0)","v":0},null,null,null,null,"Select One"]
[null,null,null,null,null,"Select One",null,null,null,null,null,null,null,false,{"$f":"IF(N35, Q35, 0)","v":0},null,null,null,null,"Select One"]
[null,null,null,null,null,"Select One",null,null,null,null,null,null,null,false,0,null,null,null,null,"Select One"]
[]
[null,null,null,null,"SUB-TOTAL",null,null,null,null,null,{"$f":"SUM(K34:K36)","v":0},{"$f":"SUM(L34:L36)","v":0},null,null,{"$f":"SUM(O34:O36)","v":0},null,{"$f":"SUM(Q34:Q36)","v":0},null,null,null,null,null,null,null,null,{"$f":"SUM(Z34:Z36)","v":0}]
[null,null,null,null,4,"STIPENDS:",null,null,null,"# of Staff","Rate","Rate Type","MTRS",null,null,null,"Amount",null,null,"Select from Drop Down List",null,"Budget Detail",null,null,null,"Amount"]
[null,null,null,null,null,"Select One",null,null,null,null,null,"select",null,false,{"$f":"IF(N40, Q40, 0)","v":0},null,null,null,null,"Select One"]
[null,null,null,null,null,"Select One",null,null,null,null,null,"select",null,false,{"$f":"IF(N41, Q41, 0)","v":0},null,null,null,null,"Select One"]
[null,null,null,null,null,"Select One",null,null,null,null,null,"select",null,false,0,null,null,null,null,"Select One"]
[null,null,null,null,null,"Select One",null,null,null,null,null,"select",null,false,0,null,null,null,null,"Select One"]
[]
[null,null,null,null,"SUB-TOTAL",null,null,null,null,null,null,null,null,null,{"$f":"SUM(O40:O43)","v":0},null,{"$f":"SUM(Q40:Q43)","v":0},null,null,null,null,null,null,null,null,{"$f":"SUM(Z40:Z43)","v":0}]
[null,null,null,null,5,"FRINGE BENEFITS:",null,null,null,null,null,null,null,null,null,null,"Amount",null,null,"Brief Description",null,"Budget Detail",null,null,null,"Amount"]
[null,null,null,null,null,"5a  MTRS (automatically calculated if MTRS box is checked)  ",null,null,null,null,null,null,null,null,null,null,{"$f":"ROUND((SUM(O45,O38,O32,O23))*0.09,0)","v":0}]
[null,null,null,null,null,"5b  Other",null,null,null,null,null,null,null,null,null,null,{"$f":"SUM(Q49:Q51)","v":0}]
[null,null,null,null,null,"Health Insurance"]
[null,null,null,null,null,"Other Retirement Systems"]
[null,null,null,null,null,"Federal Insurance Contributions Act (FICA)"]
[]
[null,null,null,null,"SUB-TOTAL",null,null,null,null,null,null,null,null,null,null,null,{"$f":"SUM(Q47:Q48)","v":0},null,null,null,null,null,null,null,null,{"$f":"SUM(Z47, Z49:Z51)","v":0}]
[null,null,null,null,6,"CONTRACTUAL SERVICES:",null,null,null,null,"Rate","Rate Type",null,null,null,null,"Amount",null,null,"Select from Drop Down List",null,"Budget Detail",null,null,null,"Amount"]
[null,null,null,null,null,"Select One",null,null,null,null,null,"select",null,null,null,null,null,null,null,"Select One"]
[null,null,null,null,null,"Select One",null,null,null,null,null,"select",null,null,null,null,null,null,null,"Select One"]
[null,null,null,null,null,"Select One",null,null,null,null,null,"select",null,null,null,null,null,null,null,"Select One"]
[null,null,null,null,null,"Select One",null,null,null,null,null,"select",null,null,null,null,null,null,null,"Select One"]
[null,null,null,null,null,"Select One",null,null,null,null,null,"select",null,null,null,null,null,null,null,"Select One"]
[null,null,null,null,null,"Select One",null,null,null,null,null,"select",null,null,null,null,null,null,null,"Select One"]
[]
[null,null,null,null,"SUB-TOTAL",null,null,null,null,null,null,null,null,null,null,null,{"$f":"SUM(Q55:Q60)","v":0},null,null,null,null,null,null,null,null,{"$f":"SUM(Z55:Z60)","v":0}]
[null,null,null,null,7,"SUPPLIES AND MATERIALS:",null,null,null,null,null,null,null,null,null,null,"Amount",null,null,"Select from Drop Down List",null,"Budget Detail",null,null,null,"Amount"]
[null,null,null,null,null,"Select One",null,null,null,null,null,null,null,null,null,null,null,null,null,"Select One"]
[null,null,null,null,null,"Select One",null,null,null,null,null,null,null,null,null,null,null,null,null,"Select One"]
[null,null,null,null,null,"Select One",null,null,null,null,null,null,null,null,null,null,null,null,null,"Select One"]
[null,null,null,null,null,"Select One",null,null,null,null,null,null,null,null,null,null,null,null,null,"Select One"]
[]
[null,null,null,null,"SUB-TOTAL",null,null,null,null,null,null,null,null,null,null,null,{"$f":"SUM(Q64:Q67)","v":0},null,null,null,null,null,null,null,null,{"$f":"SUM(Z64:Z67)","v":0}]
[null,null,null,null,8,"TRAVEL:  (mileage, conference registration, courses, hotels, etc.)",null,null,null,null,null,null,null,null,null,null,"Amount",null,null,"Select from Drop Down List",null,"Budget Detail",null,null,null,"Amount"]
[null,null,null,null,null,"Select One",null,null,null,null,null,null,null,null,null,null,null,null,null,"Select One"]
[null,null,null,null,null,"Select One",null,null,null,null,null,null,null,null,null,null,null,null,null,"Select One"]
[null,null,null,null,null,"Select One",null,null,null,null,null,null,null,null,null,null,null,null,null,"Select One"]
[null,null,null,null,null,"Select One",null,null,null,null,null,null,null,null,null,null,null,null,null,"Select One"]
[]
[null,null,null,null,"SUB-TOTAL",null,null,null,null,null,null,null,null,null,null,null,{"$f":"SUM(Q71:Q74)","v":0},null,null,null,null,null,null,null,null,{"$f":"SUM(Z71:Z74)","v":0}]
[null,null,null,null,9,"OTHER COSTS:",null,null,null,null,null,null,null,null,null,null,"Amount",null,null,"Select from Drop Down List",null,"Budget Detail",null,null,null,"Amount"]
[null,null,null,null,null,"Select One",null,null,null,null,null,null,null,null,null,null,null,null,null,"Select One"]
[null,null,null,null,null,"Select One",null,null,null,null,null,null,null,null,null,null,null,null,null,"Select One"]
[null,null,null,null,null,"Select One",null,null,null,null,null,null,null,null,null,null,null,null,null,"Select One"]
[null,null,null,null,null,"Select One",null,null,null,null,null,null,null,null,null,null,null,null,null,"Select One"]
[null,null,null,null,null,"Select One",null,null,null,null,null,null,null,null,null,null,null,null,null,"Select One"]
[null,null,null,null,null,"Select One",null,null,null,null,null,null,null,null,null,null,null,null,null,"Select One"]
[]
[null,null,null,null,"SUB-TOTAL",null,null,null,null,null,null,null,null,null,null,null,{"$f":"SUM(Q78:Q83)","v":0},null,null,null,null,null,null,null,null,{"$f":"SUM(Z78:Z83)","v":0}]
[null,null,null,null,null,null,null,null,"(a) rate (%)",null,"(b) eligible allocation less indirect"]
[null,null,null,null,10,"INDIRECT COSTS *",null,null,null,null,{"$f":"IF(I87=\"\",\"\", (H6-IndExclT3)/(1+I87))","v":""}]
[null,null,null,null,null,null,null,null," (a x b)",null,{"$f":"IFERROR(K87*I87,\"\")","v":""}]
[null,null,null,null,null,null,null,null,null,null,"   maximum allowed"]
[]
[null,null,null,null,11,"EQUIPMENT:\nItems costing $5,000+ per unit and having a useful life more than 1 year should also be listed individually in Step 13.2, below (these expenditures are not eligible for recovery of indirect costs).",null,null,null,null,null,null,null,null,null,null,"Amount",null,null,"Select from Drop Down List",null,"Budget Detail",null,null,null,"Amount"]
[null,null,null,null,null,null,null,null,null,null,null,null,null,null,null,null,null,null,null,"Select One"]
[null,null,null,null,null,null,null,null,null,null,null,null,null,null,null,null,null,null,null,"Select One"]
[]
[null,null,null,null,"SUB-TOTAL",null,null,null,null,null,null,null,null,null,null,null,{"$f":"SUM(Q92:Q93)","v":0},null,null,null,null,null,null,null,null,{"$f":"SUM(Z92:Z93)","v":0}]
[]
[null,null,null,null,null,null,null,null,null,null,null,null,null,null,null,null,null,null,null,null,null,null,"Total for Equitable Services  "]
[null,null,null,null,null,null,null,null,null,null,null,null,"               TOTAL FUNDS REQUESTED "]
[]
[null,null,null,null,null,null,null,null,null,null,null,null,null,null,null,null,{"$f":"Q95+Q87+Q85+Q76+Q69+Q62+Q53+Q45+Q38+Q32+Q23","v":0},null,null,null,null,null,null,{"$f":"SUM(Z95+Z85+Z76+Z69+Z62+Z53+Z45+Z38+Z32+Z23)","v":0}]
[]
[null,null,null,null,"                                    DISCREPANCY:  Difference between allocation and budgeted total, if any",null,null,null,null,null,null,null,null,null,null,null,{"$f":"IFERROR(IF(Q100<>valAllocationT3,Q100-valAllocationT3,\"\"), 0)","v":""},null,null,"                                       DISCREPANCY:  Difference between reservation and budgeted total, if any",null,null,null,{"$f":"IF(X100<>H8,X100-H8,\"\")","v":""}]
[]
[]
[]
[null,"Step 13.2\nTitle III Districts taking Indirect Costs",null,"Indirect Costs:  Major contracts and equipment"]
[null,null,null,"\nIndirect costs are those expenses of doing business that are not readily identifed with a particular grant, contract, project fund or activity, but are necessary for the general operation of the organization and the conduct of the activities it performs.  Because these expenses are difficult to track with precision across all benefiting sources, federal grants allow use of a rate as a mechanism for fairly and conveniently apportioning indirect costs across all programs within the boundaries of sound administrative principles.  \nSee U.S. Department of Education, Indirect Cost Overview (https://www2.ed.gov/about/offices/list/ocfo/intro.html). \n\nFor this grant, indirect costs must be consistent with the rate established by DESE's Office of School Finance.  Note that districts are allowed to take less than the maximum allowable for indirect costs. The decision to recover indirect costs using these established rates is a local option.  If indirect costs are recovered, they shall be returned to the general fund of the city or town in  accordance with G.L. Chapter 44, Section 53.  In the case of regional schools, indirect costs shall be returned to the regional school general fund.  www.doe.mass.edu/Grants/essential.html\n\nIn calculating the indirect cost allowable for a particular grant, some expenditures are not included.  Two such exclusions include a portion of major subawards or subcontracts (those exceeding $25,000), and capital costs (equipment purchases of $5,000 or more).  \nSee, U. S. Department of Education, Cost Allocation Guide for State and Local Governments.  https://www2.ed.gov/about/offices/list/ocfo/fipao/guideigcwebsite.pdf\n\n                                        •  Contracts:  For major contracts exceeding $25,000, districts may recover indirect costs on only the first $25,000 of each contract.   The remainder of the contract amount is excluded from application of the indirect cost rate.  Note that for contracts \n                                            for professional services normally provided in-house, such as a speech pathologist or school nurse, this exclusion does not apply, even if the contract exceeds $25,000.  Of course, these expenses are also subject to all other grant requirements \n                                            (allowability, allocability, necessarily and reasonable, etc.) to be properly chargeable to the grant as well.\n\n                                        • Equipment:  All equipment costing $5,000 or more and having a useful life of more than 1 year is considered a capital expenditure and not eligible for recovery of indirect cost.  The total for equipment should match the total entered in Line 11, above.\n\nDirections:  List contracts exceeding $25,000 below (but not those for professional services normally provided in house) and the amount to be excluded will be calculated automatically.  The excluded amount will be added to the equipment total (Line 11) and subtracted from your district's allocation before calculating your district's maximum allowable indirect cost on Line 10."]
[]
[]
[null,null,null,null," "]
[null,null,null,null,null,"Contracts exceeding $25,000 (include in budget categories above in addition to listing individually here)",null,null,null,null,null,null,null,null,null,null,null,null,null,"Equipment:  (from Line 11, above)"]
[null,null,null,null,null,null,null,null,null,null,null,null,null,null,null,null,null,null,null,"List Items costing $5,000+ per unit and having a useful life of more than 1 year.  "]
[null,null,null,null,null,"Amount of contract:",null,"Amount excluded from indirect cost:",null,null,"  Description:",null,null,null,null,null,null,null,null,"  Description:",null,null,null,null,"Amount:"]
[]
[null,null,null,null,null,null,null,{"$f":"IF((F115-25000)>0, (F115-25000), \"\")","v":""}]
[null,null,null,null,null,null,null,{"$f":"IF((F116-25000)>0, (F116-25000), \"\")","v":""}]
[null,null,null,null,null,null,null,""]
[null,null,null,null,null,null,null,""]
[null,null,null,null,null,null,null,""]
[null,null,null,null,null,null,null,""]
[null,null,null,null,null,null,null,""]
[null,null,null,null,null,null,null,""]
[null,null,null,null,null,null,null,""]
[null,null,null,null,null,null,null,""]
[null,null,null,null,null,null,null,""]
[null,null,null,null,null,null,null,""]
[null,null,null,null,null,null,null,"",null,null,null,null,null,null,null,null,null,null,null,null,null,null,null,null,null,null,null,null,null,null,null,{"$f":"IndKT3+IndEquipT3","v":0}]
[null,null,null,null,"SUB-TOTAL",{"$f":"SUM(F115:G127)","v":0},null,{"$f":"SUM(H115:I127)","v":0},null,null,null,null,null,null,null,null,null,null,null,null,null,null,"SUB-TOTAL",null,{"$f":"SUM(Y115:Y127)","v":0}]

{"sheet":"14. Title IV, Part A Narrative","index":16,"n_rows":53,"n_cols":22,"rows_kept":53,"cut":false,"hidden":false,"merged":[[25,1,26,1],[8,1,9,1],[43,1,45,1],[52,2,52,8],[1,2,1,8],[36,19,36,21],[33,3,33,8],[33,14,33,16],[33,17,33,18],[33,19,33,21],[34,3,34,8],[34,14,34,16],[34,17,34,18],[34,19,34,21],[35,3,35,8],[35,14,35,16],[35,17,35,18],[35,19,35,21],[17,4,17,11],[17,12,17,13],[17,21,17,22],[31,19,31,21],[32,3,32,8],[10,17,11,18],[10,19,11,20],[10,12,11,13],[21,12,21,13],[12,12,12,13],[19,4,19,11],[14,21,14,22],[15,4,15,11],[15,12,15,13],[15,21,15,22],[14,4,14,11],[14,12,14,13],[19,12,19,13],[19,21,19,22],[13,4,13,11],[13,12,13,13],[13,21,13,22],[16,4,16,11],[16,12,16,13],[16,21,16,22],[18,4,18,11],[18,12,18,13],[18,21,18,22],[36,3,36,8],[36,14,36,16],[36,17,36,18],[26,14,26,18],[20,21,20,22],[21,21,21,22],[32,19,32,21],[32,14,32,16],[32,17,32,18],[30,17,30,18],[25,2,25,21],[27,14,28,18],[26,9,26,11],[26,2,26,8],[20,12,20,13],[51,2,51,8],[39,3,39,8],[2,6,2,14],[4,2,4,15],[21,4,21,11],[12,4,12,11],[10,4,11,11],[10,2,11,3],[8,2,8,21],[10,14,10,16],[20,4,20,11],[27,9,27,11],[30,3,30,8],[37,3,37,8],[27,2,28,8],[27,12,28,13],[38,3,38,8],[30,14,30,16],[37,14,37,16],[37,17,37,18],[38,17,38,18],[31,3,31,8],[31,14,31,16],[31,17,31,18],[53,3,53,11],[50,2,50,8],[43,12,56,16],[39,17,39,18],[9,17,9,18],[9,19,9,20],[9,12,9,13],[26,12,26,13],[26,19,26,21],[37,19,37,21],[38,19,38,21],[39,19,39,21],[38,14,38,16],[27,19,28,21],[30,19,30,21],[39,14,39,16],[10,21,11,22],[12,21,12,22],[43,2,43,10],[46,2,46,8],[47,2,47,8],[48,2,48,8],[45,2,45,8],[49,2,49,8]]}
[]
[null,null,{"$f":"valDistrName & \" (\"&valorg4code&\")\"","v":"OrgName (DIST)"}]
[null,null,"Title IV, Part A",null,null,null,"Student Support and Academic Enrichment (Fund Code 309)"]
[]
[null,null,"   Program Purpose\n     Improving students' academic achievement by:\n       1. Providing all students with access to a well-rounded education;\n       2. Improving school conditions for learning; and\n       3. Improving the use of technology in order to improve academic achievement and digital literacy of all students.  "]
[]
[]
[]
[null,"Step 14.1\n(All Title IV, Part A Recipients must complete)","From Tab 5:  District Activities and Strategies\nColumns A & B will populate automatically from Tab 5, Step 5.5 for any activity that you indicate includes Title IV, Part A funding.  Starting with Column C, describe only those activities from each strategy/activity that will be funded in whole or in part with Title IV, Part A funds."]
[null,null,null,"A",null,null,null,null,"B",null,null,null,"C",null,null,"D",null,"E",null,"F",null,"G"]
[null,null,"Strategy/Activity",null,"Description ",null,null,null,null,null,null,null,"Describe specific activities funded by Title IVA, including any partnerships with outside organizations",null,"Indicate Title IVA categories each activity supports\n(Yes or No)\nEach activity must have a \"yes\" in at least one category",null,null,"What data prompted this activity?\n(Select at least one source for each activity; report additional sources/explanation in \"Other\" box at row's end)",null,"What data will you use to determine progress and attainment of goals?\n(Select at least one source for each activity; report additional sources/explanation in \"Other\" box at row's end)",null,"If  you selected \"Other\" in Column E or F,  please describe data you will use here"]
[null,null,null,null,null,null,null,null,null,null,null,null,null,null,"Access to Well Rounded Education","Safe and Healthy Schools","Effective Use of Technology"]
[null,{"$f":"IF(AND(D13=\"\",E13=\"\"),1,0)","v":1},1,{"$f":"IF(ISBLANK('5. Districtwide Strategies'!D41),\"\",IF('5. Districtwide Strategies'!Q41<>\"\",'5. Districtwide Strategies'!D41,\"\"))","v":""},{"$f":"IF(ISBLANK('5. Districtwide Strategies'!E41),\"\",IF('5. Districtwide Strategies'!Q41<>\"\",'5. Districtwide Strategies'!E41,\"\"))","v":""},null,null,null,null,null,null,null,null,null,"Select One","Select One","Select One","Select One","Select One","Select One","Select One"]
[null,1,2,{"$f":"IF(ISBLANK('5. Districtwide Strategies'!D42),\"\",IF('5. Districtwide Strategies'!Q42<>\"\",'5. Districtwide Strategies'!D42,\"\"))","v":""},{"$f":"IF(ISBLANK('5. Districtwide Strategies'!E42),\"\",IF('5. Districtwide Strategies'!Q42<>\"\",'5. Districtwide Strategies'!E42,\"\"))","v":""},null,null,null,null,null,null,null,null,null,"Select One","Select One","Select One","Select One","Select One","Select One","Select One"]
[null,{"$f":"IF(AND(D15=\"\",E15=\"\"),1,0)","v":1},3,{"$f":"IF(ISBLANK('5. Districtwide Strategies'!D43),\"\",IF('5. Districtwide Strategies'!Q43<>\"\",'5. Districtwide Strategies'!D43,\"\"))","v":""},{"$f":"IF(ISBLANK('5. Districtwide Strategies'!E43),\"\",IF('5. Districtwide Strategies'!Q43<>\"\",'5. Districtwide Strategies'!E43,\"\"))","v":""},null,null,null,null,null,null,null,null,null,"Select One","Select One","Select One","Select One","Select One","Select One","Select One"]
[null,{"$f":"IF(AND(D16=\"\",E16=\"\"),1,0)","v":1},4,{"$f":"IF(ISBLANK('5. Districtwide Strategies'!D44),\"\",IF('5. Districtwide Strategies'!Q44<>\"\",'5. Districtwide Strategies'!D44,\"\"))","v":""},{"$f":"IF(ISBLANK('5. Districtwide Strategies'!E44),\"\",IF('5. Districtwide Strategies'!Q44<>\"\",'5. Districtwide Strategies'!E44,\"\"))","v":""},null,null,null,null,null,null,null,null,null,"Select One","Select One","Select One","Select One","Select One","Select One","Select One"]
[null,1,5,{"$f":"IF(ISBLANK('5. Districtwide Strategies'!D45),\"\",IF('5. Districtwide Strategies'!Q45<>\"\",'5. Districtwide Strategies'!D45,\"\"))","v":""},{"$f":"IF(ISBLANK('5. Districtwide Strategies'!E45),\"\",IF('5. Districtwide Strategies'!Q45<>\"\",'5. Districtwide Strategies'!E45,\"\"))","v":""},null,null,null,null,null,null,null,null,null,"Select One","Select One","Select One","Select One","Select One","Select One","Select One"]
[null,1,6,{"$f":"IF(ISBLANK('5. Districtwide Strategies'!D46),\"\",IF('5. Districtwide Strategies'!Q46<>\"\",'5. Districtwide Strategies'!D46,\"\"))","v":""},{"$f":"IF(ISBLANK('5. Districtwide Strategies'!E46),\"\",IF('5. Districtwide Strategies'!Q46<>\"\",'5. Districtwide Strategies'!E46,\"\"))","v":""},null,null,null,null,null,null,null,null,null,"Select One","Select One","Select One","Select One","Select One","Select One","Select One"]
[null,1,7,{"$f":"IF(ISBLANK('5. Districtwide Strategies'!D47),\"\",IF('5. Districtwide Strategies'!Q47<>\"\",'5. Districtwide Strategies'!D47,\"\"))","v":""},{"$f":"IF(ISBLANK('5. Districtwide Strategies'!E47),\"\",IF('5. Districtwide Strategies'!Q47<>\"\",'5. Districtwide Strategies'!E47,\"\"))","v":""},null,null,null,null,null,null,null,null,null,"Select One","Select One","Select One","Select One","Select One","Select One","Select One"]
[null,1,8,{"$f":"IF(ISBLANK('5. Districtwide Strategies'!D48),\"\",IF('5. Districtwide Strategies'!Q48<>\"\",'5. Districtwide Strategies'!D48,\"\"))","v":""},{"$f":"IF(ISBLANK('5. Districtwide Strategies'!E48),\"\",IF('5. Districtwide Strategies'!Q48<>\"\",'5. Districtwide Strategies'!E48,\"\"))","v":""},null,null,null,null,null,null,null,null,null,"Select One","Select One","Select One","Select One","Select One","Select One","Select One"]
[null,1,9,{"$f":"IF(ISBLANK('5. Districtwide Strategies'!D49),\"\",IF('5. Districtwide Strategies'!Q49<>\"\",'5. Districtwide Strategies'!D49,\"\"))","v":""},{"$f":"IF(ISBLANK('5. Districtwide Strategies'!E49),\"\",IF('5. Districtwide Strategies'!Q49<>\"\",'5. Districtwide Strategies'!E49,\"\"))","v":""},null,null,null,null,null,null,null,null,null,"Select One","Select One","Select One","Select One","Select One","Select One","Select One"]
[null,1,10,{"$f":"IF(ISBLANK('5. Districtwide Strategies'!D50),\"\",IF('5. Districtwide Strategies'!Q50<>\"\",'5. Districtwide Strategies'!D50,\"\"))","v":""},{"$f":"IF(ISBLANK('5. Districtwide Strategies'!E50),\"\",IF('5. Districtwide Strategies'!Q50<>\"\",'5. Districtwide Strategies'!E50,\"\"))","v":""},null,null,null,null,null,null,null,null,null,"Select One","Select One","Select One","Select One","Select One","Select One","Select One"]
[]
[]
[]
[null,"Step 14.2\n(All Title IVA Recipients must complete)","Title IVA-funded activities not listed above from Tab 5.\nStarting with Column A, describe  activities not listed above that will be funded in whole or in part with Title IV, Part A funds. "]
[null,null,"A",null,null,null,null,null,null,"B",null,null,"C",null,"D",null,null,null,null,"E"]
[null,null,"Describe specific activities funded by Title IVA, including any partnerships with outside organizations.",null,null,null,null,null,null,"Indicate which Title IVA categories each activity supports (Yes or No)\nEach activity must have a \"yes\" in at least one category",null,null,"What data prompted this activity?\n(Select at least one source for each activity; report additional sources/explanation in \"Other\" box at row's end)",null,"What data will you use to determine progress and attainment of goals?\n(Select at least one source for each activity; report additional sources/explanation in \"Other\" box at row's end)",null,null,null,null,"If  you selected \"Other\" in Column C or D,  please describe data you will use here"]
[null,null,null,null,null,null,null,null,null,"Access to Well Rounded Education","Safe and Healthy Schools","Effective Use of Technology"]
[null,null,null,"A"]
[null,null,1,null,null,null,null,null,null,"Select One","Select One","Select One","Select One","Select One","Select One",null,null,"Select One"]
[null,null,2,null,null,null,null,null,null,"Select One","Select One","Select One","Select One","Select One","Select One",null,null,"Select One"]
[null,null,3,null,null,null,null,null,null,"Select One","Select One","Select One","Select One","Select One","Select One",null,null,"Select One"]
[null,null,4,null,null,null,null,null,null,"Select One","Select One","Select One","Select One","Select One","Select One",null,null,"Select One"]
[null,null,5,null,null,null,null,null,null,"Select One","Select One","Select One","Select One","Select One","Select One",null,null,"Select One"]
[null,null,6,null,null,null,null,null,null,"Select One","Select One","Select One","Select One","Select One","Select One",null,null,"Select One"]
[null,null,7,null,null,null,null,null,null,"Select One","Select One","Select One","Select One","Select One","Select One",null,null,"Select One"]
[null,null,8,null,null,null,null,null,null,"Select One","Select One","Select One","Select One","Select One","Select One",null,null,"Select One"]
[null,null,9,null,null,null,null,null,null,"Select One","Select One","Select One","Select One","Select One","Select One",null,null,"Select One"]
[null,null,10,null,null,null,null,null,null,"Select One","Select One","Select One","Select One","Select One","Select One",null,null,"Select One"]
[]
[]
[]
[null,"Step 14.3\n(Only for districts with\n ≥ $30,000 in Title IVA funds)","Only Districts with ≥$30, 000 in Title IVA Funds (after Flexing)\n ALLOCATION OF TITLE IVA FUNDS",null,null,null,null,null,null,null,null,null,"\nInstructions:  Districts with less than $30,000 in Title IV, Part A funds after flexing do not complete this section (cells will automatically be populated with \"N/A\").  For all others, insert dollar figures for each of the spending categories in Column A that have not been prepopulated.  If an activity includes more than one category, please allocate funds among the categories included to the best of your ability. \n\nDistricts with an allocation of at least $30,000 must: \n  • Conduct a comprehensive needs assessment that includes a focus on the Title IV, Part A priorities \n    (see above.) Note: Districts may fulfill (or have fulfilled) this requirement as part of the development \n    of the districts' strategic plan, improvement plan, etc. reported on Tab 5.\n\n  • Spend at least 20% of the allocation on access to well-rounded educational opportunities\n\n  • Spend at least 20% of the allocation on safe and healthy schools\n\n  • Spend some amount on improving the use of technology\n\n  • Spend the remainder on activities that support any/all of the three priorities\n\n  • No more than 15 percent of Title IVA allocation used for activities to support the effective use of \n    technology may be used for purchasing technology infrastructure. (e.g., devices, equipment, \n    software applications, platforms, digital instructional resources and/or other one-time IT purchases).  However, there is no cap   \n    on expenditures for technology infrastructure, including software,when such infrastructure is supporting safe and healthy \n    schools and/or well-rounded education.\n\n  •  If funding does not meet above requirements, cell will turn red indicating an error.  Please adjust \n     spending accordingly."]
[null,null,null,null,null,null,null,null,null,"$","%"]
[null,null,"Amount available for Title IVA spending (after flexing)",null,null,null,null,null,null,{"$f":"IF(valAllocationFlexT4>=30000, valAllocationFlexT4, \"N/A\")","v":"N/A"}]
[null,null,"Equitable participation for private school students (from private school tab)",null,null,null,null,null,null,{"$f":"IF(J46=\"N/A\", \"N/A\", ROUND(valPrivateSchoolT4,0))","v":"N/A"},{"$f":"IFERROR(J47/$J$46,\"\")","v":""}]
[null,null,"1. District Administration (no more than 2% of Title IVA allocation, after flexing)",null,null,null,null,null,null,null,{"$f":"IFERROR($J$48/$J$46,\"\")","v":""}]
[null,null,"2. Access to Well-Rounded Education (at least 20%)",null,null,null,null,null,null,null,{"$f":"IFERROR($J$49/$J$46, \"\")","v":""}]
[null,null,"3. Safe and Healthy Schools (at least 20%)",null,null,null,null,null,null,null,{"$f":"IFERROR(J50/$J$46,\"\")","v":""}]
[null,null,"4. Effective Use of Technology (must be > $0)",null,null,null,null,null,null,null,{"$f":"IFERROR(J51/$J$46, \"\")","v":""}]
[null,null,"5. Effective Use of Technology: Infrastructure.  Enter amount from Line 4. being spent\n    on infrastructure (may not exceed 15% of total technology expenditures in Line 4)",null,null,null,null,null,null,null,{"$f":"IFERROR($J$52/$J$51, \"N/A\")","v":"N/A"}]
[null,null,"Total ",null,null,null,null,null,null,{"$f":"SUM(J47:J52)","v":0},{"$f":"IFERROR(J53/J46,\"\")","v":""}]

{"sheet":"15. Title IV, Part A Budget","index":17,"n_rows":128,"n_cols":32,"rows_kept":128,"cut":false,"hidden":false,"merged":[[96,24,97,27],[97,12,97,18],[101,4,101,12],[7,4,7,6],[7,7,7,8],[126,5,126,6],[126,7,126,8],[126,19,126,22],[126,24,126,25],[122,5,122,6],[122,7,122,8],[122,19,122,22],[122,24,122,25],[117,5,117,6],[117,7,117,8],[117,19,117,22],[117,24,117,25],[118,5,118,6],[118,7,118,8],[118,19,118,22],[118,24,118,25],[119,5,119,6],[119,7,119,8],[119,19,119,22],[127,5,127,6],[127,7,127,8],[127,24,127,25],[14,1,15,1],[123,5,123,6],[123,7,123,8],[123,19,123,22],[123,24,123,25],[124,5,124,6],[124,7,124,8],[124,19,124,22],[124,24,124,25],[125,5,125,6],[125,7,125,8],[125,19,125,22],[125,24,125,25],[120,5,120,6],[120,7,120,8],[120,19,120,22],[120,24,120,25],[121,5,121,6],[121,7,121,8],[121,19,121,22],[121,24,121,25],[119,24,119,25],[114,5,114,6],[114,7,114,8],[114,19,114,22],[114,24,114,25],[115,5,115,6],[115,7,115,8],[115,19,115,22],[115,24,115,25],[116,5,116,6],[116,7,116,8],[116,19,116,22],[116,24,116,25],[105,1,106,1],[105,3,105,29],[106,3,107,29],[108,3,108,10],[111,19,111,22],[112,5,113,6],[112,7,113,8],[112,10,113,16],[112,19,113,22],[112,24,113,25],[90,5,90,12],[90,21,90,22],[91,21,91,22],[92,5,92,11],[92,21,92,22],[93,21,93,22],[81,5,81,11],[81,21,81,22],[82,5,82,11],[82,21,82,22],[83,4,83,12],[85,10,85,11],[86,10,86,11],[87,10,87,11],[62,21,62,22],[63,5,63,11],[63,21,63,22],[64,5,64,11],[64,21,64,22],[71,21,71,22],[72,21,72,22],[76,21,76,22],[3,3,3,24],[74,4,74,12],[49,5,49,12],[49,21,49,22],[50,5,50,12],[50,21,50,22],[51,4,51,12],[65,5,65,11],[65,21,65,22],[66,5,66,11],[66,21,66,22],[57,21,57,22],[58,5,58,8],[58,21,58,22],[59,5,59,8],[59,21,59,22],[77,5,77,11],[77,21,77,22],[78,5,78,11],[78,21,78,22],[79,5,79,11],[79,21,79,22],[80,5,80,11],[80,21,80,22],[67,5,67,7],[69,5,69,11],[69,21,69,22],[70,5,70,11],[70,21,70,22],[71,5,71,11],[72,5,72,11],[73,5,73,11],[73,21,73,22],[60,4,60,12],[53,21,53,22],[54,5,54,8],[54,21,54,22],[55,5,55,8],[55,21,55,22],[56,5,56,8],[56,21,56,22],[57,5,57,8],[46,5,46,12],[47,5,47,12],[47,21,47,22],[48,5,48,12],[48,21,48,22],[42,5,42,8],[42,21,42,22],[43,4,43,12],[44,4,44,8],[45,5,45,12],[45,21,45,22],[46,21,46,22],[36,4,36,12],[37,4,37,8],[38,21,38,22],[39,5,39,8],[39,21,39,22],[40,5,40,8],[40,21,40,22],[41,5,41,8],[41,21,41,22],[33,5,33,8],[33,21,33,22],[34,5,34,8],[34,21,34,22],[35,5,35,8],[35,21,35,22],[29,5,29,8],[29,21,29,22],[30,4,30,12],[30,21,30,22],[31,4,31,8],[32,5,32,8],[32,21,32,22],[28,5,28,8],[28,21,28,22],[20,5,20,8],[20,21,20,22],[21,21,21,22],[22,4,22,8],[23,21,23,22],[24,5,24,8],[24,21,24,22],[25,5,25,8],[25,21,25,22],[17,5,17,8],[17,21,17,22],[18,5,18,8],[18,21,18,22],[19,5,19,8],[19,21,19,22],[26,5,26,8],[26,21,26,22],[27,5,27,8],[27,21,27,22],[1,3,1,11],[1,21,1,25],[2,21,2,22],[6,4,6,6],[6,7,6,8],[6,9,6,10],[6,11,6,12],[14,3,14,25],[15,4,15,12],[15,21,15,22]]}
[]
[null,null,null,{"$f":"valDistrName & \" (\"&valorg4code&\")\"","v":"OrgName (DIST)"}]
[]
[null,null,null,"FY20 Title IV, Part A (Fund Code 309) Budget WorkSheet"]
[]
[]
[null,null,null,null,"Allocation (before any flexing)",null,null,{"$f":"valAllocationT4","v":0}]
[null,null,null,null,"Reservation for Equitable (Private-School) Services",null,null,{"$f":"ROUND(valPrivateSchoolT4, 0)","v":0}]
[]
[]
[null,null,null,null,null,null,null,null,null,null,null,{"$f":"valDistrName","v":"OrgName"}]
[null,null,null,null,null,null,null,null,null,null,{"$f":"valDistrName","v":"OrgName"}]
[]
[]
[null,"Step 15.1\nAll Title IV Districts "]
[null,null,null,null,"Line Item Category: Select an option from the drop down menu.",null,null,null,null,null,null,null,null,null,"Amount",null,"Expenditures (whole numbers)",null,null,"Primary Function",null,"Comments",null,null,"Flexed Funds \n(Which Title program rec'd Title IV, Part A funds?)",null,null,"Amount Included in this expenditure for Equitable Services "]
[]
[null,null,null,null,1,"ADMINISTRATOR SALARIES:",null,null,null,null,"# of staff","Total FTE","MTRS",null,null,null,"Amount",null,null,"Select from Drop Down List",null,"Budget Detail",null,null,"Flexed Funds",null,null,"Amount"]
[null,null,null,null,null,"Select One",null,null,null,null,null,null,null,false,{"$f":"IF(N19,Q19,0)","v":0},null,null,null,null,"Select One",null,null,null,null,"Select, if applicable"]
[null,null,null,null,null,"Select One",null,null,null,null,null,null,null,false,{"$f":"IF(N20,Q20,0)","v":0},null,null,null,null,"Select One",null,null,null,null,"Select, if applicable"]
[null,null,null,null,null,"Select One",null,null,null,null,null,null,null,false,{"$f":"IF(N21,Q21,0)","v":0},null,null,null,null,"Select One",null,null,null,null,"Select, if applicable"]
[]
[null,null,null,null,"SUB-TOTAL",null,null,null,null,null,{"$f":"SUM(K19:K21)","v":0},{"$f":"SUM(L19:L21)","v":0},null,null,{"$f":"SUM(O19:O21)","v":0},null,{"$f":"SUM(Q19:Q21)","v":0},null,null,null,null,null,null,null,null,null,null,{"$f":"SUM(AB19:AB21)","v":0}]
[null,null,null,null,2,"INSTRUCTIONAL/PROF STAFF:",null,null,null,null,"# of staff","Total FTE","MTRS",null,null,null,"Amount",null,null,"Select from Drop Down List",null,"Budget Detail",null,null,"Flexed Funds",null,null,"Amount"]
[null,null,null,null,null,"Select One",null,null,null,null,null,null,null,false,{"$f":"IF(N25, Q25,0)","v":0},null,null,null,null,"Select One",null,null,null,null,"Select, if applicable"]
[null,null,null,null,null,"Select One",null,null,null,null,null,null,null,false,0,null,null,null,null,"Select One",null,null,null,null,"Select, if applicable"]
[null,null,null,null,null,"Select One",null,null,null,null,null,null,null,false,0,null,null,null,null,"Select One",null,null,null,null,"Select, if applicable"]
[null,null,null,null,null,"Select One",null,null,null,null,null,null,null,false,0,null,null,null,null,"Select One",null,null,null,null,"Select, if applicable"]
[null,null,null,null,null,"Select One",null,null,null,null,null,null,null,false,0,null,null,null,null,"Select One",null,null,null,null,"Select, if applicable"]
[null,null,null,null,null,"Select One",null,null,null,null,null,null,null,false,0,null,null,null,null,"Select One",null,null,null,null,"Select, if applicable"]
[]
[null,null,null,null,"SUB-TOTAL",null,null,null,null,null,{"$f":"SUM(K25:K30)","v":0},{"$f":"SUM(L25:L30)","v":0},null,null,{"$f":"SUM(O25:O30)","v":0},null,{"$f":"SUM(Q25:Q30)","v":0},null,null,null,null,null,null,null,null,null,null,{"$f":"SUM(AB25:AB30)","v":0}]
[null,null,null,null,3,"SUPPORT STAFF SALARIES:",null,null,null,null,"# of staff","Total FTE","MTRS",null,null,null,"Amount",null,null,"Select from Drop Down List",null,"Budget Detail",null,null,"Flexed Funds",null,null,"Amount"]
[null,null,null,null,null,"Select One",null,null,null,null,null,null,null,false,{"$f":"IF(N34, Q34, 0)","v":0},null,null,null,null,"Select One",null,null,null,null,"Select, if applicable"]
[null,null,null,null,null,"Select One",null,null,null,null,null,null,null,false,{"$f":"IF(N35, Q35, 0)","v":0},null,null,null,null,"Select One",null,null,null,null,"Select, if applicable"]
[null,null,null,null,null,"Select One",null,null,null,null,null,null,null,false,0,null,null,null,null,"Select One",null,null,null,null,"Select, if applicable"]
[]
[null,null,null,null,"SUB-TOTAL",null,null,null,null,null,{"$f":"SUM(K34:K36)","v":0},{"$f":"SUM(L34:L36)","v":0},null,null,{"$f":"SUM(O34:O36)","v":0},null,{"$f":"SUM(Q34:Q36)","v":0},null,null,null,null,null,null,null,null,null,null,{"$f":"SUM(AB34:AB36)","v":0}]
[null,null,null,null,4,"STIPENDS:",null,null,null,"# of Staff","Rate","Rate Type","MTRS",null,null,null,"Amount",null,null,"Select from Drop Down List",null,"Budget Detail",null,null,"Flexed Funds",null,null,"Amount"]
[null,null,null,null,null,"Select One",null,null,null,null,null,"select",null,false,{"$f":"IF(N40, Q40, 0)","v":0},null,null,null,null,"Select One",null,null,null,null,"Select, if applicable"]
[null,null,null,null,null,"Select One",null,null,null,null,null,"select",null,false,{"$f":"IF(N41, Q41, 0)","v":0},null,null,null,null,"Select One",null,null,null,null,"Select, if applicable"]
[null,null,null,null,null,"Select One",null,null,null,null,null,"select",null,false,0,null,null,null,null,"Select One",null,null,null,null,"Select, if applicable"]
[null,null,null,null,null,"Select One",null,null,null,null,null,"select",null,false,0,null,null,null,null,"Select One",null,null,null,null,"Select, if applicable"]
[]
[null,null,null,null,"SUB-TOTAL",null,null,null,null,null,null,null,null,null,{"$f":"SUM(O40:O43)","v":0},null,{"$f":"SUM(Q40:Q43)","v":0},null,null,null,null,null,null,null,null,null,null,{"$f":"SUM(AB40:AB43)","v":0}]
[null,null,null,null,5,"FRINGE BENEFITS:",null,null,null,null,null,null,null,null,null,null,"Amount",null,null,"Brief Description",null,"Budget Detail",null,null,"Flexed Funds",null,null,"Amount"]
[null,null,null,null,null,"5a  MTRS (automatically calculated if MTRS box is checked)  ",null,null,null,null,null,null,null,null,null,null,{"$f":"ROUND((SUM(O45,O38,O32,O23))*0.09,0)","v":0},null,null,null,null,null,null,null,"Select, if applicable"]
[null,null,null,null,null,"5b  Other",null,null,null,null,null,null,null,null,null,null,{"$f":"SUM(Q49:Q51)","v":0},null,null,null,null,null,null,null,"Select, if applicable"]
[null,null,null,null,null,"Health Insurance",null,null,null,null,null,null,null,null,null,null,null,null,null,null,null,null,null,null,"Select, if applicable"]
[null,null,null,null,null,"Other Retirement Systems",null,null,null,null,null,null,null,null,null,null,null,null,null,null,null,null,null,null,"Select, if applicable"]
[null,null,null,null,null,"Federal Insurance Contributions Act (FICA)",null,null,null,null,null,null,null,null,null,null,null,null,null,null,null,null,null,null,"Select, if applicable"]
[]
[null,null,null,null,"SUB-TOTAL",null,null,null,null,null,null,null,null,null,null,null,{"$f":"SUM(Q47:Q48)","v":0},null,null,null,null,null,null,null,null,null,null,{"$f":"SUM(AB47, AB49:AB51)","v":0}]
[null,null,null,null,6,"CONTRACTUAL SERVICES:",null,null,null,null,"Rate","Rate Type",null,null,null,null,"Amount",null,null,"Select from Drop Down List",null,"Budget Detail",null,null,"Flexed Funds",null,null,"Amount"]
[null,null,null,null,null,"Select One",null,null,null,null,null,"select",null,null,null,null,null,null,null,"Select One",null,null,null,null,"Select, if applicable"]
[null,null,null,null,null,"Select One",null,null,null,null,null,"select",null,null,null,null,null,null,null,"Select One",null,null,null,null,"Select, if applicable"]
[null,null,null,null,null,"Select One",null,null,null,null,null,"select",null,null,null,null,null,null,null,"Select One",null,null,null,null,"Select, if applicable"]
[null,null,null,null,null,"Select One",null,null,null,null,null,"select",null,null,null,null,null,null,null,"Select One",null,null,null,null,"Select, if applicable"]
[null,null,null,null,null,"Select One",null,null,null,null,null,"select",null,null,null,null,null,null,null,"Select One",null,null,null,null,"Select, if applicable"]
[null,null,null,null,null,"Select One",null,null,null,null,null,"select",null,null,null,null,null,null,null,"Select One",null,null,null,null,"Select, if applicable"]
[]
[null,null,null,null,"SUB-TOTAL",null,null,null,null,null,null,null,null,null,null,null,{"$f":"SUM(Q55:Q60)","v":0},null,null,null,null,null,null,null,null,null,null,{"$f":"SUM(AB55:AB60)","v":0}]
[null,null,null,null,7,"SUPPLIES AND MATERIALS:",null,null,null,null,null,null,null,null,null,null,"Amount",null,null,"Select from Drop Down List",null,"Budget Detail",null,null,"Flexed Funds",null,null,"Amount"]
[null,null,null,null,null,"Select One",null,null,null,null,null,null,null,null,null,null,null,null,null,"Select One",null,null,null,null,"Select, if applicable"]
[null,null,null,null,null,"Select One",null,null,null,null,null,null,null,null,null,null,null,null,null,"Select One",null,null,null,null,"Select, if applicable"]
[null,null,null,null,null,"Select One",null,null,null,null,null,null,null,null,null,null,null,null,null,"Select One",null,null,null,null,"Select, if applicable"]
[null,null,null,null,null,"Select One",null,null,null,null,null,null,null,null,null,null,null,null,null,"Select One",null,null,null,null,"Select, if applicable"]
[]
[null,null,null,null,"SUB-TOTAL",null,null,null,null,null,null,null,null,null,null,null,{"$f":"SUM(Q64:Q67)","v":0},null,null,null,null,null,null,null,null,null,null,{"$f":"SUM(AB64:AB67)","v":0}]
[null,null,null,null,8,"TRAVEL:  (mileage, conference registration, courses, hotels, etc.)",null,null,null,null,null,null,null,null,null,null,"Amount",null,null,"Select from Drop Down List",null,"Budget Detail",null,null,"Flexed Funds",null,null,"Amount"]
[null,null,null,null,null,"Select One",null,null,null,null,null,null,null,null,null,null,null,null,null,"Select One",null,null,null,null,"Select, if applicable"]
[null,null,null,null,null,"Select One",null,null,null,null,null,null,null,null,null,null,null,null,null,"Select One",null,null,null,null,"Select, if applicable"]
[null,null,null,null,null,"Select One",null,null,null,null,null,null,null,null,null,null,null,null,null,"Select One",null,null,null,null,"Select, if applicable"]
[null,null,null,null,null,"Select One",null,null,null,null,null,null,null,null,null,null,null,null,null,"Select One",null,null,null,null,"Select, if applicable"]
[]
[null,null,null,null,"SUB-TOTAL",null,null,null,null,null,null,null,null,null,null,null,{"$f":"SUM(Q71:Q74)","v":0},null,null,null,null,null,null,null,null,null,null,{"$f":"SUM(AB71:AB74)","v":0}]
[null,null,null,null,9,"OTHER COSTS:",null,null,null,null,null,null,null,null,null,null,"Amount",null,null,"Select from Drop Down List",null,"Budget Detail",null,null,"Flexed Funds",null,null,"Amount"]
[null,null,null,null,null,"Select One",null,null,null,null,null,null,null,null,null,null,null,null,null,"Select One",null,null,null,null,"Select, if applicable"]
[null,null,null,null,null,"Select One",null,null,null,null,null,null,null,null,null,null,null,null,null,"Select One",null,null,null,null,"Select, if applicable"]
[null,null,null,null,null,"Select One",null,null,null,null,null,null,null,null,null,null,null,null,null,"Select One",null,null,null,null,"Select, if applicable"]
[null,null,null,null,null,"Select One",null,null,null,null,null,null,null,null,null,null,null,null,null,"Select One",null,null,null,null,"Select, if applicable"]
[null,null,null,null,null,"Select One",null,null,null,null,null,null,null,null,null,null,null,null,null,"Select One",null,null,null,null,"Select, if applicable"]
[null,null,null,null,null,"Select One",null,null,null,null,null,null,null,null,null,null,null,null,null,"Select One",null,null,null,null,"Select, if applicable"]
[]
[null,null,null,null,"SUB-TOTAL",null,null,null,null,null,null,null,null,null,null,null,{"$f":"SUM(Q78:Q83)","v":0},null,null,null,null,null,null,null,null,null,null,{"$f":"SUM(AB78:AB83)","v":0}]
[null,null,null,null,null,null,null,null,"(a) rate (%)",null,"(b) eligible allocation less indirect"]
[null,null,null,null,10,"INDIRECT COSTS ",null,null,null,null,{"$f":"IF(I87=\"\",\"\", (H7-IndExclT4)/(1+I87))","v":""}]
[null,null,null,null,null,null,null,null," (a x b)",null,{"$f":"IFERROR(+K87*I87,\"\")","v":""}]
[null,null,null,null,null,null,null,null,null,null,"   maximum allowed"]
[]
[null,null,null,null,11,"EQUIPMENT:\nItems costing $5,000+ per unit and having a useful life more than 1 year should also be listed",null,null,null,null,null,null,null,null,null,null,"Amount",null,null,"Select from Drop Down List",null,"Budget Detail",null,null,"Flexed Funds",null,null,"Amount"]
[null,null,null,null,null,"individually in Step 15.2, below (these expenditures are not eligible for recovery of indirect costs).",null,null,null,null,null,null,null,null,null,null,null,null,null,"Select One",null,null,null,null,"Select, if applicable"]
[null,null,null,null,null,null,null,null,null,null,null,null,null,null,null,null,null,null,null,"Select One",null,null,null,null,"Select, if applicable"]
[]
[null,null,null,null,"SUB-TOTAL",null,null,null,null,null,null,null,null,null,null,null,{"$f":"SUM(Q92:Q93)","v":0},null,null,null,null,null,null,null,null,null,null,{"$f":"SUM(AB92:AB93)","v":0}]
[]
[null,null,null,null,null,null,null,null,null,null,null,null,null,null,null,null,null,null,null,null,null,null,null,null,"Total for Equitable Services  "]
[null,null,null,null,null,null,null,null,null,null,null,null,"          TOTAL FUNDS REQUESTED "]
[]
[null,null,null,null,null,null,null,null,null,null,null,null,null,null,null,null,{"$f":"Q95+Q87+Q85+Q76+Q69+Q62+Q53+Q45+Q38+Q32+Q23","v":0},null,null,null,null,null,null,null,null,null,null,{"$f":"SUM(AB95+AB85+AB76+AB69+AB62+AB53+AB45+AB38+AB32+AB23)","v":0}]
[]
[null,null,null,null,"                                    DISCREPANCY:  Difference between allocation and budgeted total, if any",null,null,null,null,null,null,null,null,null,null,null,{"$f":"IFERROR(IF(Q100<>valAllocationT4,Q100-valAllocationT4,\"\"), 0)","v":""},null,null,"                                                                              DISCREPANCY:  Difference between reservation and budgeted total, if any",null,null,null,null,null,null,null,{"$f":"IF(AB100<>H8,AB100-H8,\"\")","v":""}]
[]
[]
[]
[null,"Step 15.2\nTitle IV Districts taking Indirect Costs",null,"Indirect Costs:  Major contracts and equipment"]
[null,null,null,"\nIndirect costs are those expenses of doing business that are not readily identifed with a particular grant, contract, project fund or activity, but are necessary for the general operation of the organization and the conduct of the activities it performs.  Because these expenses are difficult to track with precision across all benefiting sources, federal grants allow use of a rate as a mechanism for fairly and conveniently apportioning indirect costs across all programs within the boundaries of sound administrative principles.  \nSee U.S. Department of Education, Indirect Cost Overview (https://www2.ed.gov/about/offices/list/ocfo/intro.html). \n\nFor this grant, indirect costs must be consistent with the rate established by DESE's Office of School Finance.  Note that districts are allowed to take less than the maximum allowable for indirect costs. The decision to recover indirect costs using these established rates is a local option.  If indirect costs are recovered, they shall be returned to the general fund of the city or town in  accordance with G.L. Chapter 44, Section 53.  In the case of regional schools, indirect costs shall be returned to the regional school general fund.  www.doe.mass.edu/Grants/essential.html\n\nIn calculating the indirect cost allowable for a particular grant, some expenditures are not included.  Two such exclusions include a portion of major subawards or subcontracts (those exceeding $25,000), and capital costs (equipment purchases of $5,000 or more).  \nSee, U. S. Department of Education, Cost Allocation Guide for State and Local Governments.  https://www2.ed.gov/about/offices/list/ocfo/fipao/guideigcwebsite.pdf\n\n                                        •  Contracts:  For major contracts exceeding $25,000, districts may recover indirect costs on only the first $25,000 of each contract.   The remainder of the contract amount is excluded from application of the indirect cost rate.  Note that for contracts \n                                            for professional services normally provided in-house, such as a speech pathologist or school nurse, this exclusion does not apply, even if the contract exceeds $25,000.  Of course, these expenses are also subject to all other grant requirements \n                                            (allowability, allocability, necessarily and reasonable, etc.) to be properly chargeable to the grant as well.\n\n                                        • Equipment:  All equipment costing $5,000 or more and having a useful life of more than 1 year is considered a capital expenditure and not eligible for recovery of indirect cost.  The total for equipment should match the total entered in Line 11, above.\n\nDirections:  List contracts exceeding $25,000 below (but not those for professional services normally provided in house) and the amount to be excluded will be calculated automatically.  The excluded amount will be added to the equipment total (Line 11) and subtracted from your district's allocation before calculating your district's maximum allowable indirect cost on Line 10."]
[]
[]
[null,null,null,null," "]
[null,null,null,null,null,"Contracts exceeding $25,000 (include in budget categories above in addition to listing individually here)",null,null,null,null,null,null,null,null,null,null,null,null,null,"Equipment:  (from Line 11, above)"]
[null,null,null,null,null,null,null,null,null,null,null,null,null,null,null,null,null,null,null,"List Items costing $5,000+ per unit and having a useful life of more than 1 year.  "]
[null,null,null,null,null,"Amount of contract:",null,"Amount excluded from indirect cost:",null,null,"  Description:",null,null,null,null,null,null,null,null,"  Description:",null,null,null,null,"Amount:"]
[]
[null,null,null,null,null,null,null,{"$f":"IF((F115-25000)>0, (F115-25000), \"\")","v":""}]
[null,null,null,null,null,null,null,{"$f":"IF((F116-25000)>0, (F116-25000), \"\")","v":""}]
[null,null,null,null,null,null,null,""]
[null,null,null,null,null,null,null,""]
[null,null,null,null,null,null,null,""]
[null,null,null,null,null,null,null,""]
[null,null,null,null,null,null,null,""]
[null,null,null,null,null,null,null,""]
[null,null,null,null,null,null,null,""]
[null,null,null,null,null,null,null,""]
[null,null,null,null,null,null,null,""]
[null,null,null,null,null,null,null,""]
[null,null,null,null,null,null,null,"",null,null,null,null,null,null,null,null,null,null,null,null,null,null,null,null,null,null,null,null,null,null,null,{"$f":"IndKT4+IndEquipT4","v":0}]
[null,null,null,null,"SUB-TOTAL",{"$f":"SUM(F115:G127)","v":0},null,{"$f":"SUM(H115:I127)","v":0},null,null,null,null,null,null,null,null,null,null,null,null,null,null,"SUB-TOTAL",null,{"$f":"SUM(Y115:Y127)","v":0}]

{"sheet":"16. Schedule A","index":18,"n_rows":136,"n_cols":13,"rows_kept":136,"cut":false,"hidden":false,"merged":[[126,2,126,6],[126,7,126,9],[126,10,126,12],[127,2,127,6],[127,7,127,9],[127,10,127,12],[124,2,124,6],[124,7,124,9],[124,10,124,12],[125,2,125,6],[125,7,125,9],[125,10,125,12],[135,2,136,12],[131,2,131,6],[131,7,131,9],[131,10,131,12],[36,2,36,6],[36,7,36,9],[36,10,36,12],[96,2,96,6],[96,7,96,9],[96,10,96,12],[97,2,97,6],[97,7,97,9],[97,10,97,12],[94,2,94,6],[94,7,94,9],[94,10,94,12],[95,2,95,6],[95,7,95,9],[95,10,95,12],[92,2,92,6],[92,7,92,9],[92,10,92,12],[130,2,130,6],[130,7,130,9],[128,2,128,6],[128,7,128,9],[128,10,128,12],[129,2,129,6],[129,7,129,9],[129,10,129,12],[132,7,133,9],[132,10,133,12],[133,2,133,6],[130,10,130,12],[123,2,123,6],[123,7,123,9],[123,10,123,12],[116,2,117,2],[116,3,117,5],[116,6,117,11],[116,12,117,12],[118,2,119,2],[118,3,119,5],[118,6,119,11],[118,12,119,12],[121,2,122,6],[121,7,122,9],[121,10,122,12],[112,2,112,12],[114,2,115,2],[114,3,115,12],[100,2,100,6],[100,7,100,9],[100,10,100,12],[101,7,102,9],[101,10,102,12],[102,2,102,6],[98,2,98,6],[98,7,98,9],[98,10,98,12],[99,2,99,6],[99,7,99,9],[99,10,99,12],[104,2,105,12],[109,2,109,12],[110,2,110,12],[93,2,93,6],[93,7,93,9],[93,10,93,12],[87,2,88,2],[87,3,88,5],[87,6,88,11],[87,12,88,12],[90,2,91,6],[90,7,91,9],[90,10,91,12],[85,2,86,2],[85,3,86,5],[85,6,86,11],[85,12,86,12],[70,7,71,9],[70,10,71,12],[71,2,71,6],[73,2,74,12],[78,2,78,12],[69,2,69,6],[69,7,69,9],[69,10,69,12],[68,2,68,6],[68,7,68,9],[68,10,68,12],[79,2,79,12],[81,2,81,12],[83,2,84,2],[83,3,84,12],[66,2,66,6],[66,7,66,9],[66,10,66,12],[67,2,67,6],[67,7,67,9],[67,10,67,12],[64,2,64,6],[64,7,64,9],[64,10,64,12],[65,2,65,6],[65,7,65,9],[65,10,65,12],[62,2,62,6],[62,7,62,9],[62,10,62,12],[63,2,63,6],[63,7,63,9],[63,10,63,12],[59,2,60,6],[59,7,60,9],[59,10,60,12],[61,2,61,6],[61,7,61,9],[61,10,61,12],[54,2,55,2],[54,3,55,5],[54,6,55,11],[54,12,55,12],[56,2,57,2],[56,3,57,5],[56,6,57,11],[56,12,57,12],[47,2,47,12],[48,2,48,12],[50,2,50,12],[52,2,53,2],[52,3,53,12],[1,3,1,11],[2,3,12,11],[38,7,39,9],[38,10,39,12],[39,2,39,6],[41,2,42,12],[37,2,37,6],[37,7,37,9],[37,10,37,12],[34,2,34,6],[34,7,34,9],[34,10,34,12],[35,2,35,6],[35,7,35,9],[35,10,35,12],[32,2,32,6],[32,7,32,9],[32,10,32,12],[33,2,33,6],[33,7,33,9],[33,10,33,12],[30,2,30,6],[30,7,30,9],[30,10,30,12],[31,2,31,6],[31,7,31,9],[31,10,31,12],[27,7,28,9],[27,10,28,12],[29,2,29,6],[29,7,29,9],[29,10,29,12],[14,9,14,12],[15,2,15,12],[16,2,16,12],[18,2,18,12],[20,2,21,2],[20,3,21,12],[22,2,23,2],[22,3,23,5],[22,6,23,11],[22,12,23,12],[24,2,25,2],[24,3,25,5],[24,6,25,11],[24,12,25,12],[27,2,28,6]]}
[]
[null,null,null,"Instructions:\n\n "]
[null,null,null," • Fill out and print a separate copy of Schedule A for each ESSA Title program for which funds are assigned from other grant recipients and your district (agency) is operator/administrator.\n\n• Please fill in the appropriate grant program and fund code where indicated.     \n            •   Title I, Part A/Fund Code 305; \n            •   Title II, Part A/Fund Code 140; \n            •  Title III/Fund Code 180; \n            •  Title IVA/Fund Code 309.\n \n           For Titles I, II and IV only, attach a pdf of the fully executed Schedule A form to the Lead district's EdGrants submission for each grant for which there are Schedule A assignments of funds. TIII consortia fiscal leads will submit the Schedule A by email to their RASP liaison only.  DO NOT upload the TIII consortia Schedule A to EdGrants.  \n"]
[]
[]
[]
[]
[]
[]
[]
[]
[]
[]
[]
[]
[null,null,"MASSACHUSETTS DEPARTMENT OF ELEMENTARY AND SECONDARY EDUCATION"]
[null,null,"STANDARD APPLICATION FOR PROGRAM GRANTS"]
[]
[null,null,"FY20 SCHEDULE A - Assignment Schedule"]
[]
[null,null,1,"Schedule A is to be completed if the applicant agency operates and administers a grant project using funds from more than one grant recipient.  Lead district submits with EdGrants submission."]
[]
[null,null,2,"Agency operating and administering the project:  ",null,null,{"$f":"valDistrName","v":"OrgName"},null,null,null,null,null,{"$f":"OrgCode","v":"DIST"}]
[]
[null,null,3,"Name of grant program/\nFund Code:",null,null,"Title I, Part A",null,null,null,null,null,"FC 305"]
[]
[]
[null,null,"Name of Participating Agency",null,null,null,null,"Amount of \nAssigned Funds",null,null,"* Authorized Signature"]
[]
[]
[]
[]
[]
[]
[]
[]
[]
[]
[null,null,null,null,null,null,null,{"$f":"SUM(H30:J38)","v":0}]
[null,null,"Total of Assigned Funds"]
[]
[null,null,"*I/We assign the identified funds to the project described in the accompanying grant application.  The indicated agency is authorized to receive and disburse funds for the purpose of operating the project."]
[]
[]
[]
[]
[]
[null,null,"MASSACHUSETTS DEPARTMENT OF ELEMENTARY AND SECONDARY EDUCATION"]
[null,null,"STANDARD APPLICATION FOR PROGRAM GRANTS"]
[]
[null,null,"FY20 SCHEDULE A - Assignment Schedule"]
[]
[null,null,1,"Schedule A is to be completed if the applicant agency operates and administers a grant project using funds from more than one grant recipient.  Lead district submits with EdGrants submission."]
[]
[null,null,2,"Agency operating and administering the project:  ",null,null,{"$f":"valDistrName","v":"OrgName"},null,null,null,null,null,{"$f":"OrgCode","v":"DIST"}]
[]
[null,null,3,"Name of grant program/\nFund Code:",null,null,"Title II, Part A",null,null,null,null,null,"FC 140"]
[]
[]
[null,null,"Name of Participating Agency",null,null,null,null,"Amount of \nAssigned Funds",null,null,"* Authorized Signature"]
[]
[]
[]
[]
[]
[]
[]
[]
[]
[]
[null,null,null,null,null,null,null,{"$f":"SUM(H62:J70)","v":0}]
[null,null,"Total of Assigned Funds"]
[]
[null,null,"*I/We assign the identified funds to the project described in the accompanying grant application.  The indicated agency is authorized to receive and disburse funds for the purpose of operating the project."]
[]
[]
[]
[]
[null,null,"MASSACHUSETTS DEPARTMENT OF ELEMENTARY AND SECONDARY EDUCATION"]
[null,null,"STANDARD APPLICATION FOR PROGRAM GRANTS"]
[]
[null,null,"FY20 SCHEDULE A - Assignment Schedule"]
[]
[null,null,1,"Schedule A is to be completed if the applicant agency operates and administers a grant project using funds from more than one grant recipient. Lead district submits to federal grants liaison by email; do not submit in EdGrants."]
[]
[null,null,2,"Agency operating and administering the project:  ",null,null,{"$f":"valDistrName","v":"OrgName"},null,null,null,null,null,{"$f":"OrgCode","v":"DIST"}]
[]
[null,null,3,"Name of grant program/\nFund Code:",null,null,"Title III, Part A",null,null,null,null,null," FC 180"]
[]
[]
[null,null,"Name of Participating Agency",null,null,null,null,"Amount of \nAssigned Funds",null,null,"* Authorized Signature"]
[]
[]
[]
[]
[]
[]
[]
[]
[]
[]
[null,null,null,null,null,null,null,{"$f":"SUM(H93:J101)","v":0}]
[null,null,"Total of Assigned Funds"]
[]
[null,null,"*I/We assign the identified funds to the project described in the accompanying grant application.  The indicated agency is authorized to receive and disburse funds for the purpose of operating the project."]
[]
[]
[]
[]
[null,null,"MASSACHUSETTS DEPARTMENT OF ELEMENTARY AND SECONDARY EDUCATION"]
[null,null,"STANDARD APPLICATION FOR PROGRAM GRANTS"]
[]
[null,null,"FY20 SCHEDULE A - Assignment Schedule"]
[]
[null,null,1,"Schedule A is to be completed if the applicant agency operates and administers a grant project using funds from more than one grant recipient. Lead district submits with EdGrants submission."]
[]
[null,null,2,"Agency operating and administering the project:  ",null,null,{"$f":"valDistrName","v":"OrgName"},null,null,null,null,null,{"$f":"OrgCode","v":"DIST"}]
[]
[null,null,3,"Name of grant program/\nFund Code:",null,null,"Title IV, Part A",null,null,null,null,null,"FC 309"]
[]
[]
[null,null,"Name of Participating Agency",null,null,null,null,"Amount of \nAssigned Funds",null,null,"* Authorized Signature"]
[]
[]
[]
[]
[]
[]
[]
[]
[]
[]
[null,null,null,null,null,null,null,{"$f":"SUM(H124:J132)","v":0}]
[null,null,"Total of Assigned Funds"]
[]
[null,null,"*I/We assign the identified funds to the project described in the accompanying grant application.  The indicated agency is authorized to receive and disburse funds for the purpose of operating the project."]

{"sheet":"Dropdowns","index":19,"n_rows":125,"n_cols":13,"rows_kept":125,"cut":false,"hidden":true,"merged":[]}
["Budget Worksheet Dropdowns","Evidence/Data Sources","YesNo","Means of Identifying Els","Title IVA Categories","Title I School Types","Title I Low Income Methods","Private School Services Low Income Methods","Title IIA Prof. Growth ","Budget Pages:  Flexing","Private School Services:  Primary Functions","Private School DataList","Rate"]
["Primary Functions:  Title I","Select One","Select One","Select One","Access to Well-Rounded Education","SW","Select One","Select One","Select One","Flexed Funds II,Part A","Title I","Select One","select"]
["Select One","ACCESS data","Yes","Using initial assessment materials purchased by TIII identified by private school personnel","Safe and Healthy Schools","TA","March Eco Dis","Eco Dis","Recruiting diverse educators","Select, if applicable","Select One","Attendance data (educators)","per hour"]
["Instruction-School day (public, K-12) ","Attendance data (educators)","No","Using initial assessment materials purchased by TIII identified by LEA trained personnel","Effective Use of Technology","NT","March Eco Dis x 1.6","Free and Reduced Price Lunch/Meals Status","Building a principal pipeline","Title I, Part A","Instruction-School day (public, K-12) ","Attendance data (students)","per day"]
["Instruction - Extended day/year (public, K-12) ","Attendance data (students)",null,"Identified by LEA by consultation agreement",null,"CL","Other ","Other","Strategically placing and/or screening  student teachers","Title III, Part A","Instruction - Extended day/year (public, K-12) ","College application, enrollment, and  completion data","flat"]
["High quality PD","CHART reports ","YesNoNA","Previously identified for services",null,null,1,null,"Training supervising practitioners","Title IV, Part A","High quality PD","Discipline data"]
["Data collection/management","College application, enrollment, and  completion data","Select One","Previously identified student not yet proficient in English ",null,null,null,null,"Other",null,"Instructional technology","School-based assessments"]
["Homeless services","DART reports","Yes","Other",null,null,"Methods of qualifying T1 Schools",null,"None of the above","Flexed Funds IV,Part A","Parent, family and community engagement","School-sponsored research"]
["Instructional technology","Discipline data","No",null,null,null,"Select One",null,null,"Select, if applicable","Social and emotional learning","Educator evaluation data"]
["Neglected or delinquent services","District assessments","N/A",null,null,null,"District-wide low income percentage",null,"Select One","Title I, Part A","Other","Learning walks/teacher observations"]
["Parent, family and community engagement","District-sponsored research",null,null,null,null,"Grade span grouping and district-wide percentage",null,"Training mentors","Title II, Part A",null,"Peer-reviewed research"]
["Planning and evaluation","Educator evaluation data",null,null,null,null,"35% rule",null,"New administrator support","Title III, Part A","Title IIA","Student report cards"]
["Pre-school activities","Early Warning Indicator System (EWIS) data",null,null,null,null,"Grade span grouping and 35% rule",null,"Supports for educators in Years 2 and 3",null,"Select One","Surveys (student)"]
["Program administration","Learning walks/teacher observations",null,null,null,null,"Grade span grouping and group-wide percentage",null,"Cycles of observation and feedback",null,"Educator effectiveness PD","Survey (educator)"]
["Social and emotional learning","MCAS data",null,null,null,null,"One school per grade span (eg. K-5, 6-8, 9-12)",null,"Cohort-based programming",null,"Social and emotional learning PD","Surveys (other)"]
["Student transportation","Peer-reviewed research",null,null,null,null,"Total Enrollment of less than 1000 students",null,"Retaining educators of color",null,"School climate PD","Workforce outcomes data"]
["Other","RADAR reports ",null,null,null,null,1,null,"Other",null,"Inclusive practice PD","Other"]
[null,"Student report cards",null,null,null,null,null,null,"None of the above",null,"Other PD","None"]
["Primary Functions:  Title IIA","School accountability data"]
["Select One","Student Learning Experience reports",null,null,null,null,null,null,"Select One",null,"Title III Dropdown Private Schools"]
["Induction and mentoring ","Survey  - School Climate (student)",null,null,null,null,null,null,"Implementing the new student learning indicator",null,"Select One"]
["Instructional coaches","Survey - School Climate (educator)",null,null,null,null,null,null,"Incorporating staff/student feedback",null,"Instruction Extended day/year"]
["Curriculum Frameworks implementation ","Surveys - Other",null,null,null,null,null,null,"Calibrating the judgments and ratings of evaluators",null,"Supplemental literacy materials"]
["Educator effectiveness PD","Workforce outcomes data",null,null,null,null,null,null,"Other",null,"Assessment/screening materials"]
["Social and emotional learning PD","Other",null,null,null,null,null,null,"None of the above",null,"Professional development"]
["School climate PD","None",null,null,null,null,null,null,null,null,"Parent/Family Engagement for currently served TIII ELs"]
["Inclusive practice PD",null,null,null,null,null,null,null,"Select One",null,"Software for supplemental services during TIII extended day program"]
["Class size reduction",null,null,null,null,null,null,null,"Coaching supports to educators"]
["Program administration","Evidence/Data Sources TIVA",null,null,null,null,null,null,"Teacher Led PD",null,"Title VIA Dropdown Private Schools"]
["Other","Select One",null,null,null,null,null,null,"Curriculum-specific PD",null,"Select One"]
[null,"ACCESS data",null,null,null,null,null,null,"PD on data/ assessment",null,"Academic supports and personalized learning"]
["Primary Functions: Title III","Attendance data (educators)",null,null,null,null,null,null,"Other",null,"Arts education activities"]
["Select One","Attendance data (students)",null,null,null,null,null,null,"None of the above",null,"College and career readiness activities"]
["Instruction Extended day/year","CHART reports ",null,null,null,null,null,null,null,null,"Curriculum revision, training and implementation"]
["Supplemental literacy materials","College application, enrollment, and  completion data",null,null,null,null,null,null,"Select One",null,"Inclusion-related activities"]
["Assessment/screening materials","DART reports ",null,null,null,null,null,null,"Providing differentiated roles and opportunities",null,"School safety and student wellness activities"]
["Professional development","Discipline data",null,null,null,null,null,null,"Facilitating recognition programs and/or events",null,"Service learning, civics and community engagement activities"]
["Parent/Family Engagement for currently served TIII ELs","District assessments",null,null,null,null,null,null,"Other",null,"Social emotional learning activities"]
["Software for supplemental services during TIII extended day program","District-sponsored research",null,null,null,null,null,null,"None of the above",null,"Strengthening school climate and culture"]
["Other","Educator evaluation data",null,null,null,null,null,null,null,null,"Technology integration activities"]
[null,"Learning walks/teacher observations",null,null,null,null,null,null,null,null,"Other"]
["Primary Functions:  Title IV","MCAS data"]
["Select One","Peer-reviewed research"]
["Academic supports and personalized learning","RADAR reports "]
["Arts education activities","Referrals"]
["College and career readiness activities","Student Learning Experience reports"]
["Curriculum revision, training and implementation","Student report cards"]
["Inclusion-related activities","Survey  - School Climate (student)"]
["School safety and student wellness activities","Survey - School Climate (educator)"]
["Service learning, civics and community engagement activities","Survey -- Youth Risk"]
["Social emotional learning activities","Surveys -- Other"]
["Strengthening school climate and culture","Workforce outcomes data"]
["Technology integration activities","Other"]
["Other","None"]
[]
["Budget Categories"]
["Administrator Salaries"]
["Select One"]
["Grant Program Manager/Coordinator "]
["Other "]
["InstructionalProf Staff Salaries"]
["Select One"]
["Classroom Teachers  "]
["Instructional Coaches "]
["Certified Specialist Teachers (providing individualized instruction)  "]
["Instructional Coordinators and Team Leaders  "]
["Medical / Therapeutic Services "]
["Librarians and Media Center Directors "]
["Professional Development Directors/Coordinators  "]
["Guidance or School Adjustment Counselors, Social Workers  "]
["Psychological Service Providers "]
["School Physicians and School Nurses  "]
["Other  "]
["Support Staff Salaries"]
["Select One"]
["Non-Clerical Paraprofessionals/Instructional Assistants "]
["Secretary/Bookkeeper/Clerical Support  "]
["Parent Liaisons"]
[" Other "]
["Stipends"]
["Select One"]
["Teacher/ Instructional Staff Professional Days"]
["Administrators "]
["Other "]
["Support Staff"]
["Travel"]
["Select One"]
["Grant Program Manager/Coordinator (supervisory)"]
["Certified Classroom Teachers (providing group instruction) "]
["Certified Specialist Teachers (providing individualized instruction)"]
["Non-Clerical Paraprofessionals/Instructional Assistants"]
["Other "]
["Contractual Services"]
["Select One"]
["Instructional Services "]
["Consultants/Professional  Development for Teachers & Support Staff "]
["Substitutes (long and/or short term)"]
["Non-Clerical Paraprofessionals/Instructional Assistants"]
["Secretary/Bookkeeper/Clerical Support "]
["Contracted Service Providers -- Private School Services "]
["Contracted Services Providers -- Other Student Services "]
["Other "]
["Supplies and Materials"]
["Select One"]
["Textbooks and Related Software/Media/Materials "]
["Instructional Technology"]
["Other Instructional Materials (non-testing/assessment)"]
["Testing and Assessment Materials"]
["General Classroom Supplies "]
["Office Supplies  "]
["Other "]
["Other costs"]
["Select One"]
["Memberships/Subscriptions"]
["Advertising  "]
["Student Transportation Services "]
[" Rental/Lease of Equipment"]
["Maintenance of Equipment"]
["Maintenance of Technology "]
["Tuition to Non-Public Schools "]
["Tuition to Out-of-State Schools "]
["Tuition to Collaboratives"]
["Rental Lease of Buildings  "]
["Utility Services/ Telephone "]
["Other  "]

{"sheet":"DataLookupValues","index":20,"n_rows":21,"n_cols":6,"rows_kept":21,"cut":false,"hidden":true,"merged":[]}
["Workbook Information"]
[]
[]
[]
["District Information"]
["District value",1,null,null,"Liasons"]
["District Name:",{"$f":"VLOOKUP(valDistr,dataDistr,3,FALSE)","v":"OrgName"},"district code",{"$f":"LEFT(VLOOKUP(valDistr,dataDistr,2,FALSE),4)","v":"DIST"},"Name",{"$f":"VLOOKUP(valDistr,dataDistr,12,FALSE)","v":"Liaison's Name"}]
["Address1",{"$f":"VLOOKUP(valDistr,dataDistr,7,FALSE)","v":"ADDR 1"},null,null,"Phone",{"$f":"VLOOKUP(valDistr,dataDistr,13,FALSE)","v":"Liaison's Number"}]
["Address2",{"$f":"IF(VLOOKUP(valDistr,dataDistr,8,FALSE)=0,\"\",VLOOKUP(valDistr,dataDistr,8,FALSE))","v":"ADDR 2"},null,null,"Email",{"$f":"VLOOKUP(valDistr,dataDistr,14,FALSE)","v":"Liaison's Email"}]
["City, State, ZIP",{"$f":"VLOOKUP(valDistr,dataDistr,9,FALSE)&\", \"&VLOOKUP(valDistr,dataDistr,10,FALSE)&\" \"&VLOOKUP(valDistr,dataDistr,11,FALSE)","v":"City, State Zip"}]
["District Enrollment",{"$f":"VLOOKUP(valDistr,dataDistr,17,FALSE)","v":"March 2019 ENROLLED_sum"},"EL Enrollment",{"$f":"VLOOKUP(valDistr,dataDistr,16,FALSE)","v":"March 2019 nElCOUNT_sum"}]
["Low Inc Methods TI"]
["SELECT ONE",null,"TitleI Status"]
["Oct Eco Dis",null,1]
["Oct Eco Dis x 1.6",null,2,"SW"]
["March Eco Dis",null,3,"TA"]
["March Eco Dis x 1.6",null,4,"NT"]
["Other ",null,5,"CL"]
[]
["Homeless Enrollment",{"$f":"VLOOKUP(valDistr,dataDistr,18,FALSE)","v":"HOMELESS, K-12"}]
["SLE Gaps",{"$f":"VLOOKUP(valDistr,dataDistr,19,FALSE)","v":"SLE Gaps?"}]

{"sheet":"LiaisonList","index":21,"n_rows":8,"n_cols":3,"rows_kept":8,"cut":false,"hidden":true,"merged":[]}
["Aneesh Sahni","781-338-3532","aneesh.sahni@doe.mass.edu"]
["Alex Lilley","781-338-6212","alilley@doe.mass.edu"]
["Beth O'Connell","781-338-3132","EO'Connell@doe.mass.edu"]
["Deb Walker","781-338-3127","djwalker@doe.mass.edu"]
["Ellie Rounds-Bloom","781-338-3128","erounds-bloom@doe.mass.edu"]
["Julia Foodman","781-338-3577","jfoodman@doe.mass.edu"]
["Russ Fleming","781-338-6529","RFleming@doe.mass.edu"]
["Sue Mazzarella","781-338-3587","smazzarella@doe.mass.edu"]

{"sheet":"dataDistrictList","index":22,"n_rows":404,"n_cols":19,"rows_kept":404,"cut":false,"hidden":true,"merged":[]}
[1,"DISTRICT","OrgName","Org Type","Function","Contact Name","ADDR 1","ADDR 2","City","State","Zip","Liaison's Name","Liaison's Number","Liaison's Email",null,"March 2019 nElCOUNT_sum","March 2019 ENROLLED_sum","HOMELESS, K-12","SLE Gaps?"]
[2,"04450000","Abby Kelley Foster Charter Public (District)","Charter District","Charter School Leader","Brian Haas","10 New Bond Street","","Worcester","MA","01606","Aneesh Sahni","781-338-3532","aneesh.sahni@doe.mass.edu",null,140,1421,13,"No"]
[3,"00010000","Abington","Public School District","Superintendent","Peter Schafer","1071 Washington St.","","Abington","MA","02351","Alex Lilley","781-338-6212","alilley@doe.mass.edu",null,100,1980,6,"Yes"]
[4,"04120000","Academy Of the Pacific Rim Charter Public (District)","Charter District","Charter School Leader","Spencer Blasdale","1 Westinghouse Plaza Bldg B","","Hyde Park","MA","02136","Aneesh Sahni","781-338-3532","aneesh.sahni@doe.mass.edu",null,68,534,3,"No"]
[5,"06000000","Acton-Boxborough","Public School District","Superintendent","Peter Light","15 Charter Rd","","Acton","MA","01720","Sue Mazzarella","781-338-3587","smazzarella@doe.mass.edu",null,243,5528,12,"Yes"]
[6,"00030000","Acushnet","Public School District","Superintendent","Paula Bailey","708 Middle Road","Suite 1","Acushnet","MA","02743","Aneesh Sahni","781-338-3532","aneesh.sahni@doe.mass.edu",null,10,981,8,"Yes"]
[7,"06030000","Adams-Cheshire","Public School District","Superintendent","John Vosburgh","191 Church St","","Cheshire","MA","01225","Alex Lilley","781-338-6212","alilley@doe.mass.edu",null,8,1098,16,"Yes"]
[8,"04300000","Advanced Math and Science Academy Charter (District)","Charter District","Charter School Leader","Anders Lewis","201 Forest Street","","Marlborough","MA","01752","Sue Mazzarella","781-338-3587","smazzarella@doe.mass.edu",null,42,973,0,"Yes"]
[9,"00050000","Agawam","Public School District","Superintendent","Steven Lemanski","1305 Springfield St","Suite 1","Feeding Hills","MA","01030","Nancy Labrie","781-338-3536","nlabrie@doe.mass.edu",null,185,3560,0,"Yes"]
[10,"04090000","Alma del Mar Charter School (District)","Charter District","Charter School Leader","Alexa Teevens","26 Madeira Avenue","","New Bedford","MA","02746","Sue Mazzarella","781-338-3587","smazzarella@doe.mass.edu",null,106,440,0,"No"]
[11,"00070000","Amesbury","Public School District","Superintendent","Jared Fulgoni","5 Highland Street","","Amesbury","MA","01913","Russ Fleming","781-338-6529","RFleming@doe.mass.edu",null,31,1991,43,"Yes"]
[12,"00080000","Amherst","Public School District","Superintendent","Michael Morris","170 Chestnut Street","","Amherst","MA","01002","Ellie Rounds-Bloom","781-338-3128","erounds-bloom@doe.mass.edu",null,170,1068,39,"Yes"]
[13,"06050000","Amherst-Pelham","Public School District","Superintendent","Michael Morris","170 Chestnut Street","","Amherst","MA","01002","Ellie Rounds-Bloom","781-338-3128","erounds-bloom@doe.mass.edu",null,84,1332,0,"Yes"]
[14,"00090000","Andover","Public School District","Superintendent","Sheldon Berman","36 Bartlet Street","","Andover","MA","01810","Beth O'Connell","781-338-3132","EO'Connell@doe.mass.edu",null,231,5947,9,"Yes"]
[15,"35090000","Argosy Collegiate Charter School (District)","Charter District","Charter School Leader","Kristen Pavao","263 Hamlet Street","","Fall River","MA","02724","Julia Foodman","781-338-3577","jfoodman@doe.mass.edu",null,138,454,0,"No"]
[16,"00100000","Arlington","Public School District","Superintendent","Kathleen Bodie","869 Massachusetts Avenue","","Arlington","MA","02476","Julia Foodman","781-338-3577","jfoodman@doe.mass.edu",null,275,5912,10,"Yes"]
[17,"06100000","Ashburnham-Westminster","Public School District","Superintendent","Gary Mazzola","11 Oakmont Drive","","Ashburnham","MA","01430","Aneesh Sahni","781-338-3532","aneesh.sahni@doe.mass.edu",null,32,2283,6,"Yes"]
[18,"00140000","Ashland","Public School District","Superintendent","James Adams","87 West Union Street","","Ashland","MA","01721","Alex Lilley","781-338-6212","alilley@doe.mass.edu",null,162,2749,14,"Yes"]
[19,"08010000","Assabet Valley Regional Vocational Technical","Public School District","Superintendent","Ernest Houle","215 Fitchburg Street","","Marlborough","MA","01752","Ellie Rounds-Bloom","781-338-3128","erounds-bloom@doe.mass.edu",null,33,1120,0,"Yes"]
[20,"06150000","Athol-Royalston","Public School District","Superintendent","Darcy Fernandes","1062 Pleasant Street","","Athol","MA","01331","Nancy Labrie","781-338-3536","nlabrie@doe.mass.edu",null,26,1425,0,"Yes"]
[21,"04910000","Atlantis Charter (District)","Charter District","Charter School Leader","Robert Beatty","991 Jefferson St","","Fall River","MA","02721","Ellie Rounds-Bloom","781-338-3128","erounds-bloom@doe.mass.edu",null,140,1287,9,"Yes"]
[22,"00160000","Attleboro","Public School District","Superintendent","David Sawyer","100 Rathbun Willard Drive","","Attleboro","MA","02703","Ellie Rounds-Bloom","781-338-3128","erounds-bloom@doe.mass.edu",null,356,5778,0,"Yes"]
[23,"00170000","Auburn","Public School District","Superintendent","Maryellen Brunelle","5 West Street","","Auburn","MA","01501","Aneesh Sahni","781-338-3532","aneesh.sahni@doe.mass.edu",null,91,2543,7,"Yes"]
[24,"00180000","Avon","Public School District","Superintendent","Christine Godino","1 Patrick Clark Drive","","Avon","MA","02322","Nancy Labrie","781-338-3536","nlabrie@doe.mass.edu",null,24,709,12,"Yes"]
[25,"06160000","Ayer Shirley School District","Public School District","Superintendent","Mary Malone","115 Washington Street","","Ayer","MA","01432","Russ Fleming","781-338-6529","RFleming@doe.mass.edu",null,64,1670,0,"Yes"]
[26,"00200000","Barnstable","Public School District","Superintendent","Meg Mayo-Brown","P O Box 955","","Hyannis","MA","02601","Beth O'Connell","781-338-3132","EO'Connell@doe.mass.edu",null,502,4671,79,"Yes"]
[27,"35020000","Baystate Academy Charter Public School (District)","Charter District","Charter School Leader","Timothy Sneed","2001 Roosevelt Avenue","","Springfield","MA","01104","Beth O'Connell","781-338-3132","EO'Connell@doe.mass.edu",null,61,476,0,"Yes"]
[28,"00230000","Bedford","Public School District","Superintendent","Jonathan Sills","97 McMahon Road","","Bedford","MA","01730","Julia Foodman","781-338-3577","jfoodman@doe.mass.edu",null,155,2665,1,"Yes"]
[29,"00240000","Belchertown","Public School District","Superintendent","Karol Coffin","PO Box 841","","Belchertown","MA","01007","Beth O'Connell","781-338-3132","EO'Connell@doe.mass.edu",null,22,2257,11,"Yes"]
[30,"00250000","Bellingham","Public School District","Superintendent","Peter Marano","4 Mechanic Street","","Bellingham","MA","02019","Sue Mazzarella","781-338-3587","smazzarella@doe.mass.edu",null,46,2155,74,"Yes"]
[31,"00260000","Belmont","Public School District","Superintendent","John Phelan","644 Pleasant Street","","Belmont","MA","02478","Aneesh Sahni","781-338-3532","aneesh.sahni@doe.mass.edu",null,357,4669,0,"Yes"]
[32,"04200000","Benjamin Banneker Charter Public (District)","Charter District","Charter School Leader","Sherley Bretous-Carre","21 Notre Dame Avenue","","Cambridge","MA","02140","Ellie Rounds-Bloom","781-338-3128","erounds-bloom@doe.mass.edu",null,20,324,0,"Yes"]
[33,"04470000","Benjamin Franklin Classical Charter Public (District)","Charter District","Charter School Leader","Heather Zolnowski","201 Main Street","","Franklin","MA","02038","Russ Fleming","781-338-6529","RFleming@doe.mass.edu",null,26,457,0,"Yes"]
[34,"35110000","Bentley Academy Charter School (District)","Charter District","Charter School Leader","Marlena Afonso","25 Memorial Drive","","Salem","MA","01970","Sue Mazzarella","781-338-3587","smazzarella@doe.mass.edu",null,80,335,9,"Yes"]
[35,"00270000","Berkley","Public School District","Superintendent","Thomas Lynch","21 North Main Street","","Berkley","MA","02779","Russ Fleming","781-338-6529","RFleming@doe.mass.edu",null,6,823,0,"Yes"]
[36,"04140000","Berkshire Arts and Technology Charter Public (District)","Charter District","Charter School Leader","James White","1 Commercial Pl","PO Box 267","Adams","MA","01220","Russ Fleming","781-338-6529","RFleming@doe.mass.edu",null,3,366,0,"Yes"]
[37,"06180000","Berkshire Hills","Public School District","Superintendent","Peter Dillon","50 Main Street","PO Box 617","Stockbridge","MA","01262","Julia Foodman","781-338-3577","jfoodman@doe.mass.edu",null,40,1186,0,"Yes"]
[38,"06200000","Berlin-Boylston","Public School District","Superintendent","Jeffrey Zanghi","215 Main Street","","Boylston","MA","01505","Beth O'Connell","781-338-3132","EO'Connell@doe.mass.edu",null,9,591,0,"Yes"]
[39,"00300000","Beverly","Public School District","Superintendent","Steven Hiersche","70 Balch St.","","Beverly","MA","01915","Nancy Labrie","781-338-3536","nlabrie@doe.mass.edu",null,164,4560,0,"Yes"]
[40,"00310000","Billerica","Public School District","Superintendent","Timothy Piwowar","365 Boston Rd","","Billerica","MA","01821","Russ Fleming","781-338-6529","RFleming@doe.mass.edu",null,69,4625,16,"Yes"]
[41,"08050000","Blackstone Valley Regional Vocational Technical","Public School District","Superintendent","Michael Fitzpatrick","65 Pleasant Street","","Upton","MA","01568","Aneesh Sahni","781-338-3532","aneesh.sahni@doe.mass.edu",null,2,1219,0,"No"]
[42,"06220000","Blackstone-Millville","Public School District","Superintendent","Jason Defalco","175 Lincoln Street","","Blackstone","MA","01504","Sue Mazzarella","781-338-3587","smazzarella@doe.mass.edu",null,39,1666,1,"Yes"]
[43,"08060000","Blue Hills Regional Vocational Technical","Public School District","Superintendent","James Quaglia","800 Randolph Street","","Canton","MA","02021","Nancy Labrie","781-338-3536","nlabrie@doe.mass.edu",null,6,846,8,"No"]
[44,"00350000","Boston","Public School District","Superintendent","Laura Perille","2300 Washington Street","","Roxbury","MA","02119","Julia Foodman","781-338-3577","jfoodman@doe.mass.edu",null,15262,48612,4293,"Yes"]
[45,"04490000","Boston Collegiate Charter (District)","Charter District","Charter School Leader","Shannah Varon","11 Mayhew Street","","Dorchester","MA","02125","Julia Foodman","781-338-3577","jfoodman@doe.mass.edu",null,29,701,3,"No"]
[46,"04240000","Boston Day and Evening Academy Charter (District)","Charter District","Charter School Leader","Alison Hramiec","20 Kearsarge Ave","","Roxbury","MA","02119","Aneesh Sahni","781-338-3532","aneesh.sahni@doe.mass.edu",null,46,365,92,"No"]
[47,"04110000","Boston Green Academy Horace Mann Charter School (District)","Charter District","Charter School Leader","Matthew Holzer","20 Warren St.","","Brighton","MA","02135","Ellie Rounds-Bloom","781-338-3128","erounds-bloom@doe.mass.edu",null,68,461,0,"No"]
[48,"04160000","Boston Preparatory Charter Public (District)","Charter District","Charter School Leader","Sharon Liszanckie","885 River Street","","Hyde Park","MA","02136","Julia Foodman","781-338-3577","jfoodman@doe.mass.edu",null,94,526,0,"No"]
[49,"04810000","Boston Renaissance Charter Public (District)","Charter District","Charter School Leader","Alexandra Banhares-Buckmire","1415 Hyde Park Ave","","Hyde Park","MA","02136","Alex Lilley","781-338-6212","alilley@doe.mass.edu",null,109,822,8,"No"]
[50,"00360000","Bourne","Public School District","Superintendent","Steven Lamarche","36 Sandwich Rd","","Bourne","MA","02532","Beth O'Connell","781-338-3132","EO'Connell@doe.mass.edu",null,14,1887,51,"Yes"]
[51,"00380000","Boxford","Public School District","Superintendent","Scott Morrison","28 Middleton Road","","Boxford","MA","01921","Russ Fleming","781-338-6529","RFleming@doe.mass.edu",null,6,683,0,"Yes"]
[52,"00400000","Braintree","Public School District","Superintendent","Frank Hackett","348 Pond Street","","Braintree","MA","02184","Ellie Rounds-Bloom","781-338-3128","erounds-bloom@doe.mass.edu",null,305,5755,0,"Yes"]
[53,"00410000","Brewster","Public School District","Superintendent","Thomas Conrad","78 Eldredge Pkwy","","Orleans","MA","02653","Julia Foodman","781-338-3577","jfoodman@doe.mass.edu",null,10,449,6,"No"]
[54,"04170000","Bridge Boston Charter School (District)","Charter District","Charter School Leader","Craig Martin","435 Warren St.","","Roxbury","MA","02119","Beth O'Connell","781-338-3132","EO'Connell@doe.mass.edu",null,77,299,10,"No"]
[55,"06250000","Bridgewater-Raynham","Public School District","Superintendent","Derek Swenson","166 Mt. Prospect Street","","Bridgewater","MA","02324","Alex Lilley","781-338-6212","alilley@doe.mass.edu",null,113,5263,26,"Yes"]
[56,"00430000","Brimfield","Public School District","Superintendent","Erin Nosek","320A Brookfield Rd","","Fiskdale","MA","01518","Russ Fleming","781-338-6529","RFleming@doe.mass.edu",null,2,259,0,"Yes"]
[57,"09100000","Bristol County Agricultural","Public School District","Superintendent","Adele Sands","135 Center Street","","Dighton","MA","02715","Nancy Labrie","781-338-3536","nlabrie@doe.mass.edu",null,0,447,0,"Yes"]
[58,"08100000","Bristol-Plymouth Regional Vocational Technical","Public School District","Superintendent","Alexandre Magalhaes","207 Hart Street","","Taunton","MA","02780","Russ Fleming","781-338-6529","RFleming@doe.mass.edu",null,3,1262,5,"No"]
[59,"00440000","Brockton","Public School District","Superintendent","Kathleen Smith","43 Crescent Street","","Brockton","MA","02301","Sue Mazzarella","781-338-3587","smazzarella@doe.mass.edu",null,4240,16138,576,"Yes"]
[60,"04280000","Brooke Charter School (District)","Charter District","Charter School Leader","Kimberly Steadman","190 Cummins Highway","","Roslindale","MA","02131","Julia Foodman","781-338-3577","jfoodman@doe.mass.edu",null,133,1842,0,"Yes"]
[61,"00450000","Brookfield","Public School District","Superintendent","Erin Nosek","320 Brookfield Rd","","Fiskdale","MA","01518","Russ Fleming","781-338-6529","RFleming@doe.mass.edu",null,1,284,3,"No"]
[62,"00460000","Brookline","Public School District","Superintendent","Andrew Bott","333 Washington Street","","Brookline","MA","02445","Julia Foodman","781-338-3577","jfoodman@doe.mass.edu",null,877,7621,21,"Yes"]
[63,"00480000","Burlington","Public School District","Superintendent","Eric Conti","123 Cambridge Street","","Burlington","MA","01803","Sue Mazzarella","781-338-3587","smazzarella@doe.mass.edu",null,161,3515,7,"Yes"]
[64,"00490000","Cambridge","Public School District","Superintendent","Kenneth Salim","159 Thorndike Street","","Cambridge","MA","02141","Alex Lilley","781-338-6212","alilley@doe.mass.edu",null,548,6592,224,"Yes"]
[65,"00500000","Canton","Public School District","Superintendent","Jennifer Fischer-Mueller","960 Washington Street","","Canton","MA","02021","Ellie Rounds-Bloom","781-338-3128","erounds-bloom@doe.mass.edu",null,83,3247,24,"Yes"]
[66,"04320000","Cape Cod Lighthouse Charter (District)","Charter District","Charter School Leader","Paul Niles","195 Route 137","","East Harwich","MA","02645","Ellie Rounds-Bloom","781-338-3128","erounds-bloom@doe.mass.edu",null,1,243,0,"No"]
[67,"08150000","Cape Cod Regional Vocational Technical","Public School District","Superintendent","Robert Sanborn","351 Pleasant Lake Avenue","","Harwich","MA","02645","Julia Foodman","781-338-3577","jfoodman@doe.mass.edu",null,17,568,0,"No"]
[68,"00510000","Carlisle","Public School District","Superintendent","James O'Shea","83 School Street","","Carlisle","MA","01741","Nancy Labrie","781-338-3536","nlabrie@doe.mass.edu",null,18,601,0,"Yes"]
[69,"00520000","Carver","Public School District","Superintendent","Scott Knief","3 Carver Square Blvd.","","Carver","MA","02330","Nancy Labrie","781-338-3536","nlabrie@doe.mass.edu",null,20,1512,1,"Yes"]
[70,"06350000","Central Berkshire","Public School District","Superintendent","Laurie Casna","PO Box 299","Rt 8","Dalton","MA","01227","Alex Lilley","781-338-6212","alilley@doe.mass.edu",null,5,1532,8,"Yes"]
[71,"00560000","Chelmsford","Public School District","Superintendent","Roger Lang","230 North Road","","Chelmsford","MA","01824","Russ Fleming","781-338-6529","RFleming@doe.mass.edu",null,202,4906,0,"Yes"]
[72,"00570000","Chelsea","Public School District","Superintendent","Mary Bourque","500 Broadway Street","c/o City Hall Room 216","Chelsea","MA","02150","Julia Foodman","781-338-3577","jfoodman@doe.mass.edu",null,2191,5932,506,"Yes"]
[73,"06320000","Chesterfield-Goshen","Public School District","Superintendent","Aaron Osborne","30 Smith Road","","Chesterfield","MA","01012","Nancy Labrie","781-338-3536","nlabrie@doe.mass.edu",null,0,114,0,"Yes"]
[74,"00610000","Chicopee","Public School District","Superintendent","Richard Rege","180 Broadway Street","","Chicopee","MA","01020","Beth O'Connell","781-338-3132","EO'Connell@doe.mass.edu",null,453,7162,175,"Yes"]
[75,"04180000","Christa McAuliffe Charter Public (District)","Charter District","Charter School Leader","Kristin Harrison","139 Newbury St","","Framingham","MA","01701","Sue Mazzarella","781-338-3587","smazzarella@doe.mass.edu",null,10,391,0,"Yes"]
[76,"04370000","City on a Hill Charter Public School Circuit Street (District)","Charter District","Charter School Leader","Kevin Taylor","15 Allerton Street","Suite 1","Roxbury","MA","02119","Julia Foodman","781-338-3577","jfoodman@doe.mass.edu",null,37,252,2,"No"]
[77,"35040000","City on a Hill Charter Public School Dudley Square (District)","Charter District","Charter School Leader","Kevin Taylor","15 Allerton Street","Suite","Roxbury","MA","02119","Julia Foodman","781-338-3577","jfoodman@doe.mass.edu",null,53,241,7,"Yes"]
[78,"35070000","City on a Hill Charter Public School New Bedford (District)","Charter District","Charter School Leader","Kevin Taylor","15 Allerton Street","Suite 1","Boston","MA","02119","Julia Foodman","781-338-3577","jfoodman@doe.mass.edu",null,44,199,2,"No"]
[79,"00630000","Clarksburg","Public School District","Superintendent","Tara Barnes","777 West Crossroad","","Clarksburg","MA","01247","Sue Mazzarella","781-338-3587","smazzarella@doe.mass.edu",null,0,183,0,"No"]
[80,"00640000","Clinton","Public School District","Superintendent","Steven Meyer","150 School Street","","Clinton","MA","01510","Alex Lilley","781-338-6212","alilley@doe.mass.edu",null,216,1826,8,"Yes"]
[81,"04380000","Codman Academy Charter Public (District)","Charter District","Charter School Leader","Thabiti Brown","637 Washington Street","","Dorchester","MA","02124","Julia Foodman","781-338-3577","jfoodman@doe.mass.edu",null,23,325,21,"Yes"]
[82,"00650000","Cohasset","Public School District","Superintendent","Louise Demas","143 Pond Street","","Cohasset","MA","02025","Ellie Rounds-Bloom","781-338-3128","erounds-bloom@doe.mass.edu",null,4,1535,0,"Yes"]
[83,"35030000","Collegiate Charter School of Lowell (District)","Charter District","Charter School Leader","Laurie Hodgdon","1857 Middlesex Street","","Lowell","MA","01851","Sue Mazzarella","781-338-3587","smazzarella@doe.mass.edu",null,220,844,0,"Yes"]
[84,"04360000","Community Charter School of Cambridge (District)","Charter District","Charter School Leader","Caleb Hurst-Hiller","245 Bent Street","","Cambridge","MA","02141","Nancy Labrie","781-338-3536","nlabrie@doe.mass.edu",null,13,330,5,"No"]
[85,"04260000","Community Day Charter Public School - Gateway (District)","Charter District","Charter School Leader","Mary Chance","190 Hampshire Street","","Lawrence","MA","01840","Aneesh Sahni","781-338-3532","aneesh.sahni@doe.mass.edu",null,74,320,0,"Yes"]
[86,"04400000","Community Day Charter Public School - Prospect (District)","Charter District","Charter School Leader","Mary Chance","190 Hampshire Street","","Lawrence","MA","01840","Aneesh Sahni","781-338-3532","aneesh.sahni@doe.mass.edu",null,121,379,0,"No"]
[87,"04310000","Community Day Charter Public School - R. Kingman Webster (District)","Charter District","Charter School Leader","Mary Chance","190 Hampshire Street","","Lawrence","MA","01840","Aneesh Sahni","781-338-3532","aneesh.sahni@doe.mass.edu",null,80,318,0,"No"]
[88,"00670000","Concord","Public School District","Superintendent","Laurie Hunter","120 Meriam Rd","","Concord","MA","01742","Nancy Labrie","781-338-3536","nlabrie@doe.mass.edu",null,55,2100,0,"Yes"]
[89,"06400000","Concord-Carlisle","Public School District","Superintendent","Laurie Hunter","120 Meriam Rd","","Concord","MA","01742","Nancy Labrie","781-338-3536","nlabrie@doe.mass.edu",null,6,1307,1,"Yes"]
[90,"04390000","Conservatory Lab Charter (District)","Charter District","Charter School Leader","John Chistolini","2120 Dorchester Avenue","","Dorchester","MA","02124","Beth O'Connell","781-338-3132","EO'Connell@doe.mass.edu",null,72,399,0,"No"]
[91,"00680000","Conway","Public School District","Superintendent","Darius Modestow","113 North Main Street, Office C101","","South Deerfield","MA","01373","Alex Lilley","781-338-6212","alilley@doe.mass.edu",null,0,118,0,"Yes"]
[92,"00710000","Danvers","Public School District","Superintendent","Lisa Dana","64 Cabot Road","","Danvers","MA","01923","Sue Mazzarella","781-338-3587","smazzarella@doe.mass.edu",null,38,3409,0,"Yes"]
[93,"00720000","Dartmouth","Public School District","Superintendent","Bonny Gifford","8 Bush Street","","Dartmouth","MA","02748","Sue Mazzarella","781-338-3587","smazzarella@doe.mass.edu",null,94,3582,11,"Yes"]
[94,"00730000","Dedham","Public School District","Superintendent","Michael Welch","100 Whiting Avenue","","Dedham","MA","02026","Beth O'Connell","781-338-3132","EO'Connell@doe.mass.edu",null,179,2594,39,"Yes"]
[95,"00740000","Deerfield","Public School District","Superintendent","Darius Modestow","113 North Main Street, Office C101","","South Deerfield","MA","01373","Alex Lilley","781-338-6212","alilley@doe.mass.edu",null,4,355,0,"No"]
[96,"06450000","Dennis-Yarmouth","Public School District","Superintendent","Carol Woodbury","296 Station Avenue","","South Yarmouth","MA","02664","Sue Mazzarella","781-338-3587","smazzarella@doe.mass.edu",null,288,2965,154,"Yes"]
[97,"06500000","Dighton-Rehoboth","Public School District","Superintendent","Anthony Azar","2700 Regional Road","","North Dighton","MA","02764","Julia Foodman","781-338-3577","jfoodman@doe.mass.edu",null,10,2863,9,"Yes"]
[98,"00770000","Douglas","Public School District","Superintendent","Kevin Maines","21 Davis Street","","Douglas","MA","01516","Alex Lilley","781-338-6212","alilley@doe.mass.edu",null,9,1250,0,"Yes"]
[99,"00780000","Dover","Public School District","Superintendent","Andrew Keough","157 Farm Street","","Dover","MA","02030","Beth O'Connell","781-338-3132","EO'Connell@doe.mass.edu",null,16,482,0,"Yes"]
[100,"06550000","Dover-Sherborn","Public School District","Superintendent","Andrew Keough","157 Farm Street","","Dover","MA","02030","Beth O'Connell","781-338-3132","EO'Connell@doe.mass.edu",null,4,1221,0,"Yes"]
[101,"00790000","Dracut","Public School District","Superintendent","Steven Stone","2063 Lakeview Avenue","","Dracut","MA","01826","Aneesh Sahni","781-338-3532","aneesh.sahni@doe.mass.edu",null,65,3604,15,"Yes"]
[102,"04070000","Dudley Street Neighborhood Charter School (District)","Charter District","Charter School Leader","Alexandra Soto","6 Shirley Street","","Boston","MA","02119","Beth O'Connell","781-338-3132","EO'Connell@doe.mass.edu",null,68,225,0,"No"]
[103,"06580000","Dudley-Charlton Reg","Public School District","Superintendent","Kristine Nash","68 Dudley Oxford Road","","Dudley","MA","01571","Sue Mazzarella","781-338-3587","smazzarella@doe.mass.edu",null,94,3724,20,"Yes"]
[104,"00820000","Duxbury","Public School District","Superintendent","John Antonucci","93 Chandler Street","","Duxbury","MA","02332","Nancy Labrie","781-338-3536","nlabrie@doe.mass.edu",null,9,2975,1,"Yes"]
[105,"00830000","East Bridgewater","Public School District","Superintendent","Elizabeth Legault","143 Plymouth Street","","East Bridgewater","MA","02333","Russ Fleming","781-338-6529","RFleming@doe.mass.edu",null,20,2141,9,"Yes"]
[106,"00870000","East Longmeadow","Public School District","Superintendent","Gordon Smith","180 Maple Street","","East Longmeadow","MA","01028","Russ Fleming","781-338-6529","RFleming@doe.mass.edu",null,51,2618,0,"Yes"]
[107,"00850000","Eastham","Public School District","Superintendent","Thomas Conrad","78 Eldredge Pkwy","","Orleans","MA","02653","Julia Foodman","781-338-3577","jfoodman@doe.mass.edu",null,5,157,0,"Yes"]
[108,"00860000","Easthampton","Public School District","Superintendent","Allison Leclair","50 Payson Avenue","Second Floor","Easthampton","MA","01027","Beth O'Connell","781-338-3132","EO'Connell@doe.mass.edu",null,41,1530,11,"Yes"]
[109,"00880000","Easton","Public School District","Superintendent","Lisha Cabral","PO Box 359","","North Easton","MA","02356","Alex Lilley","781-338-6212","alilley@doe.mass.edu",null,65,3597,10,"Yes"]
[110,"00890000","Edgartown","Public School District","Superintendent","Matthew D'Andrea","4 Pine Street","","Vineyard Haven","MA","02568","Sue Mazzarella","781-338-3587","smazzarella@doe.mass.edu",null,81,361,0,"No"]
[111,"04520000","Edward M. Kennedy Academy for Health Careers (Horace Mann Charter) (District)","Charter District","Charter School Leader","Caren Walker Gregory","360 Huntington Avenue","c/o 102 Cahners Hall","Boston","MA","02115","Sue Mazzarella","781-338-3587","smazzarella@doe.mass.edu",null,63,378,0,"Yes"]
[112,"00910000","Erving","Public School District","Superintendent","Jennifer Haggerty","18 Pleasant Street","","Erving","MA","01344","Nancy Labrie","781-338-3536","nlabrie@doe.mass.edu",null,2,106,0,"No"]
[113,"08170000","Essex North Shore Agricultural and Technical School District","Public School District","Superintendent","Heidi Riccio","565 Maple Street","P.O. Box 346","Hathorne","MA","01937","Beth O'Connell","781-338-3132","EO'Connell@doe.mass.edu",null,2,1391,4,"Yes"]
[114,"00930000","Everett","Public School District","Superintendent","Janice Gauthier","121 Vine Street","","Everett","MA","02149","Ellie Rounds-Bloom","781-338-3128","erounds-bloom@doe.mass.edu",null,1669,6664,125,"Yes"]
[115,"04100000","Excel Academy Charter (District)","Charter District","Charter School Leader","Owen Stearns","58 Moore Street","","East Boston","MA","02128","Alex Lilley","781-338-6212","alilley@doe.mass.edu",null,152,1289,15,"Yes"]
[116,"00940000","Fairhaven","Public School District","Superintendent","Robert Baldwin","128 Washington Street","","Fairhaven","MA","02719","Russ Fleming","781-338-6529","RFleming@doe.mass.edu",null,33,2005,7,"Yes"]
[117,"00950000","Fall River","Public School District","Superintendent","Matthew Malone","417 Rock Street","","Fall River","MA","02720","Sue Mazzarella","781-338-3587","smazzarella@doe.mass.edu",null,1714,9999,434,"Yes"]
[118,"00960000","Falmouth","Public School District","Superintendent","Lori Duerr","340 Teaticket Hwy","","East Falmouth","MA","02536","Beth O'Connell","781-338-3132","EO'Connell@doe.mass.edu",null,110,3240,33,"Yes"]
[119,"06620000","Farmington River Reg","Public School District","Superintendent","Thomas Nadolny","555 N Main Street","PO Box 679","Otis","MA","01253","Ellie Rounds-Bloom","781-338-3128","erounds-bloom@doe.mass.edu",null,0,90,0,"No"]
[120,"00970000","Fitchburg","Public School District","Superintendent","Robert Jokela","376 South Street","","Fitchburg","MA","01420","Russ Fleming","781-338-6529","RFleming@doe.mass.edu",null,843,5252,484,"Yes"]
[121,"00980000","Florida","Public School District","Superintendent","Heidi Dugal","56 North County Rd","","Florida","MA","01247","Sue Mazzarella","781-338-3587","smazzarella@doe.mass.edu",null,0,73,0,"Yes"]
[122,"04130000","Four Rivers Charter Public (District)","Charter District","Charter School Leader","Peter Garbus","248 Colrain Road","","Greenfield","MA","01301","Sue Mazzarella","781-338-3587","smazzarella@doe.mass.edu",null,0,218,0,"No"]
[123,"00990000","Foxborough","Public School District","Superintendent","Amy Berdos","60 South Street","C/O Igo Administration Building","Foxborough","MA","02035","Ellie Rounds-Bloom","781-338-3128","erounds-bloom@doe.mass.edu",null,66,2490,19,"Yes"]
[124,"04460000","Foxborough Regional Charter (District)","Charter District","Charter School Leader","Mark Logan","131 Central Street","35 Commercial Street","Foxborough","MA","02035","Nancy Labrie","781-338-3536","nlabrie@doe.mass.edu",null,147,1611,10,"No"]
[125,"01000000","Framingham","Public School District","Superintendent","Robert Tremblay","73 Mt. Wayte Avenue","Suite 5","Framingham","MA","01702","Aneesh Sahni","781-338-3532","aneesh.sahni@doe.mass.edu",null,2001,8690,365,"Yes"]
[126,"04780000","Francis W. Parker Charter Essential (District)","Charter District","Charter School Leader","Todd Sumner","49 Antietam Street","","Devens","MA","01434","Julia Foodman","781-338-3577","jfoodman@doe.mass.edu",null,0,394,0,"Yes"]
[127,"01010000","Franklin","Public School District","Superintendent","Sara Ahern","355 East Central Street","","Franklin","MA","02038","Nancy Labrie","781-338-3536","nlabrie@doe.mass.edu",null,78,5167,5,"Yes"]
[128,"08180000","Franklin County Regional Vocational Technical","Public School District","Superintendent","Richard Martin","82 Industrial Blvd","","Turners Falls","MA","01376","Sue Mazzarella","781-338-3587","smazzarella@doe.mass.edu",null,0,484,12,"No"]
[129,"06650000","Freetown-Lakeville","Public School District","Superintendent","Richard Medeiros","98 Howland Rd","","Lakeville","MA","02347","Aneesh Sahni","781-338-3532","aneesh.sahni@doe.mass.edu",null,18,2798,0,"Yes"]
[130,"06700000","Frontier","Public School District","Superintendent","Darius Modestow","113 North Main Street, Office C101","","South Deerfield","MA","01373","Alex Lilley","781-338-6212","alilley@doe.mass.edu",null,7,653,0,"Yes"]
[131,"01030000","Gardner","Public School District","Superintendent","Mark Pellegrino","70 Waterford Street","","Gardner","MA","01440","Russ Fleming","781-338-6529","RFleming@doe.mass.edu",null,100,2229,74,"Yes"]
[132,"06720000","Gateway","Public School District","Superintendent","David Hopson","12 Littleville Road","","Huntington","MA","01050","Russ Fleming","781-338-6529","RFleming@doe.mass.edu",null,18,781,12,"Yes"]
[133,"01050000","Georgetown","Public School District","Superintendent","Carol Jacobs","51 North Street","","Georgetown","MA","01833","Julia Foodman","781-338-3577","jfoodman@doe.mass.edu",null,3,1320,0,"Yes"]
[134,"06740000","Gill-Montague","Public School District","Superintendent","Michael Sullivan","35 Crocker Avenue","","Turners Falls","MA","01376","Beth O'Connell","781-338-3132","EO'Connell@doe.mass.edu",null,52,908,3,"Yes"]
[135,"04960000","Global Learning Charter Public (District)","Charter District","Charter School Leader","Stephen Furtado","190 Ashley Boulevard","","New Bedford","MA","02746","Julia Foodman","781-338-3577","jfoodman@doe.mass.edu",null,52,503,0,"Yes"]
[136,"01070000","Gloucester","Public School District","Superintendent","Richard Safier","2 Blackburn Drive","","Gloucester","MA","01930","Beth O'Connell","781-338-3132","EO'Connell@doe.mass.edu",null,185,2806,0,"Yes"]
[137,"01090000","Gosnold","Public School District","Superintendent","Margaret Frieswyk","263 Hill & Plain Road","","East Falmouth","MA","02536","Ellie Rounds-Bloom","781-338-3128","erounds-bloom@doe.mass.edu",null,0,1,0,"No"]
[138,"01100000","Grafton","Public School District","Superintendent","James Cummings","30 Providence Rd","","Grafton","MA","01519","Alex Lilley","781-338-6212","alilley@doe.mass.edu",null,52,3099,15,"Yes"]
[139,"01110000","Granby","Public School District","Superintendent","Sheryl Stanton","387 East State Street","","Granby","MA","01033","Ellie Rounds-Bloom","781-338-3128","erounds-bloom@doe.mass.edu",null,31,702,0,"Yes"]
[140,"08210000","Greater Fall River Regional Vocational Technical","Public School District","Superintendent","Elvio Ferreira","251 Stonehaven Rd","","Fall River","MA","02723","Alex Lilley","781-338-6212","alilley@doe.mass.edu",null,21,1391,5,"Yes"]
[141,"08230000","Greater Lawrence Regional Vocational Technical","Public School District","Superintendent","John Lavoie","57 River Rd","","Andover","MA","01810","Ellie Rounds-Bloom","781-338-3128","erounds-bloom@doe.mass.edu",null,202,1543,55,"No"]
[142,"08280000","Greater Lowell Regional Vocational Technical","Public School District","Superintendent","Joseph Mastrocola","250 Pawtucket Blvd","","Tyngsborough","MA","01879","Nancy Labrie","781-338-3536","nlabrie@doe.mass.edu",null,164,2187,9,"Yes"]
[143,"08250000","Greater New Bedford Regional Vocational Technical","Public School District","Superintendent","James O'Brien","1121 Ashley Blvd","","New Bedford","MA","02745","Aneesh Sahni","781-338-3532","aneesh.sahni@doe.mass.edu",null,71,2104,17,"No"]
[144,"01140000","Greenfield","Public School District","Superintendent","Jordana Harper","195 Federal Street, Suite 100","","Greenfield","MA","01301","Alex Lilley","781-338-6212","alilley@doe.mass.edu",null,99,1638,52,"Yes"]
[145,"39010000","Greenfield Commonwealth Virtual District","Public School District","Superintendent","Salah Khelfaoui","238 Main St.","3rd Floor","Greenfield","MA","01301","Nancy Labrie","781-338-3536","nlabrie@doe.mass.edu",null,12,580,7,"No"]
[146,"06730000","Groton-Dunstable","Public School District","Superintendent","Laura Chesson","P O Box 729","","Groton","MA","01450","Julia Foodman","781-338-3577","jfoodman@doe.mass.edu",null,25,2363,0,"Yes"]
[147,"01170000","Hadley","Public School District","Superintendent","Anne McKenzie","125 Russell Street","","Hadley","MA","01035","Nancy Labrie","781-338-3536","nlabrie@doe.mass.edu",null,31,509,0,"Yes"]
[148,"01180000","Halifax","Public School District","Superintendent","Joy Blackwood","250 Pembroke Street","","Kingston","MA","02364","Nancy Labrie","781-338-3536","nlabrie@doe.mass.edu",null,7,626,0,"Yes"]
[149,"06750000","Hamilton-Wenham","Public School District","Superintendent","Michael Harvey","5 School Street","","Wenham","MA","01984","Sue Mazzarella","781-338-3587","smazzarella@doe.mass.edu",null,11,1771,0,"Yes"]
[150,"04990000","Hampden Charter School of Science East (District)","Charter District","Charter School Leader","Tarkan Topcuoglu","20 Johnson Road","","Chicopee","MA","01022","Beth O'Connell","781-338-3132","EO'Connell@doe.mass.edu",null,17,489,0,"Yes"]
[151,"35160000","Hampden Charter School of Science West (District)","Charter District","Charter School Leader","Tarkan Topcuoglu","511 Main St.","","West Springfield","MA","01089","Beth O'Connell","781-338-3132","EO'Connell@doe.mass.edu",null,26,212,0,"Yes"]
[152,"06800000","Hampden-Wilbraham","Public School District","Superintendent","Albert Ganem","621 Main Street","","Wilbraham","MA","01095","Alex Lilley","781-338-6212","alilley@doe.mass.edu",null,25,2983,0,"Yes"]
[153,"06830000","Hampshire","Public School District","Superintendent","Aaron Osborne","19 Stage Rd","","Westhampton","MA","01027","Nancy Labrie","781-338-3536","nlabrie@doe.mass.edu",null,11,726,0,"Yes"]
[154,"01210000","Hancock","Public School District","Superintendent","Peter Dillon","1831 STATE ROAD","","RICHMOND","MA","01254","Julia Foodman","781-338-3577","jfoodman@doe.mass.edu",null,0,33,0,"No"]
[155,"01220000","Hanover","Public School District","Superintendent","Matthew Ferron","188 Broadway Street","","Hanover","MA","02339","Beth O'Connell","781-338-3132","EO'Connell@doe.mass.edu",null,24,2590,1,"Yes"]
[156,"01250000","Harvard","Public School District","Superintendent","Linda Dwight","39 Massachusetts Avenue","","Harvard","MA","01451","Sue Mazzarella","781-338-3587","smazzarella@doe.mass.edu",null,17,1072,30,"Yes"]
[157,"01270000","Hatfield","Public School District","Superintendent","John Robert","34 School Street","","Hatfield","MA","01038","Alex Lilley","781-338-6212","alilley@doe.mass.edu",null,0,422,0,"Yes"]
[158,"01280000","Haverhill","Public School District","Superintendent","Margaret Marotta","4 Summer Street","","Haverhill","MA","01830","Ellie Rounds-Bloom","781-338-3128","erounds-bloom@doe.mass.edu",null,771,7919,249,"Yes"]
[159,"06850000","Hawlemont","Public School District","Superintendent","Michael Buoniconti","24 Ashfield Rd","","Shelburne Falls","MA","01370","Alex Lilley","781-338-6212","alilley@doe.mass.edu",null,0,121,0,"No"]
[160,"04190000","Helen Y. Davis Leadership Academy Charter Public (District)","Charter District","Charter School Leader","Chris Coblyn","23 Leonard Street","","Boston","MA","02122","Alex Lilley","781-338-6212","alilley@doe.mass.edu",null,16,191,0,"Yes"]
[161,"04550000","Hill View Montessori Charter Public (District)","Charter District","Charter School Leader","Phil Arnold","75 Foundation Ave","Ward Hill Business Park","Haverhill","MA","01835","Ellie Rounds-Bloom","781-338-3128","erounds-bloom@doe.mass.edu",null,33,306,0,"Yes"]
[162,"04500000","Hilltown Cooperative Charter Public (District)","Charter District","Charter School Leader","Daniel Klatz","1 Industrial Parkway","","Easthampton","MA","01039","Beth O'Connell","781-338-3132","EO'Connell@doe.mass.edu",null,0,217,0,"No"]
[163,"01310000","Hingham","Public School District","Superintendent","Dorothy Galo","220 Central Street","","Hingham","MA","02043","Ellie Rounds-Bloom","781-338-3128","erounds-bloom@doe.mass.edu",null,15,4210,0,"Yes"]
[164,"01330000","Holbrook","Public School District","Superintendent","Julie Hamilton","245 So. Franklin Street","","Holbrook","MA","02343","Nancy Labrie","781-338-3536","nlabrie@doe.mass.edu",null,95,1227,0,"Yes"]
[165,"01350000","Holland","Public School District","Superintendent","Erin Nosek","320 Brookfield Rd","","Fiskdale","MA","01518","Russ Fleming","781-338-6529","RFleming@doe.mass.edu",null,0,204,0,"Yes"]
[166,"01360000","Holliston","Public School District","Superintendent","Bradford Jackson","370 Hollis Street","","Holliston","MA","01746","Julia Foodman","781-338-3577","jfoodman@doe.mass.edu",null,67,2824,0,"No"]
[167,"01370000","Holyoke","Public School District","Superintendent","Stephen Zrike","57 Suffolk Street","","Holyoke","MA","01040","Alex Lilley","781-338-6212","alilley@doe.mass.edu",null,1161,4995,754,"Yes"]
[168,"04530000","Holyoke Community Charter (District)","Charter District","Charter School Leader","Sonia Pope","2200 Northampton Street","","Holyoke","MA","01040","Alex Lilley","781-338-6212","alilley@doe.mass.edu",null,107,701,9,"No"]
[169,"01380000","Hopedale","Public School District","Superintendent","Karen Crebase","25 Adin Street","","Hopedale","MA","01747","Sue Mazzarella","781-338-3587","smazzarella@doe.mass.edu",null,20,1011,0,"No"]
[170,"01390000","Hopkinton","Public School District","Superintendent","Carol Cavanaugh","89 Hayden Rowe Street","","Hopkinton","MA","01748","Alex Lilley","781-338-6212","alilley@doe.mass.edu",null,193,3662,0,"Yes"]
[171,"01410000","Hudson","Public School District","Superintendent","Marco Rodrigues","155 Apsley Street","","Hudson","MA","01749","Ellie Rounds-Bloom","781-338-3128","erounds-bloom@doe.mass.edu",null,242,2555,15,"Yes"]
[172,"01420000","Hull","Public School District","Superintendent","Michael Devine","18 Harborview Road","","Hull","MA","02045","Aneesh Sahni","781-338-3532","aneesh.sahni@doe.mass.edu",null,3,843,0,"Yes"]
[173,"04350000","Innovation Academy Charter (District)","Charter District","Charter School Leader","Gregory Orpen","72 Tyng Road","","Tyngsborough","MA","01879","Aneesh Sahni","781-338-3532","aneesh.sahni@doe.mass.edu",null,14,792,0,"No"]
[174,"01440000","Ipswich","Public School District","Superintendent","Brian Blake","1 Lord Square","","Ipswich","MA","01938","Nancy Labrie","781-338-3536","nlabrie@doe.mass.edu",null,34,1684,19,"Yes"]
[175,"06900000","King Philip","Public School District","Superintendent","Paul Zinni","18 King Street","","Norfolk","MA","02056","Nancy Labrie","781-338-3536","nlabrie@doe.mass.edu",null,13,2057,0,"Yes"]
[176,"01450000","Kingston","Public School District","Superintendent","Joy Blackwood","250 Pembroke Street","","Kingston","MA","02364","Nancy Labrie","781-338-3536","nlabrie@doe.mass.edu",null,23,1070,19,"Yes"]
[177,"04630000","KIPP Academy Boston Charter School (District)","Charter District","Charter School Leader","Caleb Dolan","37 Babson Street","KIPP Academy Boston","Mattapan","MA","02126","Beth O'Connell","781-338-3132","EO'Connell@doe.mass.edu",null,167,595,0,"No"]
[178,"04290000","KIPP Academy Lynn Charter (District)","Charter District","Charter School Leader","Caleb Dolan","90 High Rock Street","","Lynn","MA","01902","Beth O'Connell","781-338-3132","EO'Connell@doe.mass.edu",null,274,1452,10,"Yes"]
[179,"01490000","Lawrence","Public School District","Superintendent","Cynthia Paris","237 Essex Street","","Lawrence","MA","01840","Russ Fleming","781-338-6529","RFleming@doe.mass.edu",null,4764,13313,584,"Yes"]
[180,"04540000","Lawrence Family Development Charter (District)","Charter District","Charter School Leader","Ralph Carrero","34 West Street","","Lawrence","MA","01841","Ellie Rounds-Bloom","781-338-3128","erounds-bloom@doe.mass.edu",null,166,674,0,"No"]
[181,"01500000","Lee","Public School District","Superintendent","H. Eberwein","300A Greylock St","","Lee","MA","01238","Sue Mazzarella","781-338-3587","smazzarella@doe.mass.edu",null,35,694,13,"Yes"]
[182,"01510000","Leicester","Public School District","Superintendent","Marilyn Tencza","3 Washburn Square","3rd Floor","Leicester","MA","01524","Aneesh Sahni","781-338-3532","aneesh.sahni@doe.mass.edu",null,41,1463,10,"Yes"]
[183,"01520000","Lenox","Public School District","Superintendent","Kimberly Merrick","6 Walker Street","","Lenox","MA","01240","Ellie Rounds-Bloom","781-338-3128","erounds-bloom@doe.mass.edu",null,18,730,0,"Yes"]
[184,"01530000","Leominster","Public School District","Superintendent","Paula Deacon","24 Church Street","","Leominster","MA","01453","Aneesh Sahni","781-338-3532","aneesh.sahni@doe.mass.edu",null,701,6001,613,"Yes"]
[185,"01540000","Leverett","Public School District","Superintendent","Jennifer Haggerty","18 Pleasant Street","","Erving","MA","01344","Nancy Labrie","781-338-3536","nlabrie@doe.mass.edu",null,3,118,0,"No"]
[186,"01550000","Lexington","Public School District","Superintendent","Julie Hackett","146 Maple Street","","Lexington","MA","02420","Russ Fleming","781-338-6529","RFleming@doe.mass.edu",null,628,7321,0,"Yes"]
[187,"35140000","Libertas Academy Charter School (District)","Charter District","Charter School Leader","Modesto Montero","146 Chestnut Street","","Springfield","MA","01103","Ellie Rounds-Bloom","781-338-3128","erounds-bloom@doe.mass.edu",null,76,165,0,"Yes"]
[188,"01570000","Lincoln","Public School District","Superintendent","Rebecca McFall","1 Ballfield Road","","Lincoln","MA","01773","Julia Foodman","781-338-3577","jfoodman@doe.mass.edu",null,57,1135,0,"Yes"]
[189,"06950000","Lincoln-Sudbury","Public School District","Superintendent","Bella Wong","390 Lincoln Rd","","Sudbury","MA","01776","Russ Fleming","781-338-6529","RFleming@doe.mass.edu",null,10,1550,2,"Yes"]
[190,"01580000","Littleton","Public School District","Superintendent","Kelly Clenchy","PO Box 1486","","Littleton","MA","01460","Beth O'Connell","781-338-3132","EO'Connell@doe.mass.edu",null,30,1612,2,"Yes"]
[191,"01590000","Longmeadow","Public School District","Superintendent","Maurice O'shea","535 Bliss Road","","Longmeadow","MA","01106","Sue Mazzarella","781-338-3587","smazzarella@doe.mass.edu",null,26,2843,0,"Yes"]
[192,"01600000","Lowell","Public School District","Superintendent","Jeannine Durkin","155 Merrimack Street","","Lowell","MA","01852","Nancy Labrie","781-338-3536","nlabrie@doe.mass.edu",null,3518,14093,1009,"Yes"]
[193,"04560000","Lowell Community Charter Public (District)","Charter District","Charter School Leader","Nicholas Leonardos","206 Jackson Street","","Lowell","MA","01852","Nancy Labrie","781-338-3536","nlabrie@doe.mass.edu",null,391,766,18,"Yes"]
[194,"04580000","Lowell Middlesex Academy Charter (District)","Charter District","Charter School Leader","Margaret McDevitt","67 Middle St","","Lowell","MA","01852","Russ Fleming","781-338-6529","RFleming@doe.mass.edu",null,8,92,0,"No"]
[195,"01610000","Ludlow","Public School District","Superintendent","Todd Gazda","63 Chestnut Street","","Ludlow","MA","01056","Ellie Rounds-Bloom","781-338-3128","erounds-bloom@doe.mass.edu",null,65,2499,12,"Yes"]
[196,"01620000","Lunenburg","Public School District","Superintendent","Kathleen Burnham","1025 Mass Avenue","","Lunenburg","MA","01462","Aneesh Sahni","781-338-3532","aneesh.sahni@doe.mass.edu",null,24,1619,6,"Yes"]
[197,"01630000","Lynn","Public School District","Superintendent","Patrick Tutwiler","100 Bennett St","","Lynn","MA","01905","Aneesh Sahni","781-338-3532","aneesh.sahni@doe.mass.edu",null,4063,15741,1114,"Yes"]
[198,"01640000","Lynnfield","Public School District","Superintendent","Jane Tremblay","525 Salem Street","","Lynnfield","MA","01940","Russ Fleming","781-338-6529","RFleming@doe.mass.edu",null,47,2178,0,"Yes"]
[199,"04680000","Ma Academy for Math and Science","Public School District","Superintendent","Michael Barney","85 Prescott Street","","Worcester","MA","01605","Alex Lilley","781-338-6212","alilley@doe.mass.edu",null,0,98,0,"No"]
[200,"01650000","Malden","Public School District","Superintendent","John Oteri","77 Salem Street","","Malden","MA","02148","Julia Foodman","781-338-3577","jfoodman@doe.mass.edu",null,1351,6278,173,"Yes"]
[201,"06980000","Manchester Essex Regional","Public School District","Superintendent","Pamela Beaudoin","PO BOX 1407","","Manchester","MA","01944","Julia Foodman","781-338-3577","jfoodman@doe.mass.edu",null,8,1385,0,"Yes"]
[202,"01670000","Mansfield","Public School District","Superintendent","Teresa Murphy","2 Park Row","","Mansfield","MA","02048","Beth O'Connell","781-338-3132","EO'Connell@doe.mass.edu",null,74,3678,18,"Yes"]
[203,"35170000","Map Academy Charter School (District)","Charter District","Charter School Leader","Rachel Babcock","11 Resnik Road","","Plymouth","MA","02360","Beth O'Connell","781-338-3132","EO'Connell@doe.mass.edu",null,0,128,5,"No"]
[204,"01680000","Marblehead","Public School District","Superintendent","Maryann Perry","9 Widger Road","","Marblehead","MA","01945","Sue Mazzarella","781-338-3587","smazzarella@doe.mass.edu",null,113,3024,0,"Yes"]
[205,"04640000","Marblehead Community Charter Public (District)","Charter District","Charter School Leader","William Sullivan","17 Lime Street","","Marblehead","MA","01945","Beth O'Connell","781-338-3132","EO'Connell@doe.mass.edu",null,3,228,0,"Yes"]
[206,"01690000","Marion","Public School District","Superintendent","Douglas White","135 Marion Rd","","Mattapoisett","MA","02739","Aneesh Sahni","781-338-3532","aneesh.sahni@doe.mass.edu",null,1,434,2,"Yes"]
[207,"01700000","Marlborough","Public School District","Superintendent","Michael Bergeron","17 Washington Street","","Marlborough","MA","01752","Ellie Rounds-Bloom","781-338-3128","erounds-bloom@doe.mass.edu",null,1087,4551,128,"Yes"]
[208,"01710000","Marshfield","Public School District","Superintendent","Jeffrey Granatino","76 South River Street","","Marshfield","MA","02050","Aneesh Sahni","781-338-3532","aneesh.sahni@doe.mass.edu",null,41,3963,63,"Yes"]
[209,"07000000","Martha's Vineyard","Public School District","Superintendent","Matthew D'Andrea","4 Pine Street","","Vineyard Haven","MA","02568","Sue Mazzarella","781-338-3587","smazzarella@doe.mass.edu",null,52,630,0,"Yes"]
[210,"04660000","Martha's Vineyard Charter (District)","Charter District","Charter School Leader","Peter Steedman","PO Box 1150","","West Tisbury","MA","02575","Sue Mazzarella","781-338-3587","smazzarella@doe.mass.edu",null,7,178,0,"No"]
[211,"04920000","Martin Luther King Jr. Charter School of Excellence (District)","Charter District","Charter School Leader","Calvin McFadden","285 Dorset Street","","Springfield","MA","01108","Aneesh Sahni","781-338-3532","aneesh.sahni@doe.mass.edu",null,99,367,21,"Yes"]
[212,"07050000","Masconomet","Public School District","Superintendent","Kevin Lyons","20 Endicott Rd","","Boxford","MA","01921","Sue Mazzarella","781-338-3587","smazzarella@doe.mass.edu",null,9,1799,0,"Yes"]
[213,"01720000","Mashpee","Public School District","Superintendent","Patricia DeBoer","150-A Old Barnstable Road","","Mashpee","MA","02649","Nancy Labrie","781-338-3536","nlabrie@doe.mass.edu",null,46,1521,0,"Yes"]
[214,"04690000","MATCH Charter Public School (District)","Charter District","Charter School Leader","Nnenna Ude","1001 Commonwealth Avenue","","Boston","MA","02215","Ellie Rounds-Bloom","781-338-3128","erounds-bloom@doe.mass.edu",null,299,1162,0,"No"]
[215,"01730000","Mattapoisett","Public School District","Superintendent","Douglas White","135 Marion Rd","","Mattapoisett","MA","02739","Aneesh Sahni","781-338-3532","aneesh.sahni@doe.mass.edu",null,3,424,1,"Yes"]
[216,"01740000","Maynard","Public School District","Superintendent","Robert Gerardi","3-R Tiger Drive","","Maynard","MA","01754","Julia Foodman","781-338-3577","jfoodman@doe.mass.edu",null,56,1309,4,"Yes"]
[217,"01750000","Medfield","Public School District","Superintendent","Jeffrey Marsden","459 Main St","3rd Fl","Medfield","MA","02052","Beth O'Connell","781-338-3132","EO'Connell@doe.mass.edu",null,24,2566,0,"Yes"]
[218,"01760000","Medford","Public School District","Superintendent","Marice Edouard-Vincent","489 Winthrop Street","","Medford","MA","02155","Sue Mazzarella","781-338-3587","smazzarella@doe.mass.edu",null,442,4118,74,"Yes"]
[219,"01770000","Medway","Public School District","Superintendent","Armand Pires","45 Holliston Street","","Medway","MA","02053","Alex Lilley","781-338-6212","alilley@doe.mass.edu",null,29,2208,2,"No"]
[220,"01780000","Melrose","Public School District","Superintendent","Cyndy Taymore","360 Lynn Fells Pkwy","","Melrose","MA","02176","Ellie Rounds-Bloom","781-338-3128","erounds-bloom@doe.mass.edu",null,189,3683,0,"Yes"]
[221,"07100000","Mendon-Upton","Public School District","Superintendent","Joseph Maruszczak","150 North Ave","","Mendon","MA","01756","Alex Lilley","781-338-6212","alilley@doe.mass.edu",null,32,2267,0,"Yes"]
[222,"01810000","Methuen","Public School District","Superintendent","Brandi Kwong","10 Ditson Place","","Methuen","MA","01844","Aneesh Sahni","781-338-3532","aneesh.sahni@doe.mass.edu",null,679,6963,0,"Yes"]
[223,"01820000","Middleborough","Public School District","Superintendent","Brian Lynch","30 Forest Street","","Middleborough","MA","02346","Nancy Labrie","781-338-3536","nlabrie@doe.mass.edu",null,28,2929,36,"Yes"]
[224,"01840000","Middleton","Public School District","Superintendent","Scott Morrison","28 Middleton Road","","Boxford","MA","01921","Russ Fleming","781-338-6529","RFleming@doe.mass.edu",null,6,628,0,"Yes"]
[225,"01850000","Milford","Public School District","Superintendent","Kevin Mcintyre","31 West Fountain Street","","Milford","MA","01757","Julia Foodman","781-338-3577","jfoodman@doe.mass.edu",null,746,4215,117,"Yes"]
[226,"01860000","Millbury","Public School District","Superintendent","Gregory Myers","12 Martin Street","","Millbury","MA","01527","Beth O'Connell","781-338-3132","EO'Connell@doe.mass.edu",null,64,1641,0,"Yes"]
[227,"01870000","Millis","Public School District","Superintendent","Nancy Gustafson","245 Plain Street","Central Office","Millis","MA","02054","Sue Mazzarella","781-338-3587","smazzarella@doe.mass.edu",null,18,1185,4,"Yes"]
[228,"01890000","Milton","Public School District","Superintendent","Mary Gormley","25 Gile Road","","Milton","MA","02186","Alex Lilley","781-338-6212","alilley@doe.mass.edu",null,76,4204,0,"Yes"]
[229,"08300000","Minuteman Regional Vocational Technical","Public School District","Superintendent","Edward Bouquillon","758 Marrett Rd","","Lexington","MA","02421","Julia Foodman","781-338-3577","jfoodman@doe.mass.edu",null,11,513,0,"No"]
[230,"07170000","Mohawk Trail","Public School District","Superintendent","Michael Buoniconti","24 Ashfield Rd","","Shelburne Falls","MA","01370","Nancy Labrie","781-338-3536","nlabrie@doe.mass.edu",null,3,816,0,"Yes"]
[231,"07120000","Monomoy Regional School District","Public School District","Superintendent","Scott Carpenter","425 Crowell Rd","","Chatham","MA","02633","Ellie Rounds-Bloom","781-338-3128","erounds-bloom@doe.mass.edu",null,79,1824,0,"Yes"]
[232,"01910000","Monson","Public School District","Superintendent","Cheryl Clarke","P O Box 159","","Monson","MA","01057","Ellie Rounds-Bloom","781-338-3128","erounds-bloom@doe.mass.edu",null,9,859,6,"Yes"]
[233,"08320000","Montachusett Regional Vocational Technical","Public School District","Superintendent","Sheila Harrity","1050 Westminster Street","","Fitchburg","MA","01420","Beth O'Connell","781-338-3132","EO'Connell@doe.mass.edu",null,15,1403,7,"No"]
[234,"07150000","Mount Greylock","Public School District","Superintendent","Kimberley Grady","1781 Cold Spring Rd","","Williamstown","MA","01267","Russ Fleming","781-338-6529","RFleming@doe.mass.edu",null,2,1156,0,"Yes"]
[235,"04700000","Mystic Valley Regional Charter (District)","Charter District","Charter School Leader","Alex Dan","4 Laurel Street","","Malden","MA","02148","Aneesh Sahni","781-338-3532","aneesh.sahni@doe.mass.edu",null,41,1575,0,"No"]
[236,"01960000","Nahant","Public School District","Superintendent","Anthony Pierantozzi","290 Castle Road","","Nahant","MA","01908","Aneesh Sahni","781-338-3532","aneesh.sahni@doe.mass.edu",null,0,120,0,"No"]
[237,"01970000","Nantucket","Public School District","Superintendent","William Cozort","10 Surfside Road","","Nantucket","MA","02554","Nancy Labrie","781-338-3536","nlabrie@doe.mass.edu",null,256,1609,0,"Yes"]
[238,"07200000","Narragansett","Public School District","Superintendent","Christopher Casavant","462 Baldwinville Rd","","Baldwinville","MA","01436","Russ Fleming","781-338-6529","RFleming@doe.mass.edu",null,3,1364,30,"Yes"]
[239,"07250000","Nashoba","Public School District","Superintendent","Brooke Clenchy","50 Mechanic Street","","Bolton","MA","01740","Julia Foodman","781-338-3577","jfoodman@doe.mass.edu",null,73,3171,1,"Yes"]
[240,"08520000","Nashoba Valley Regional Vocational Technical","Public School District","Superintendent","Denise Pigeon","100 Littleton Road","","Westford","MA","01886","Alex Lilley","781-338-6212","alilley@doe.mass.edu",null,5,684,0,"Yes"]
[241,"01980000","Natick","Public School District","Superintendent","Anna Nolin","13 East Central Street","","Natick","MA","01760","Russ Fleming","781-338-6529","RFleming@doe.mass.edu",null,177,5432,40,"Yes"]
[242,"06600000","Nauset","Public School District","Superintendent","Thomas Conrad","78 Eldredge Pkwy","","Orleans","MA","02653","Julia Foodman","781-338-3577","jfoodman@doe.mass.edu",null,30,1516,4,"Yes"]
[243,"01990000","Needham","Public School District","Superintendent","Daniel Gutekanst","1330 Highland Avenue","","Needham","MA","02492","Julia Foodman","781-338-3577","jfoodman@doe.mass.edu",null,152,5697,0,"Yes"]
[244,"04440000","Neighborhood House Charter (District)","Charter District","Charter School Leader","Kate Scott","21 Queen Street","","Dorchester","MA","02122","Aneesh Sahni","781-338-3532","aneesh.sahni@doe.mass.edu",null,66,600,12,"No"]
[245,"02010000","New Bedford","Public School District","Superintendent","Thomas Anderson","455 County Street","C/O Paul Rodrigues Administration Bldg.","New Bedford","MA","02740","Beth O'Connell","781-338-3132","EO'Connell@doe.mass.edu",null,3604,12470,1315,"Yes"]
[246,"35130000","New Heights Charter School of Brockton (District)","Charter District","Charter School Leader","Omari Walker","1690 Main Street","","Brockton","MA","02301","Alex Lilley","781-338-6212","alilley@doe.mass.edu",null,91,523,5,"Yes"]
[247,"07280000","New Salem-Wendell","Public School District","Superintendent","Jennifer Haggerty","18 Pleasant Street","","Erving","MA","01344","Nancy Labrie","781-338-3536","nlabrie@doe.mass.edu",null,0,132,0,"No"]
[248,"02040000","Newburyport","Public School District","Superintendent","Sean Gallagher","70 Low Street","","Newburyport","MA","01950","Sue Mazzarella","781-338-3587","smazzarella@doe.mass.edu",null,41,2184,12,"Yes"]
[249,"02070000","Newton","Public School District","Superintendent","David Fleishman","100 Walnut Street","","Newtonville","MA","02460","Alex Lilley","781-338-6212","alilley@doe.mass.edu",null,780,12711,18,"Yes"]
[250,"02080000","Norfolk","Public School District","Superintendent","Ingrid Allardi","70 Boardman Street","","Norfolk","MA","02056","Ellie Rounds-Bloom","781-338-3128","erounds-bloom@doe.mass.edu",null,21,898,0,"No"]
[251,"09150000","Norfolk County Agricultural","Public School District","Superintendent","Tammy Quinn","400 Main Street","","Walpole","MA","02081","Russ Fleming","781-338-6529","RFleming@doe.mass.edu",null,1,550,0,"Yes"]
[252,"02090000","North Adams","Public School District","Superintendent","Barbara Malkas","10 Main Street","Second Floor","North Adams","MA","01247","Aneesh Sahni","781-338-3532","aneesh.sahni@doe.mass.edu",null,14,1270,70,"Yes"]
[253,"02110000","North Andover","Public School District","Superintendent","Gregg Gilligan","566 Main Street","","North Andover","MA","01845","Russ Fleming","781-338-6529","RFleming@doe.mass.edu",null,96,4672,21,"Yes"]
[254,"02120000","North Attleborough","Public School District","Superintendent","Scott Holcomb","6 Morse Street","","North Attleborough","MA","02760","Julia Foodman","781-338-3577","jfoodman@doe.mass.edu",null,113,4057,89,"Yes"]
[255,"02150000","North Brookfield","Public School District","Superintendent","Richard Lind","10 New School Drive","","North Brookfield","MA","01535","Alex Lilley","781-338-6212","alilley@doe.mass.edu",null,0,550,0,"No"]
[256,"07350000","North Middlesex","Public School District","Superintendent","Brad Morgan","66 Brookline Street","","Towsend","MA","01469","Alex Lilley","781-338-6212","alilley@doe.mass.edu",null,40,3020,0,"Yes"]
[257,"02170000","North Reading","Public School District","Superintendent","Jon Bernard","189 Park Street","","North Reading","MA","01864","Ellie Rounds-Bloom","781-338-3128","erounds-bloom@doe.mass.edu",null,13,2378,2,"Yes"]
[258,"02100000","Northampton","Public School District","Superintendent","John Provost","212 Main Street","","Northampton","MA","01060","Nancy Labrie","781-338-3536","nlabrie@doe.mass.edu",null,92,2559,26,"Yes"]
[259,"04060000","Northampton-Smith Vocational Agricultural","Public School District","Superintendent","Andrew Linkenhoker","80 Locust Street","","Northampton","MA","01060","Julia Foodman","781-338-3577","jfoodman@doe.mass.edu",null,7,484,0,"Yes"]
[260,"07300000","Northboro-Southboro","Public School District","Superintendent","Christine Johnson","53 Parkerville Road","","Southborough","MA","01772","Beth O'Connell","781-338-3132","EO'Connell@doe.mass.edu",null,25,1442,0,"No"]
[261,"02130000","Northborough","Public School District","Superintendent","Christine Johnson","53 Parkerville Road","","Southborough","MA","01772","Beth O'Connell","781-338-3132","EO'Connell@doe.mass.edu",null,81,1606,0,"Yes"]
[262,"02140000","Northbridge","Public School District","Superintendent","Amy McKinstry","87 Linwood Avenue","","Whitinsville","MA","01588","Sue Mazzarella","781-338-3587","smazzarella@doe.mass.edu",null,48,2007,9,"Yes"]
[263,"08530000","Northeast Metropolitan Regional Vocational Technical","Public School District","Superintendent","David DiBarri","100 Hemlock Rd","","Wakefield","MA","01880","Ellie Rounds-Bloom","781-338-3128","erounds-bloom@doe.mass.edu",null,40,1232,0,"No"]
[264,"08510000","Northern Berkshire Regional Vocational Technical","Public School District","Superintendent","James Brosnan","70 Hodges Cross Rd","","North Adams","MA","01247","Sue Mazzarella","781-338-3587","smazzarella@doe.mass.edu",null,0,489,0,"Yes"]
[265,"02180000","Norton","Public School District","Superintendent","Joseph Baeta","64 West Main Street","","Norton","MA","02766","Aneesh Sahni","781-338-3532","aneesh.sahni@doe.mass.edu",null,29,2373,9,"Yes"]
[266,"02190000","Norwell","Public School District","Superintendent","Matthew Keegan","322 Main Street","","Norwell","MA","02061","Nancy Labrie","781-338-3536","nlabrie@doe.mass.edu",null,5,2182,8,"Yes"]
[267,"02200000","Norwood","Public School District","Superintendent","David Thomson","275 Prospect Street","PO BOX 67","Norwood","MA","02062","Aneesh Sahni","781-338-3532","aneesh.sahni@doe.mass.edu",null,378,3369,20,"Yes"]
[268,"02210000","Oak Bluffs","Public School District","Superintendent","Matthew D'Andrea","4 Pine Street","","Vineyard Haven","MA","02568","Sue Mazzarella","781-338-3587","smazzarella@doe.mass.edu",null,85,427,0,"No"]
[269,"08550000","Old Colony Regional Vocational Technical","Public School District","Superintendent","Aaron Polansky","476 North Avenue","","Rochester","MA","02770","Aneesh Sahni","781-338-3532","aneesh.sahni@doe.mass.edu",null,1,543,0,"No"]
[270,"07400000","Old Rochester","Public School District","Superintendent","Douglas White","135 Marion Rd","","Mattapoisett","MA","02739","Aneesh Sahni","781-338-3532","aneesh.sahni@doe.mass.edu",null,0,1199,4,"Yes"]
[271,"35150000","Old Sturbridge Academy Charter Public School (District)","Charter District","Charter School Leader","James Donahue","2 Old Sturbridge Village Road","","Sturbridge","MA","01566","Aneesh Sahni","781-338-3532","aneesh.sahni@doe.mass.edu",null,13,200,0,"Yes"]
[272,"02230000","Orange","Public School District","Superintendent","Tari Thomas","507 S. Main Street","P.O. Box 680","Orange","MA","01364","Julia Foodman","781-338-3577","jfoodman@doe.mass.edu",null,9,532,65,"No"]
[273,"02240000","Orleans","Public School District","Superintendent","Thomas Conrad","78 Eldredge Pkwy","","Orleans","MA","02653","Julia Foodman","781-338-3577","jfoodman@doe.mass.edu",null,15,212,1,"No"]
[274,"02260000","Oxford","Public School District","Superintendent","Elizabeth Zielinski","4 Maple Road","","Oxford","MA","01540","Alex Lilley","781-338-6212","alilley@doe.mass.edu",null,8,1594,15,"Yes"]
[275,"02270000","Palmer","Public School District","Superintendent","Patricia Gardner","4107 Main Street","","Palmer","MA","01069","Ellie Rounds-Bloom","781-338-3128","erounds-bloom@doe.mass.edu",null,34,1306,30,"Yes"]
[276,"08600000","Pathfinder Regional Vocational Technical","Public School District","Superintendent","Gerald Paist","240 Sykes Street","","Palmer","MA","01069","Nancy Labrie","781-338-3536","nlabrie@doe.mass.edu",null,0,635,0,"Yes"]
[277,"35010000","Paulo Freire Social Justice Charter School (District)","Charter District","Charter School Leader","Isabelina Rodriguez","161 Lower Westfield ROad","","Holyoke","MA","01040","Julia Foodman","781-338-3577","jfoodman@doe.mass.edu",null,29,288,0,"Yes"]
[278,"02290000","Peabody","Public School District","Superintendent","Cara Murtagh","27 Lowell Street","","Peabody","MA","01960","Sue Mazzarella","781-338-3587","smazzarella@doe.mass.edu",null,533,5754,112,"Yes"]
[279,"02300000","Pelham","Public School District","Superintendent","Michael Morris","170 Chestnut Street","Business Office","Amherst","MA","01002","Ellie Rounds-Bloom","781-338-3128","erounds-bloom@doe.mass.edu",null,1,134,0,"No"]
[280,"02310000","Pembroke","Public School District","Superintendent","Erin Obey","72 Pilgrim Road","Office of the Superintendent","Pembroke","MA","02359","Russ Fleming","781-338-6529","RFleming@doe.mass.edu",null,28,2735,6,"Yes"]
[281,"07450000","Pentucket","Public School District","Superintendent","Justin Bartholomew","22 Main Street","","West Newbury","MA","01985","Aneesh Sahni","781-338-3532","aneesh.sahni@doe.mass.edu",null,7,2363,4,"Yes"]
[282,"02340000","Petersham","Public School District","Superintendent","Tari Thomas","P O Box 148","","Petersham","MA","01366","Julia Foodman","781-338-3577","jfoodman@doe.mass.edu",null,0,121,0,"Yes"]
[283,"35180000","Phoenix Academy Public Charter High School Lawrence (District)","Charter District","Charter School Leader","Beth Anderson","15 Union Street","","Lawrence","MA","01840","Ellie Rounds-Bloom","781-338-3128","erounds-bloom@doe.mass.edu",null,38,136,0,"No"]
[284,"35080000","Phoenix Academy Public Charter High School Springfield (District)","Charter District","Charter School Leader","Beth Anderson","65 Lincoln Street","","Springfield","MA","01105","Ellie Rounds-Bloom","781-338-3128","erounds-bloom@doe.mass.edu",null,41,193,0,"No"]
[285,"04930000","Phoenix Charter Academy (District)","Charter District","Charter School Leader","Beth Anderson","175 Hawthorne Street","","Chelsea","MA","02150","Ellie Rounds-Bloom","781-338-3128","erounds-bloom@doe.mass.edu",null,123,198,64,"No"]
[286,"04940000","Pioneer Charter School of Science (District)","Charter District","Charter School Leader","Barish Icin","51-59 Summer Street","","Everett","MA","02149","Aneesh Sahni","781-338-3532","aneesh.sahni@doe.mass.edu",null,213,785,0,"No"]
[287,"35060000","Pioneer Charter School of Science II (PCSS-II) (District)","Charter District","Charter School Leader","Barish Icin","97 Main Street","","Saugus","MA","01906","Aneesh Sahni","781-338-3532","aneesh.sahni@doe.mass.edu",null,87,360,0,"Yes"]
[288,"07500000","Pioneer Valley","Public School District","Superintendent","Jonathan Scagel","97 F Sumner Turner Road","","Northfield","MA","01360","Nancy Labrie","781-338-3536","nlabrie@doe.mass.edu",null,1,719,0,"Yes"]
[289,"04970000","Pioneer Valley Chinese Immersion Charter (District)","Charter District","Charter School Leader","Kathleen Wang","317 Russell Street","","Hadley","MA","01035","Beth O'Connell","781-338-3132","EO'Connell@doe.mass.edu",null,15,513,0,"No"]
[290,"04790000","Pioneer Valley Performing Arts Charter Public (District)","Charter District","Charter School Leader","Marc Kenen","15 Mulligan Drive","","South Hadley","MA","01075","Beth O'Connell","781-338-3132","EO'Connell@doe.mass.edu",null,2,389,0,"No"]
[291,"02360000","Pittsfield","Public School District","Superintendent","Jason Mccandless","269 First Street","","Pittsfield","MA","01201","Beth O'Connell","781-338-3132","EO'Connell@doe.mass.edu",null,237,5315,0,"Yes"]
[292,"02380000","Plainville","Public School District","Superintendent","David Raiche","68 Messenger Street","","Plainville","MA","02762","Sue Mazzarella","781-338-3587","smazzarella@doe.mass.edu",null,29,654,1,"No"]
[293,"02390000","Plymouth","Public School District","Superintendent","Gary Maestas","11 Lincoln Street","","Plymouth","MA","02360","Sue Mazzarella","781-338-3587","smazzarella@doe.mass.edu",null,137,7316,86,"Yes"]
[294,"02400000","Plympton","Public School District","Superintendent","Joy Blackwood","250 Pembroke Street","","Kingston","MA","02364","Nancy Labrie","781-338-3536","nlabrie@doe.mass.edu",null,0,206,0,"Yes"]
[295,"04870000","Prospect Hill Academy Charter (District)","Charter District","Charter School Leader","Angela Allen","50 Essex Street","","Cambridge","MA","02139","Alex Lilley","781-338-6212","alilley@doe.mass.edu",null,127,1114,17,"No"]
[296,"02420000","Provincetown","Public School District","Superintendent","Beth Singer","12 Winslow Street","","Provincetown","MA","02657","Aneesh Sahni","781-338-3532","aneesh.sahni@doe.mass.edu",null,22,105,22,"No"]
[297,"07530000","Quabbin","Public School District","Superintendent","Sheila Muir","872 South Street","","Barre","MA","01005","Russ Fleming","781-338-6529","RFleming@doe.mass.edu",null,6,2091,0,"Yes"]
[298,"07780000","Quaboag Regional","Public School District","Superintendent","Brett Kustigian","284 Old West Brookfield Road","PO Box 1538","Warren","MA","01083","Sue Mazzarella","781-338-3587","smazzarella@doe.mass.edu",null,12,1252,5,"Yes"]
[299,"02430000","Quincy","Public School District","Superintendent","Richard Decristofaro","34 Coddington Street","","Quincy","MA","02169","Nancy Labrie","781-338-3536","nlabrie@doe.mass.edu",null,1546,9251,0,"Yes"]
[300,"07550000","Ralph C Mahar","Public School District","Superintendent","Tari Thomas","507 South Main Street","","Orange","MA","01364","Julia Foodman","781-338-3577","jfoodman@doe.mass.edu",null,6,780,3,"Yes"]
[301,"02440000","Randolph","Public School District","Superintendent","Thea Stovell","40 Highland Avenue","","Randolph","MA","02368","Russ Fleming","781-338-6529","RFleming@doe.mass.edu",null,442,2758,0,"Yes"]
[302,"02460000","Reading","Public School District","Superintendent","John Doherty","82 Oakland Road","","Reading","MA","01867","Julia Foodman","781-338-3577","jfoodman@doe.mass.edu",null,42,4154,0,"Yes"]
[303,"02480000","Revere","Public School District","Superintendent","Dianne Kelly","101 School Street","","Revere","MA","02151","Beth O'Connell","781-338-3132","EO'Connell@doe.mass.edu",null,1677,7435,174,"Yes"]
[304,"02490000","Richmond","Public School District","Superintendent","Peter Dillon","1831 State Road","","Richmond","MA","01254","Julia Foodman","781-338-3577","jfoodman@doe.mass.edu",null,0,159,0,"No"]
[305,"04830000","Rising Tide Charter Public (District)","Charter District","Charter School Leader","Michael O'Keefe","59 Armstrong Road","","Plymouth","MA","02360","Aneesh Sahni","781-338-3532","aneesh.sahni@doe.mass.edu",null,3,652,0,"No"]
[306,"04820000","River Valley Charter (District)","Charter District","Charter School Leader","Andrew Willemsen","2 Perry Way","","Newburyport","MA","01950","Ellie Rounds-Bloom","781-338-3128","erounds-bloom@doe.mass.edu",null,1,288,0,"No"]
[307,"02500000","Rochester","Public School District","Superintendent","Douglas White","135 Marion Rd","","Mattapoisett","MA","02739","Aneesh Sahni","781-338-3532","aneesh.sahni@doe.mass.edu",null,2,492,0,"Yes"]
[308,"02510000","Rockland","Public School District","Superintendent","Alan Cron","34 MacKinlay Way","","Rockland","MA","02370","Ellie Rounds-Bloom","781-338-3128","erounds-bloom@doe.mass.edu",null,152,2207,30,"Yes"]
[309,"02520000","Rockport","Public School District","Superintendent","Robert Liebow","24 Jerdens Lane","","Rockport","MA","01966","Aneesh Sahni","781-338-3532","aneesh.sahni@doe.mass.edu",null,13,888,2,"Yes"]
[310,"02530000","Rowe","Public School District","Superintendent","John Franzoni","86 Pond Road","","Rowe","MA","01367","Sue Mazzarella","781-338-3587","smazzarella@doe.mass.edu",null,0,52,0,"No"]
[311,"04840000","Roxbury Preparatory Charter (District)","Charter District","Charter School Leader","Kate Armstrong","120 Fisher Avenue","","Roxbury","MA","02120","Nancy Labrie","781-338-3536","nlabrie@doe.mass.edu",null,305,1494,0,"No"]
[312,"04410000","Sabis International Charter (District)","Charter District","Charter School Leader","Karen Reuter","160 Joan Street","","Springfield","MA","01129","Alex Lilley","781-338-6212","alilley@doe.mass.edu",null,96,1574,0,"No"]
[313,"02580000","Salem","Public School District","Superintendent","Mary Carbone","29 Highland Avenue","","Salem","MA","01970","Aneesh Sahni","781-338-3532","aneesh.sahni@doe.mass.edu",null,483,3717,230,"Yes"]
[314,"04850000","Salem Academy Charter (District)","Charter District","Charter School Leader","Kathy Egmont","45 Congress Street","c/o Shetland Pk","Salem","MA","01970","Aneesh Sahni","781-338-3532","aneesh.sahni@doe.mass.edu",null,21,482,0,"Yes"]
[315,"02610000","Sandwich","Public School District","Superintendent","Pamela Gould","33 Water Street","","Sandwich","MA","02563","Julia Foodman","781-338-3577","jfoodman@doe.mass.edu",null,30,2472,13,"Yes"]
[316,"02620000","Saugus","Public School District","Superintendent","David DeRuosi","23 Main Street","","Saugus","MA","01906","Beth O'Connell","781-338-3132","EO'Connell@doe.mass.edu",null,168,2498,24,"Yes"]
[317,"02630000","Savoy","Public School District","Superintendent","Tracey Tierney","26 Chapel Road","","Savoy","MA","01256","Sue Mazzarella","781-338-3587","smazzarella@doe.mass.edu",null,0,52,0,"No"]
[318,"02640000","Scituate","Public School District","Superintendent","Ronald Griffin","606 C J Cushing Hwy","","Scituate","MA","02066","Alex Lilley","781-338-6212","alilley@doe.mass.edu",null,13,2959,10,"Yes"]
[319,"02650000","Seekonk","Public School District","Superintendent","Richard Drolet","25 Water Lane","","Seekonk","MA","02771","Ellie Rounds-Bloom","781-338-3128","erounds-bloom@doe.mass.edu",null,66,2055,0,"Yes"]
[320,"04860000","Seven Hills Charter Public (District)","Charter District","Charter School Leader","Leo Flanagan","51 Gage Street","","Worcester","MA","01605","Julia Foodman","781-338-3577","jfoodman@doe.mass.edu",null,180,666,9,"No"]
[321,"02660000","Sharon","Public School District","Superintendent","Victoria Greer","75 Mountain Street","","Sharon","MA","02067","Aneesh Sahni","781-338-3532","aneesh.sahni@doe.mass.edu",null,145,3589,9,"Yes"]
[322,"08710000","Shawsheen Valley Regional Vocational Technical","Public School District","Superintendent","Melanie Hagman","100 Cook Street","","Billerica","MA","01821","Russ Fleming","781-338-6529","RFleming@doe.mass.edu",null,1,1275,6,"Yes"]
[323,"02690000","Sherborn","Public School District","Superintendent","Andrew Keough","157 Farm Street","","Dover","MA","02030","Beth O'Connell","781-338-3132","EO'Connell@doe.mass.edu",null,11,385,0,"No"]
[324,"02710000","Shrewsbury","Public School District","Superintendent","Joseph Sawyer","100 Maple Avenue","","Shrewsbury","MA","01545","Russ Fleming","781-338-6529","RFleming@doe.mass.edu",null,169,6023,18,"Yes"]
[325,"02720000","Shutesbury","Public School District","Superintendent","Jennifer Haggerty","18 Pleasant Street","","Erving","MA","01344","Nancy Labrie","781-338-3536","nlabrie@doe.mass.edu",null,1,110,0,"No"]
[326,"07600000","Silver Lake","Public School District","Superintendent","Joy Blackwood","250 Pembroke Street","","Kingston","MA","02364","Nancy Labrie","781-338-3536","nlabrie@doe.mass.edu",null,10,1625,17,"Yes"]
[327,"04740000","Sizer School: A North Central Charter Essential (District)","Charter District","Charter School Leader","Courtney Harter","500 Rindge Road","","Fitchburg","MA","01420","Nancy Labrie","781-338-3536","nlabrie@doe.mass.edu",null,4,359,15,"No"]
[328,"02730000","Somerset","Public School District","Superintendent","Jeffrey Schoonover","580 Whetstone Hill Road","","Somerset","MA","02726","Russ Fleming","781-338-6529","RFleming@doe.mass.edu",null,17,1731,0,"Yes"]
[329,"07630000","Somerset Berkley Regional School District","Public School District","Superintendent","Jeffrey Schoonover","580 Whetstone Hill","","Somerset","MA","02726","Russ Fleming","781-338-6529","RFleming@doe.mass.edu",null,2,1050,0,"Yes"]
[330,"02740000","Somerville","Public School District","Superintendent","Mary Skipper","8 Bonair Street","","Somerville","MA","02145","Aneesh Sahni","781-338-3532","aneesh.sahni@doe.mass.edu",null,930,4647,0,"Yes"]
[331,"02780000","South Hadley","Public School District","Superintendent","Nicholas Young","116 Main Street","","South Hadley","MA","01075","Nancy Labrie","781-338-3536","nlabrie@doe.mass.edu",null,78,1845,28,"Yes"]
[332,"08290000","South Middlesex Regional Vocational Technical","Public School District","Superintendent","Jonathan Evans","750 Winter Street","","Framingham","MA","01702","Russ Fleming","781-338-6529","RFleming@doe.mass.edu",null,102,749,11,"No"]
[333,"04880000","South Shore Charter Public (District)","Charter District","Charter School Leader","Alicia Savage","100 Longwater Circle","","Norwell","MA","02061","Sue Mazzarella","781-338-3587","smazzarella@doe.mass.edu",null,141,947,0,"No"]
[334,"08730000","South Shore Regional Vocational Technical","Public School District","Superintendent","Thomas Hickey","476 Webster Street","","Hanover","MA","02339","Beth O'Connell","781-338-3132","EO'Connell@doe.mass.edu",null,3,633,0,"Yes"]
[335,"02750000","Southampton","Public School District","Superintendent","Aaron Osborne","19 Stage Rd","","Westhampton","MA","01027","Nancy Labrie","781-338-3536","nlabrie@doe.mass.edu",null,10,465,0,"Yes"]
[336,"02760000","Southborough","Public School District","Superintendent","Christine Johnson","53 Parkerville Road","","Southborough","MA","01772","Beth O'Connell","781-338-3132","EO'Connell@doe.mass.edu",null,76,1197,0,"Yes"]
[337,"02770000","Southbridge","Public School District","Superintendent","Jeffrey Villar","25 Cole Avenue","","Southbridge","MA","01550","Ellie Rounds-Bloom","781-338-3128","erounds-bloom@doe.mass.edu",null,444,1958,55,"Yes"]
[338,"08720000","Southeastern Regional Vocational Technical","Public School District","Superintendent","Luis Lopes","250 Foundry Street","","South Easton","MA","02375","Julia Foodman","781-338-3577","jfoodman@doe.mass.edu",null,15,1435,8,"No"]
[339,"07650000","Southern Berkshire","Public School District","Superintendent","Beth Regulbuto","PO BOX 339","","Sheffield","MA","01257","Alex Lilley","781-338-6212","alilley@doe.mass.edu",null,11,647,6,"Yes"]
[340,"08760000","Southern Worcester County Regional Vocational Technical","Public School District","Superintendent","John LaFleche","57 Old Muggett Hill Road","","Charlton","MA","01507","Sue Mazzarella","781-338-3587","smazzarella@doe.mass.edu",null,6,1115,0,"Yes"]
[341,"07660000","Southwick-Tolland-Granville Regional School District","Public School District","Superintendent","Jennifer Willard","86 Powder Mill Road","","Southwick","MA","01077","Ellie Rounds-Bloom","781-338-3128","erounds-bloom@doe.mass.edu",null,49,1467,0,"Yes"]
[342,"07670000","Spencer-E Brookfield","Public School District","Superintendent","Paul Haughey","306 Main Street","","Spencer","MA","01562","Aneesh Sahni","781-338-3532","aneesh.sahni@doe.mass.edu",null,61,1365,15,"Yes"]
[343,"02810000","Springfield","Public School District","Superintendent","Daniel Warwick","1550 Main Street","","Springfield","MA","01103","Alex Lilley","781-338-6212","alilley@doe.mass.edu",null,4101,23825,1398,"Yes"]
[344,"35100000","Springfield Preparatory Charter School (District)","Charter District","Charter School Leader","Bill Spirer","594 Converse St.","","Longmeadow","MA","01106","Beth O'Connell","781-338-3132","EO'Connell@doe.mass.edu",null,55,270,0,"Yes"]
[345,"02840000","Stoneham","Public School District","Superintendent","John Macero","149 Franklin Street","","Stoneham","MA","02180","Julia Foodman","781-338-3577","jfoodman@doe.mass.edu",null,85,2314,8,"Yes"]
[346,"02850000","Stoughton","Public School District","Superintendent","Marguerite Rizzi","232 Pearl Street","","Stoughton","MA","02072","Beth O'Connell","781-338-3132","EO'Connell@doe.mass.edu",null,257,3441,50,"Yes"]
[347,"02870000","Sturbridge","Public School District","Superintendent","Erin Nosek","320 Brookfield Rd","","Fiskdale","MA","01518","Russ Fleming","781-338-6529","RFleming@doe.mass.edu",null,12,804,3,"Yes"]
[348,"04890000","Sturgis Charter Public (District)","Charter District","Charter School Leader","Paul Marble","427 Main Street","","Hyannis","MA","02601","Alex Lilley","781-338-6212","alilley@doe.mass.edu",null,4,840,0,"No"]
[349,"02880000","Sudbury","Public School District","Superintendent","Brad Crozier","40 Fairbank Road","","Sudbury","MA","01776","Alex Lilley","781-338-6212","alilley@doe.mass.edu",null,58,2647,0,"Yes"]
[350,"02890000","Sunderland","Public School District","Superintendent","Darius Modestow","113 North Main Street, Office C101","","South Deerfield","MA","01373","Alex Lilley","781-338-6212","alilley@doe.mass.edu",null,16,210,0,"Yes"]
[351,"02900000","Sutton","Public School District","Superintendent","Theodore Friend","383 Boston Rd","","Sutton","MA","01590","Russ Fleming","781-338-6529","RFleming@doe.mass.edu",null,14,1371,2,"Yes"]
[352,"02910000","Swampscott","Public School District","Superintendent","Pamela Angelakis","207 Forest Avenue","","Swampscott","MA","01907","Nancy Labrie","781-338-3536","nlabrie@doe.mass.edu",null,119,2181,8,"Yes"]
[353,"02920000","Swansea","Public School District","Superintendent","John Robidoux","1 Gardners Neck Road","","Swansea","MA","02777","Russ Fleming","781-338-6529","RFleming@doe.mass.edu",null,7,2029,16,"Yes"]
[354,"07700000","Tantasqua","Public School District","Superintendent","Erin Nosek","320A Brookfield Rd","","Fiskdale","MA","01518","Russ Fleming","781-338-6529","RFleming@doe.mass.edu",null,7,1786,13,"Yes"]
[355,"02930000","Taunton","Public School District","Superintendent","John Cabral","215 Harris Street","","Taunton","MA","02780","Julia Foodman","781-338-3577","jfoodman@doe.mass.edu",null,413,7825,138,"Yes"]
[356,"39020000","TEC Connections Academy Commonwealth Virtual School District","Public School District","Superintendent","Adam Goldberg","141 Mansion Drive","","East Walpole","MA","02032","Russ Fleming","781-338-6529","RFleming@doe.mass.edu",null,40,2301,0,"Yes"]
[357,"02950000","Tewksbury","Public School District","Superintendent","Christopher Malone","139 Pleasant Street","","Tewksbury","MA","01876","Beth O'Connell","781-338-3132","EO'Connell@doe.mass.edu",null,57,3302,16,"Yes"]
[358,"02960000","Tisbury","Public School District","Superintendent","Matthew D'Andrea","4 Pine Street","","Vineyard Haven","MA","02568","Sue Mazzarella","781-338-3587","smazzarella@doe.mass.edu",null,63,300,0,"No"]
[359,"02980000","Topsfield","Public School District","Superintendent","Scott Morrison","28 Middleton Road","","Boxford","MA","01921","Russ Fleming","781-338-6529","RFleming@doe.mass.edu",null,2,606,0,"Yes"]
[360,"08780000","Tri-County Regional Vocational Technical","Public School District","Superintendent","Stephen Dockray","147 Pond Street","","Franklin","MA","02038","Alex Lilley","781-338-6212","alilley@doe.mass.edu",null,1,1008,11,"No"]
[361,"07730000","Triton","Public School District","Superintendent","Brian Forget","112 Elm Street","","Byfield","MA","01922","Russ Fleming","781-338-6529","RFleming@doe.mass.edu",null,26,2332,225,"Yes"]
[362,"03000000","Truro","Public School District","Superintendent","Michael Gradone","P O Box 2029","","Truro","MA","02666","Ellie Rounds-Bloom","781-338-3128","erounds-bloom@doe.mass.edu",null,0,92,0,"No"]
[363,"03010000","Tyngsborough","Public School District","Superintendent","Michael Flanagan","50 Norris Rd","","Tyngsborough","MA","01879","Aneesh Sahni","781-338-3532","aneesh.sahni@doe.mass.edu",null,41,1606,5,"Yes"]
[364,"04800000","UP Academy Charter School of Boston (District)","Charter District","Charter School Leader","Rashidah Lawson","215 Dorchester Street","","Boston","MA","02127","Ellie Rounds-Bloom","781-338-3128","erounds-bloom@doe.mass.edu",null,150,501,0,"Yes"]
[365,"35050000","UP Academy Charter School of Dorchester (District)","Charter District","Charter School Leader","Erica Andrew","35 Westville Street","","Boston","MA","02124","Ellie Rounds-Bloom","781-338-3128","erounds-bloom@doe.mass.edu",null,206,666,0,"No"]
[366,"07740000","Up-Island Regional","Public School District","Superintendent","Matthew D'Andrea","4 Pine Street","","Vineyard Haven","MA","02568","Sue Mazzarella","781-338-3587","smazzarella@doe.mass.edu",null,23,394,0,"Yes"]
[367,"08790000","Upper Cape Cod Regional Vocational Technical","Public School District","Superintendent","Robert Dutch","220 Sandwich Rd","","Bourne","MA","02532","Ellie Rounds-Bloom","781-338-3128","erounds-bloom@doe.mass.edu",null,0,699,5,"No"]
[368,"03040000","Uxbridge","Public School District","Superintendent","Frank Tiano","9 North Main Street","","Uxbridge","MA","01569","Nancy Labrie","781-338-3536","nlabrie@doe.mass.edu",null,28,1646,0,"Yes"]
[369,"04980000","Veritas Preparatory Charter School (District)","Charter District","Charter School Leader","Rachel Romano","370 Pine Street","","Springfield","MA","01105","Sue Mazzarella","781-338-3587","smazzarella@doe.mass.edu",null,27,348,0,"Yes"]
[370,"07750000","Wachusett","Public School District","Superintendent","Darryll McCall","1745 Main Street","c/o Jefferson School","Jefferson","MA","01522","Beth O'Connell","781-338-3132","EO'Connell@doe.mass.edu",null,122,7005,7,"Yes"]
[371,"03050000","Wakefield","Public School District","Superintendent","Douglas Lyons","60 Farm Street","","Wakefield","MA","01880","Russ Fleming","781-338-6529","RFleming@doe.mass.edu",null,78,3376,0,"Yes"]
[372,"03060000","Wales","Public School District","Superintendent","Erin Nosek","320 Brookfield Rd","","Fiskdale","MA","01518","Russ Fleming","781-338-6529","RFleming@doe.mass.edu",null,0,133,1,"Yes"]
[373,"03070000","Walpole","Public School District","Superintendent","Lincoln Lynch","135 School Street","","Walpole","MA","02081","Beth O'Connell","781-338-3132","EO'Connell@doe.mass.edu",null,118,3728,0,"Yes"]
[374,"03080000","Waltham","Public School District","Superintendent","George Frost","617 Lexington Street","","Waltham","MA","02452","Sue Mazzarella","781-338-3587","smazzarella@doe.mass.edu",null,1312,5553,0,"Yes"]
[375,"03090000","Ware","Public School District","Superintendent","Marlene Di Leo","P O Box 240","","Ware","MA","01082","Alex Lilley","781-338-6212","alilley@doe.mass.edu",null,12,1120,0,"Yes"]
[376,"03100000","Wareham","Public School District","Superintendent","Kimberly Shaver-Hood","48 Marion Road","","Wareham","MA","02571","Ellie Rounds-Bloom","781-338-3128","erounds-bloom@doe.mass.edu",null,29,2078,43,"Yes"]
[377,"03140000","Watertown","Public School District","Superintendent","Deanne Galdston","30 Common Street","","Watertown","MA","02472","Aneesh Sahni","781-338-3532","aneesh.sahni@doe.mass.edu",null,337,2533,9,"Yes"]
[378,"03150000","Wayland","Public School District","Superintendent","Arthur Unobskey","41 Cochituate Rd","","Wayland","MA","01778","Nancy Labrie","781-338-3536","nlabrie@doe.mass.edu",null,109,2733,0,"Yes"]
[379,"03160000","Webster","Public School District","Superintendent","Ruthann Petruno-Goguen","77 Poland Street","","Webster","MA","01570","Russ Fleming","781-338-6529","RFleming@doe.mass.edu",null,168,1806,45,"Yes"]
[380,"03170000","Wellesley","Public School District","Superintendent","David Lussier","40 Kingsbury Street","","Wellesley","MA","02481","Julia Foodman","781-338-3577","jfoodman@doe.mass.edu",null,116,4900,8,"Yes"]
[381,"03180000","Wellfleet","Public School District","Superintendent","Thomas Conrad","78 Eldredge Pkwy","","Orleans","MA","02653","Julia Foodman","781-338-3577","jfoodman@doe.mass.edu",null,1,90,1,"Yes"]
[382,"03220000","West Boylston","Public School District","Superintendent","Elizabeth Schaper","125 Crescent Street","","West Boylston","MA","01583","Alex Lilley","781-338-6212","alilley@doe.mass.edu",null,30,875,0,"Yes"]
[383,"03230000","West Bridgewater","Public School District","Superintendent","Patricia Oakley","2 Spring Street","","West Bridgewater","MA","02379","Ellie Rounds-Bloom","781-338-3128","erounds-bloom@doe.mass.edu",null,20,1299,4,"Yes"]
[384,"03320000","West Springfield","Public School District","Superintendent","Michael Richard","26 Central Street","","West Springfield","MA","01089","Alex Lilley","781-338-6212","alilley@doe.mass.edu",null,436,4000,176,"Yes"]
[385,"03210000","Westborough","Public School District","Superintendent","Amber Bock","45 West Main Street","","Westborough","MA","01581","Sue Mazzarella","781-338-3587","smazzarella@doe.mass.edu",null,406,3840,0,"Yes"]
[386,"03250000","Westfield","Public School District","Superintendent","Stefan Czaporowski","94 North Elm Street","Suite 101","Westfield","MA","01085","Alex Lilley","781-338-6212","alilley@doe.mass.edu",null,311,5172,78,"Yes"]
[387,"03260000","Westford","Public School District","Superintendent","Everett Olsen","23 Depot Street","","Westford","MA","01886","Nancy Labrie","781-338-3536","nlabrie@doe.mass.edu",null,95,4991,11,"Yes"]
[388,"03270000","Westhampton","Public School District","Superintendent","Aaron Osborne","19 Stage Rd","","Westhampton","MA","01027","Nancy Labrie","781-338-3536","nlabrie@doe.mass.edu",null,1,116,0,"Yes"]
[389,"03300000","Weston","Public School District","Superintendent","Midge Connolly","89 Wellesley Street","","Weston","MA","02493","Julia Foodman","781-338-3577","jfoodman@doe.mass.edu",null,69,2068,0,"Yes"]
[390,"03310000","Westport","Public School District","Superintendent","Gary Reese","17 Main Rd","","Westport","MA","02790","Beth O'Connell","781-338-3132","EO'Connell@doe.mass.edu",null,14,1386,0,"Yes"]
[391,"03350000","Westwood","Public School District","Superintendent","Emily Parks","220 Nahatan Street","","Westwood","MA","02090","Alex Lilley","781-338-6212","alilley@doe.mass.edu",null,27,3074,0,"Yes"]
[392,"03360000","Weymouth","Public School District","Superintendent","Jennifer Curtis-Whipple","111 Middle Street","","Weymouth","MA","02189","Ellie Rounds-Bloom","781-338-3128","erounds-bloom@doe.mass.edu",null,252,5731,120,"Yes"]
[393,"03370000","Whately","Public School District","Superintendent","Darius Modestow","113 North Main Street, Office C101","","South Deerfield","MA","01373","Alex Lilley","781-338-6212","alilley@doe.mass.edu",null,3,114,0,"No"]
[394,"07800000","Whitman-Hanson","Public School District","Superintendent","Jeffrey Szymaniak","610 Franklin Street","","Whitman","MA","02382","Alex Lilley","781-338-6212","alilley@doe.mass.edu",null,38,3753,14,"Yes"]
[395,"08850000","Whittier Regional Vocational Technical","Public School District","Superintendent","Maureen Lynch","115 Amesbury Line Rd","","Haverhill","MA","01830","Aneesh Sahni","781-338-3532","aneesh.sahni@doe.mass.edu",null,14,1237,18,"Yes"]
[396,"03400000","Williamsburg","Public School District","Superintendent","Aaron Osborne","19 Stage Rd","","Westhampton","MA","01027","Nancy Labrie","781-338-3536","nlabrie@doe.mass.edu",null,5,137,0,"Yes"]
[397,"03420000","Wilmington","Public School District","Superintendent","Glenn Brand","161 Church Street","","Wilmington","MA","01887","Julia Foodman","781-338-3577","jfoodman@doe.mass.edu",null,36,3171,23,"Yes"]
[398,"03430000","Winchendon","Public School District","Superintendent","Joan Landers","175 Grove Street","","Winchendon","MA","01475","Beth O'Connell","781-338-3132","EO'Connell@doe.mass.edu",null,8,1200,28,"Yes"]
[399,"03440000","Winchester","Public School District","Superintendent","Judith Evans","40 Samoset Road","","Winchester","MA","01890","Sue Mazzarella","781-338-3587","smazzarella@doe.mass.edu",null,125,4620,16,"Yes"]
[400,"03460000","Winthrop","Public School District","Superintendent","Lisa Howard","1 Metcalf Square","","Winthrop","MA","02152","Alex Lilley","781-338-6212","alilley@doe.mass.edu",null,162,1950,15,"Yes"]
[401,"03470000","Woburn","Public School District","Superintendent","Matthew Crowley","55 Locust Street","","Woburn","MA","01801","Ellie Rounds-Bloom","781-338-3128","erounds-bloom@doe.mass.edu",null,321,4398,0,"Yes"]
[402,"03480000","Worcester","Public School District","Superintendent","Maureen Binienda","20 Irving Street","","Worcester","MA","01609","Russ Fleming","781-338-6529","RFleming@doe.mass.edu",null,7774,24574,3178,"Yes"]
[403,"03490000","Worthington","Public School District","Superintendent","Gretchen Morse-Dobosz","147 Huntington Road","","Worthington","MA","01098","Nancy Labrie","781-338-3536","nlabrie@doe.mass.edu",null,0,58,0,"No"]
[404,"03500000","Wrentham","Public School District","Superintendent","Allan Cameron","120 Taunton Street","","Wrentham","MA","02093","Russ Fleming","781-338-6529","RFleming@doe.mass.edu",null,23,918,0,"Yes"]

{"sheet":"dataSchoolInfo","index":23,"n_rows":1848,"n_cols":11,"rows_kept":1848,"cut":false,"hidden":true,"merged":[]}
["ORG_CODe","School Name","School Code",null,"Gradeserved","TitleIStatus","March 19 Enrolled K-12",null,"sch_type19","ECODIS K-12","ECODIS K-12 x 1.6"]
["0001","Abington Early Education Program","00010001",null,"PK","NT",0,null,"EES",0,{"$f":"ROUND(J2*1.6, 0)","v":0}]
["0001","Woodsdale Elementary School","00010015",null,"03 - 04","NT",287,null,"ES",70,{"$f":"ROUND(J3*1.6, 0)","v":112}]
["0001","Beaver Brook Elementary","00010020",null,"K  - 02","TA",453,null,"EES",96,154]
["0001","Abington Middle School","00010405",null,"05 - 08","NT",675,null,"MS",172,275]
["0001","Abington High","00010505",null,"09 - 12","NT",543,null,"HS",109,174]
["0003","Acushnet Elementary School","00030025",null,"PK - 04","TA",528,null,"ES",120,192]
["0003","Albert F Ford Middle School","00030305",null,"05 - 08","NT",436,null,"MS",92,147]
["0005","Agawam Early Childhood Center","00050003",null,"PK","NT",0,null,"EES",0,0]
["0005","Clifford M Granger","00050010",null,"K  - 04","SW",257,null,"ES",92,147]
["0005","Benjamin J Phelps","00050020",null,"K  - 04","SW",346,null,"ES",101,162]
["0005","Robinson Park","00050025",null,"K  - 04","SW",364,null,"ES",140,224]
["0005","James Clark School","00050030",null,"K  - 04","SW",313,null,"ES",95,152]
["0005","Roberta G. Doering School","00050303",null,"05 - 07","NT",591,null,"MS",186,298]
["0005","Agawam Junior High","00050405",null,"07 - 08","NT",581,null,"MS",177,283]
["0005","Agawam High","00050505",null,"09 - 12","NT",1074,null,"HS",223,357]
["0007","Amesbury Elementary","00070005",null,"PK - 04","TA",343,null,"ES",69,110]
["0007","Charles C Cashman Elementary","00070010",null,"PK - 04","TA",396,null,"ES",124,198]
["0007","Amesbury Middle","00070013",null,"05 - 08","NT",631,null,"MS",146,234]
["0007","Amesbury High","00070505",null,"09 - 12","NT",533,null,"HS",73,117]
["0007","Amesbury Innovation High School","00070515",null,"09 - 12","NT",55,null,"HS",25,40]
["0008","Crocker Farm Elementary","00080009",null,"PK - 06","TA",340,null,"ES",98,157]
["0008","Fort River Elementary","00080020",null,"K  - 06","TA",311,null,"ES",113,181]
["0008","Wildwood Elementary","00080050",null,"K  - 06","TA",417,null,"ES",118,189]
["0009","Bancroft Elementary","00090003",null,"K  - 05","TA",594,null,"ES",53,85]
["0009","High Plain Elementary","00090004",null,"K  - 05","NT",544,null,"ES",46,74]
["0009","Shawsheen School","00090005",null,"PK","NT",0,null,"EES",0,0]
["0009","Henry C Sanborn Elementary","00090010",null,"K  - 05","TA",388,null,"ES",28,45]
["0009","South Elementary","00090020",null,"K  - 05","NT",486,null,"ES",16,26]
["0009","West Elementary","00090025",null,"K  - 05","TA",602,null,"ES",35,56]
["0009","Doherty Middle","00090305",null,"06 - 08","NT",568,null,"MS",44,70]
["0009","Andover West Middle","00090310",null,"06 - 08","TA",522,null,"MS",48,77]
["0009","Wood Hill Middle School","00090350",null,"06 - 08","TA",412,null,"MS",37,59]
["0009","Andover High","00090505",null,"09 - 12","NT",1757,null,"HS",133,213]
["0010","John A Bishop","00100005",null,"K  - 05","NT",448,null,"ES",18,29]
["0010","Brackett","00100010",null,"K  - 05","NT",525,null,"ES",20,32]
["0010","Cyrus E Dallin","00100025",null,"K  - 05","NT",485,null,"ES",24,38]
["0010","Hardy","00100030",null,"K  - 05","TA",450,null,"ES",27,43]
["0010","Menotomy Preschool","00100038",null,"PK","NT",0,null,"EES",0,0]
["0010","Peirce","00100045",null,"K  - 05","TA",305,null,"ES",24,38]
["0010","Thompson","00100050",null,"K  - 05","TA",506,null,"ES",77,123]
["0010","M Norcross Stratton","00100055",null,"K  - 05","TA",424,null,"ES",39,62]
["0010","Gibbs School","00100305",null,"06","NT",460,null,"MS",48,77]
["0010","Ottoson Middle","00100410",null,"07 - 08","NT",857,null,"MS",71,114]
["0010","Arlington High","00100505",null,"09 - 12","NT",1380,null,"HS",113,181]
["0014","William Pittaway Elementary","00140005",null,"PK","NT",0,null,"EES",0,0]
["0014","Henry E Warren Elementary","00140010",null,"K  - 02","TA",652,null,"EES",90,144]
["0014","David Mindess","00140015",null,"03 - 05","TA",630,null,"ES",90,144]
["0014","Ashland Middle","00140405",null,"06 - 08","TA",614,null,"MS",97,155]
["0014","Ashland High","00140505",null,"09 - 12","NT",829,null,"HS",107,171]
["0016","A. Irvin Studley Elementary School","00160001",null,"K  - 04","SW",404,null,"ES",135,216]
["0016","Early Learning Center","00160008",null,"PK","NT",0,null,"EES",0,0]
["0016","Thomas Willett Elementary School","00160035",null,"K  - 04","SW",402,null,"ES",130,208]
["0016","Hyman Fine Elementary School","00160040",null,"K  - 04","SW",458,null,"ES",137,219]
["0016","Hill-Roberts Elementary School","00160045",null,"K  - 04","SW",448,null,"ES",129,206]
["0016","Peter Thacher Elementary School","00160050",null,"K  - 04","SW",426,null,"ES",156,250]
["0016","Robert J. Coelho Middle School","00160305",null,"05 - 08","NT",649,null,"MS",140,224]
["0016","Cyril K. Brennan Middle School","00160315",null,"05 - 08","NT",592,null,"MS",234,374]
["0016","Wamsutta Middle School","00160320",null,"05 - 08","NT",570,null,"MS",157,251]
["0016","Attleboro High","00160505",null,"09 - 12","NT",1706,null,"HS",404,646]
["0016","Attleboro Community Academy","00160515",null,"10 - 12","NT",76,null,"HS",41,66]
["0017","Bryn Mawr","00170010",null,"K  - 02","TA",303,null,"EES",67,107]
["0017","Pakachoag School","00170025",null,"PK - 02","NT",267,null,"EES",45,72]
["0017","Swanson Road Intermediate School","00170030",null,"03 - 05","TA",613,null,"ES",116,186]
["0017","Auburn Middle","00170305",null,"06 - 08","TA",624,null,"MS",117,187]
["0017","Auburn Senior High","00170505",null,"PK,09 - 12","NT",724,null,"HS",94,150]
["0018","Ralph D Butler","00180010",null,"PK - 06","TA",385,null,"ES",107,{"$f":"ROUND(J67*1.6, 0)","v":171}]
["0018","Avon Middle High School","00180510",null,"07 - 12","NT",318,null,"MSHS/K-12",104,166]
["0020","Enoch Cobb Early Learning Center","00200001",null,"PK","NT",0,null,"EES",0,0]
["0020","West Barnstable Elementary","00200005",null,"K  - 03","NT",261,null,"ES",86,138]
["0020","Centerville Elementary","00200010",null,"K  - 03","NT",245,null,"ES",81,130]
["0020","Barnstable Community Innovative School","02000012",null,"K  - 03","SW",287,null,"ES",140,{"$f":"ROUND(J72*1.6, 0)","v":224}]
["0020","Hyannis West Elementary","00200025",null,"K  - 03","SW",331,null,"ES",209,334]
["0020","West Villages Elementary School","00200045",null,"K  - 03","NT",421,null,"ES",116,186]
["0020","Barnstable United Elementary School","00200050",null,"04 - 05","SW",813,null,"ES",296,474]
["0020","Barnstable Intermediate School","00200315",null,"06 - 07","NT",777,null,"MS",291,466]
["0020","Barnstable High","00200505",null,"08 - 12","NT",1792,null,"MSHS/K-12",504,806]
["0023","Lt Elezer Davis","00230010",null,"K  - 02","NT",596,null,"EES",56,90]
["0023","Lt Job Lane School","00230012",null,"03 - 05","TA",616,null,"ES",46,74]
["0023","John Glenn Middle","00230305",null,"06 - 08","TA",571,null,"MS",57,91]
["0023","Bedford High","00230505",null,"PK,09 - 12","TA",835,null,"HS",63,101]
["0024","Cold Spring","00240005",null,"PK - K","TA",137,null,"EES",28,45]
["0024","Chestnut Hill Community School","00240006",null,"04 - 06","NT",541,null,"ES",109,174]
["0024","Swift River Elementary","00240018",null,"01 - 03","TA",485,null,"ES",91,146]
["0024","Jabish Middle School","00240025",null,"07 - 08","NT",387,null,"MS",73,117]
["0024","Belchertown High","00240505",null,"09 - 12","NT",688,null,"HS",92,147]
["0025","Bellingham Early Childhood Center","00250003",null,"PK","NT",0,null,"EES",0,0]
["0025","Joseph F DiPietro Elementary School","00250020",null,"K  - 03","SW",347,null,"ES",85,136]
["0025","Stall Brook","00250025",null,"K  - 03","SW",289,null,"ES",59,94]
["0025","Bellingham Memorial School","00250315",null,"04 - 07","NT",708,null,"ESMS",133,213]
["0025","Bellingham High School","00250505",null,"08 - 12","NT",744,null,"MSHS/K-12",114,182]
["0025","Keough Memorial Academy","00250510",null,"08 - 12","NT",35,null,"MSHS/K-12",12,19]
["0026","Winn Brook","00260005",null,"K  - 04","NT",464,null,"ES",16,26]
["0026","Mary Lee Burbank","00260010",null,"K  - 04","NT",424,null,"ES",23,37]
["0026","Daniel Butler","00260015",null,"K  - 04","TA",381,null,"ES",36,58]
["0026","Roger E Wellington","00260035",null,"PK - 04","TA",571,null,"ES",47,75]
["0026","Winthrop L Chenery Middle","00260305",null,"05 - 08","NT",1435,null,"MS",110,176]
["0026","Belmont High","00260505",null,"09 - 12","NT",1311,null,"HS",91,146]
["0027","Berkley Community School","00270010",null,"PK - 04","TA",429,null,"ES",77,123]
["0027","Berkley Middle School","00270305",null,"05 - 08","NT",391,null,"MS",63,101]
["0620","Berlin Memorial","06200006",null,"PK - 05","TA",167,null,"ES",27,43]
["0030","McKeown School","00300002",null,"PK","NT",0,null,"EES",0,0]
["0030","Centerville Elementary","00300010",null,"K  - 04","SW",303,null,"ES",119,190]
["0030","Cove Elementary","00300015",null,"K  - 04","SW",432,null,"ES",111,178]
["0030","Hannah Elementary","00300033",null,"K  - 04","NT",324,null,"ES",65,104]
["0030","North Beverly Elementary","00300040",null,"K  - 04","NT",316,null,"ES",82,131]
["0030","Ayers/Ryal Side School","00300055",null,"K  - 04","SW",427,null,"ES",106,170]
["0030","Beverly Middle School","00300305",null,"05 - 08","NT",1406,null,"MS",361,578]
["0030","Beverly High","00300505",null,"09 - 12","NT",1250,null,"HS",274,438]
["0031","Thomas Ditson","00310005",null,"K  - 05","TA",505,null,"ES",79,126]
["0031","Frederick J Dutile","00310007",null,"K  - 05","TA",282,null,"ES",52,83]
["0031","John F Kennedy","00310012",null,"K  - 05","NT",317,null,"ES",38,61]
["0031","Parker","00310015",null,"K  - 05","TA",497,null,"ES",88,141]
["0031","Hajjar Elementary","00310026",null,"K  - 05","TA",478,null,"ES",110,176]
["0031","Eugene C Vining","00310030",null,"K  - 05","TA",180,null,"ES",46,74]
["0031","Marshall Middle School","00310305",null,"06 - 08","NT",648,null,"MS",118,189]
["0031","Locke Middle","00310310",null,"06 - 08","NT",519,null,"MS",70,112]
["0031","Billerica Memorial High School","00310505",null,"PK,09 - 12","NT",1151,null,"HS",147,235]
["0035","Lee Academy","00350001",null,"PK - 03","SW",156,null,"ES",104,166]
["0035","Baldwin Early Learning Center","00350003",null,"PK - 01","SW",76,null,"EES",32,51]
["0035","Lyon K-8","00350004",null,"K  - 08","SW",139,null,"ESMS",59,94]
["0035","ELC - West Zone","00350006",null,"PK - 01","SW",62,null,"EES",31,50]
["0035","Dr. Catherine Ellison-Rosa Parks Early Ed School","00350008",null,"PK - 03","SW",145,null,"ES",107,171]
["0035","East Boston Early Childhood Center","00350009",null,"PK - 01","SW",108,null,"EES",77,123]
["0035","Haynes Early Education Center","00350010",null,"PK - 01","SW",146,null,"EES",99,158]
["0035","Boston Teachers Union School","00350012",null,"PK - 08","SW",256,null,"ESMS",100,160]
["0035","Jackson Mann","00350013",null,"PK - 08","SW",545,null,"ESMS",350,560]
["0035","Pauline Agassiz Shaw Elementary School","00350014",null,"PK - 03","SW",162,null,"ES",118,189]
["0035","Higginson","00350015",null,"PK - 02","SW",129,null,"EES",100,160]
["0035","Mattahunt Elementary School","00350016",null,"PK - 02","SW",283,null,"EES",188,301]
["0035","Curley K-8 School","00350020",null,"PK - 08","SW",866,null,"ESMS",454,726]
["0035","Beethoven","00350021",null,"PK - 02","SW",276,null,"EES",109,{"$f":"ROUND(J132*1.6, 0)","v":174}]
["0035","Carter School","00350036",null,"07 - 12","SW",20,null,"MSHS/K-12",17,27]
["0035","Charles Sumner","00350052",null,"PK - 05","SW",502,null,"ES",285,456]
["0035","Charles H Taylor","00350054",null,"PK - 05","SW",519,null,"ES",369,590]
["0035","Curtis Guild","00350062",null,"PK - 05","SW",227,null,"ES",132,211]
["0035","Dante Alighieri Montessori School","00350066",null,"PK - 06","SW",71,null,"ES",26,42]
["0035","David A Ellis","00350072",null,"PK - 05","SW",346,null,"ES",270,432]
["0035","Dearborn","00350074",null,"06 - 12","SW",416,null,"MSHS/K-12",259,414]
["0035","Dennis C Haley","00350077",null,"PK - 08","SW",390,null,"ESMS",166,266]
["0035","Donald Mckay","00350080",null,"PK - 08","SW",793,null,"ESMS",469,750]
["0035","Edward Everett","00350088",null,"PK - 05","SW",233,null,"ES",154,246]
["0035","Eliot Elementary","00350096",null,"PK - 08","SW",628,null,"ESMS",115,184]
["0035","Ellis Mendell","00350100",null,"PK - 05","SW",247,null,"ES",106,170]
["0035","Franklin D Roosevelt","00350116",null,"PK - 08","SW",400,null,"ESMS",194,310]
["0035","George H Conley","00350122",null,"PK - 05","SW",190,null,"ES",92,147]
["0035","Henry Grew","00350135",null,"PK - 05","SW",217,null,"ES",146,234]
["0035","O W Holmes","00350138",null,"PK - 05","SW",295,null,"ES",231,370]
["0035","Hugh Roe O'Donnell","00350141",null,"PK - 05","SW",247,null,"ES",140,224]
["0035","Condon K-8","00350146",null,"PK - 08","SW",799,null,"ESMS",539,862]
["0035","James W Hennigan","00350153",null,"K  - 08","SW",608,null,"ESMS",456,730]
["0035","James J Chittick","00350154",null,"PK - 05","SW",220,null,"ES",155,248]
["0035","James Otis","00350156",null,"PK - 05","SW",343,null,"ES",177,283]
["0035","John F Kennedy","00350166",null,"PK - 05","SW",361,null,"ES",256,410]
["0035","UP Academy Holland","00350167",null,"PK - 05","SW",708,null,"ES",517,827]
["0035","John D Philbrick","00350172",null,"PK - 05","SW",152,null,"ES",69,110]
["0035","John W McCormack","00350179",null,"06 - 08","SW",369,null,"MS",281,450]
["0035","John Winthrop","00350180",null,"PK - 05","SW",257,null,"ES",194,310]
["0035","Joseph P Tynan","00350181",null,"PK - 05","SW",191,null,"ES",156,250]
["0035","Joseph J Hurley","00350182",null,"PK - 08","SW",332,null,"ESMS",176,282]
["0035","Joseph Lee","00350183",null,"PK - 08","SW",603,null,"ESMS",391,626]
["0035","Joseph P Manning","00350184",null,"PK - 05","SW",137,null,"ES",41,66]
["0035","Joyce Kilmer","00350190",null,"PK - 08","SW",401,null,"ESMS",104,166]
["0035","Harvard-Kent","00350200",null,"PK - 05","SW",379,null,"ES",268,429]
["0035","Manassah E Bradley","00350215",null,"PK - 05","SW",240,null,"ES",120,192]
["0035","Mather","00350227",null,"PK - 05","SW",526,null,"ES",329,526]
["0035","Maurice J Tobin","00350229",null,"PK - 08","SW",419,null,"ESMS",322,515]
["0035","Michael J Perkins","00350231",null,"PK - 05","SW",170,null,"ES",132,211]
["0035","Mozart","00350237",null,"PK - 05","SW",143,null,"ES",46,74]
["0035","Richard J Murphy","00350240",null,"PK - 08","SW",878,null,"ESMS",428,685]
["0035","Nathan Hale","00350243",null,"PK - 05","SW",136,null,"ES",78,125]
["0035","Oliver Hazard Perry","00350255",null,"PK - 08","SW",230,null,"ESMS",112,179]
["0035","Orchard Gardens","00350257",null,"PK - 08","SW",858,null,"ESMS",574,918]
["0035","William H Ohrenberger","00350258",null,"03 - 08","SW",635,null,"ESMS",300,480]
["0035","Lyndon","00350262",null,"PK - 08","SW",558,null,"ESMS",151,242]
["0035","Patrick J Kennedy","00350264",null,"PK - 05","SW",264,null,"ES",172,275]
["0035","Dr. William Henderson Lower","00350266",null,"PK - 01","SW",139,null,"EES",58,93]
["0035","Paul A Dever","00350268",null,"PK - 05","SW",367,null,"ES",296,474]
["0035","Phineas Bates","00350278",null,"PK - 05","SW",231,null,"ES",118,189]
["0035","Josiah Quincy","00350286",null,"PK - 05","SW",722,null,"ES",361,578]
["0035","Roger Clap","00350298",null,"PK - 05","SW",114,null,"ES",75,120]
["0035","Samuel Adams","00350302",null,"PK - 05","SW",209,null,"ES",115,184]
["0035","Samuel W Mason","00350304",null,"PK - 05","SW",220,null,"ES",145,232]
["0035","Sarah Greenwood","00350308",null,"PK - 08","SW",364,null,"ESMS",270,432]
["0035","Gardner Pilot Academy","00350326",null,"PK - 08","SW",357,null,"ESMS",205,328]
["0035","Thomas J Kenny","00350328",null,"PK - 05","SW",279,null,"ES",175,280]
["0035","Warren-Prescott","00350346",null,"PK - 08","SW",514,null,"ESMS",233,373]
["0035","William Ellery Channing","00350360",null,"PK - 05","SW",165,null,"ES",96,154]
["0035","William McKinley","00350363",null,"PK - 12","SW",328,null,"MSHS/K-12",268,429]
["0035","William E Russell","00350366",null,"PK - 05","SW",328,null,"ES",208,333]
["0035","William Monroe Trotter","00350370",null,"PK - 08","SW",448,null,"ESMS",342,547]
["0035","Winship Elementary","00350374",null,"PK - 05","SW",156,null,"ES",75,120]
["0035","Edison K-8","00350375",null,"PK - 08","SW",599,null,"ESMS",369,590]
["0035","King K-8","00350376",null,"PK - 08","SW",429,null,"ESMS",337,539]
["0035","Higginson/Lewis K-8","00350377",null,"02 - 08","SW",255,null,"ESMS",210,336]
["0035","Mildred Avenue K-8","00350378",null,"PK - 08","SW",600,null,"ESMS",413,{"$f":"ROUND(J196*1.6, 0)","v":661}]
["0035","Young Achievers","00350380",null,"PK - 08","SW",523,null,"ESMS",357,571]
["0035","Mission Hill School","00350382",null,"PK - 08","SW",189,null,"ESMS",82,131]
["0035","Lilla G. Frederick Middle School","00350383",null,"06 - 08","SW",474,null,"MS",354,566]
["0035","Blackstone","00350390",null,"PK - 05","SW",492,null,"ES",357,571]
["0035","Dr. William Henderson Upper","00350426",null,"02 - 12","SW",622,null,"MSHS/K-12",312,499]
["0035","Clarence R Edwards Middle","00350430",null,"06 - 08","SW",351,null,"MS",238,381]
["0035","Washington Irving Middle","00350445",null,"06 - 08","SW",297,null,"MS",202,323]
["0035","James P Timilty Middle","00350485",null,"06 - 08","SW",322,null,"MS",227,363]
["0035","Brighton High","00350505",null,"09 - 12","SW",578,null,"HS",392,627]
["0035","Boston International High School","00350507",null,"09 - 12","SW",396,null,"HS",266,426]
["0035","Charlestown High","00350515",null,"09 - 12","SW",815,null,"HS",530,848]
["0035","Community Academy","00350518",null,"09 - 12","SW",47,null,"HS",36,58]
["0035","Excel High School","00350522",null,"09 - 12","SW",501,null,"HS",307,491]
["0035","Jeremiah E Burke High","00350525",null,"09 - 12","SW",416,null,"HS",280,448]
["0035","East Boston High","00350530",null,"09 - 12","SW",1186,null,"HS",666,1066]
["0035","The English High","00350535",null,"09 - 12","SW",563,null,"HS",387,619]
["0035","Madison Park High","00350537",null,"09 - 12","SW",838,null,"HS",604,966]
["0035","Fenway High School","00350540",null,"09 - 12","SW",373,null,"HS",214,342]
["0035","Another Course To College","00350541",null,"09 - 12","SW",231,null,"HS",127,203]
["0035","New Mission High School","00350542",null,"07 - 12","SW",449,null,"MSHS/K-12",236,378]
["0035","Greater Egleston Community High School","00350543",null,"09 - 12","SW",88,null,"HS",64,102]
["0035","Boston Latin Academy","00350545",null,"07 - 12","SW",1742,null,"MSHS/K-12",549,878]
["0035","Boston Arts Academy","00350546",null,"09 - 12","SW",445,null,"HS",203,325]
["0035","Boston Adult Academy","00350548",null,"11 - 12","SW",173,null,"HS",104,166]
["0035","Margarita Muniz Academy","00350549",null,"09 - 12","SW",293,null,"HS",215,344]
["0035","Boston Community Leadership Academy","00350558",null,"09 - 12","SW",463,null,"HS",275,440]
["0035","Boston Latin","00350560",null,"07 - 12","SW",2426,null,"MSHS/K-12",394,630]
["0035","Quincy Upper School","00350565",null,"06 - 12","SW",529,null,"MSHS/K-12",289,462]
["0035","O'Bryant School Math/Science","00350575",null,"07 - 12","SW",1516,null,"MSHS/K-12",675,1080]
["0035","Urban Science Academy","00350579",null,"09 - 12","SW",290,null,"HS",170,272]
["0035","Community Academy of Science and Health","00350581",null,"09 - 12","SW",370,null,"HS",250,400]
["0035","Lyon Upper 9-12","00350655",null,"09 - 12","SW",135,null,"HS",66,106]
["0035","Mario Umana Academy","00350656",null,"PK - 08","SW",927,null,"ESMS",551,882]
["0035","TechBoston Academy","00350657",null,"06 - 12","SW",917,null,"MSHS/K-12",620,992]
["0035","West Roxbury Academy","00350658",null,"09 - 12","SW",346,null,"HS",209,334]
["0035","Snowden International School at Copley","00350690",null,"09 - 12","SW",470,null,"HS",276,442]
["0035","Rafael Hernandez","00350691",null,"PK - 08","SW",360,null,"ESMS",210,336]
["0035","Horace Mann School for the Deaf","00350750",null,"PK,K,01 - 04, 06 - 12","SW",82,null,"MSHS/K-12",59,94]
["0035","Boston Collaborative High School","00350755",null,"09 - 12","SW",226,null,"HS",155,248]
["0036","Bournedale Elementary School","00360005",null,"PK - 04","TA",376,null,"ES",106,170]
["0036","Peebles Elementary School","00360010",null,"K  - 04","TA",346,null,"ES",111,178]
["0036","Bourne Middle School","00360325",null,"05 - 08","NT",687,null,"MS",181,290]
["0036","Bourne High School","00360505",null,"09 - 12","NT",465,null,"HS",93,149]
["0038","Harry Lee Cole","00380005",null,"PK - 02","TA",264,null,"EES",18,29]
["0038","Spofford Pond","00380013",null,"03 - 06","TA",414,null,"ES",15,24]
["0620","Boylston Elementary","06200007",null,"PK - 05","TA",263,null,"ES",21,34]
["0040","Hollis","00400005",null,"K  - 05","NT",443,null,"ES",71,114]
["0040","Monatiquot Kindergarten Center","00400009",null,"K","NT",271,null,"EES",55,88]
["0040","Highlands","00400015",null,"K  - 05","NT",405,null,"ES",31,50]
["0040","Mary E Flaherty School","00400020",null,"K  - 05","NT",374,null,"ES",63,101]
["0040","Liberty","00400025",null,"01 - 05","NT",430,null,"ES",61,98]
["0040","Archie T Morrison","00400033",null,"K  - 05","SW",422,null,"ES",124,198]
["0040","Donald Ross","00400050",null,"K  - 05","SW",269,null,"ES",72,115]
["0040","East Middle School","00400305",null,"06 - 08","NT",723,null,"MS",167,267]
["0040","South Middle School","00400310",null,"06 - 08","NT",704,null,"MS",97,155]
["0040","Braintree High","00400505",null,"PK,09 - 12","NT",1664,null,"HS",273,437]
["0041","Stony Brook Elementary","00410005",null,"PK - 02","TA",204,null,"EES",58,93]
["0041","Eddy Elementary","00410010",null,"03 - 05","TA",240,null,"ES",48,77]
["0043","Brimfield Elementary","00430005",null,"PK - 06","TA",257,null,"ES",60,96]
["0044","Dr W Arnone Community School","00440001",null,"PK - 05","SW",693,null,"ES",442,707]
["0044","Mary E. Baker School","00440002",null,"K  - 05","SW",708,null,"ES",357,571]
["0044","Manthala George Jr. School","00440003",null,"K  - 05","SW",991,null,"ES",632,1011]
["0044","Barrett Russell Early Childhood Center","00440008",null,"PK","NT",0,null,"EES",0,0]
["0044","Brookfield","00440010",null,"K  - 05","SW",589,null,"ES",311,{"$f":"ROUND(J260*1.6, 0)","v":498}]
["0044","John F Kennedy","00440017",null,"K  - 05","SW",615,null,"ES",293,469]
["0044","Edgar B Davis","00440023",null,"K  - 08","SW",1038,null,"ESMS",617,987]
["0044","Hancock","00440045",null,"K  - 05","SW",560,null,"ES",239,382]
["0044","Gilmore Elementary School","00440055",null,"K  - 05","SW",488,null,"ES",323,517]
["0044","Louis F Angelo Elementary","00440065",null,"K  - 05","SW",899,null,"ES",525,840]
["0044","Oscar F Raymond","00440078",null,"K  - 05","SW",861,null,"ES",604,966]
["0044","Frederick Douglass Academy","00440080",null,"06 - 12","NT",38,null,"MSHS/K-12",26,42]
["0044","Downey","00440110",null,"K  - 05","SW",615,null,"ES",395,632]
["0044","Huntington Therapeutic Day School","00440400",null,"03 - 12","NT",63,null,"MSHS/K-12",49,78]
["0044","East Middle School","00440405",null,"06 - 08","NT",639,null,"MS",412,659]
["0044","North Middle School","00440410",null,"07 - 08","NT",320,null,"MS",191,306]
["0044","South Middle School","00440415",null,"06 - 08","NT",627,null,"MS",358,573]
["0044","West Middle School","00440420",null,"06 - 08","NT",687,null,"MS",345,552]
["0044","Ashfield Middle School","00440421",null,"06 - 08","NT",559,null,"MS",274,438]
["0044","Joseph F. Plouffe Academy","00440422",null,"06 - 08","NT",733,null,"MS",372,595]
["0044","Brockton High","00440505",null,"09 - 12","NT",3993,null,"HS",1966,3146]
["0044","Brockton Champion High School","00440515",null,"09 - 12","NT",97,null,"HS",65,104]
["0044","Edison Academy","00440520",null,"09 - 12","NT",245,null,"HS",151,242]
["0045","Brookfield Elementary","00450005",null,"PK - 06","TA",284,null,"ES",86,138]
["0046","Brookline Early Education Program at Beacon","00460001",null,"PK","NT",0,null,"EES",0,0]
["0046","Brookline Early Education Program at Putterham","00460002",null,"PK","NT",0,null,"EES",0,0]
["0046","Edith C Baker","00460005",null,"K  - 08","NT",759,null,"ESMS",62,99]
["0046","Coolidge Corner School","00460015",null,"PK - 08","TA",881,null,"ESMS",90,144]
["0046","Michael Driscoll","00460020",null,"PK - 08","NT",621,null,"ESMS",37,59]
["0046","Heath","00460025",null,"PK - 08","NT",531,null,"ESMS",35,56]
["0046","Lawrence","00460030",null,"K  - 08","TA",695,null,"ESMS",60,96]
["0046","William H Lincoln","00460035",null,"K  - 08","TA",580,null,"ESMS",62,99]
["0046","Pierce","00460040",null,"K  - 08","TA",843,null,"ESMS",67,107]
["0046","John D Runkle","00460045",null,"PK - 08","NT",591,null,"ESMS",42,67]
["0046","The Lynch Center","00460060",null,"PK","NT",0,null,"EES",0,0]
["0046","Brookline High","00460505",null,"09 - 12","NT",2064,null,"HS",230,368]
["0048","Fox Hill","00480007",null,"K  - 05","NT",423,null,"ES",44,70]
["0048","Memorial","00480015",null,"K  - 05","TA",408,null,"ES",55,88]
["0048","Pine Glen Elementary","00480020",null,"K  - 05","TA",317,null,"ES",31,50]
["0048","Francis Wyman Elementary","00480035",null,"K  - 05","TA",537,null,"ES",72,115]
["0048","Marshall Simonds Middle","00480303",null,"06 - 08","NT",785,null,"MS",88,141]
["0048","Burlington High","00480505",null,"PK,K,09 - 12","NT",973,null,"HS",100,160]
["0049","Maria L. Baldwin","00490005",null,"PK - 05","NT",302,null,"ES",62,99]
["0049","Amigos School","00490006",null,"PK - 08","NT",384,null,"ESMS",66,106]
["0049","Cambridgeport","00490007",null,"PK - 05","SW",281,null,"ES",59,94]
["0049","Haggerty","00490020",null,"PK - 05","NT",234,null,"ES",46,74]
["0049","Martin Luther King Jr.","00490030",null,"PK - 05","NT",291,null,"ES",52,83]
["0049","King Open","00490035",null,"PK - 05","SW",320,null,"ES",99,158]
["0049","Kennedy-Longfellow","00490040",null,"PK - 05","SW",235,null,"ES",89,142]
["0049","Morse","00490045",null,"PK - 05","SW",252,null,"ES",86,138]
["0049","Peabody","00490050",null,"PK - 05","NT",269,null,"ES",62,99]
["0049","John M Tobin","00490065",null,"PK - 05","NT",214,null,"ES",52,83]
["0049","Graham and Parks","00490080",null,"PK - 05","NT",344,null,"ES",100,160]
["0049","Fletcher/Maynard Academy","00490090",null,"PK - 05","SW",241,null,"ES",101,162]
["0049","Cambridge Street Upper School","00490305",null,"06 - 08","TA",258,null,"MS",93,149]
["0049","Putnam Avenue Upper School","00490310",null,"06 - 08","TA",269,null,"MS",121,194]
["0049","Rindge Avenue Upper School","00490315",null,"06 - 08","NT",286,null,"MS",76,122]
["0049","Vassal Lane Upper School","00490320",null,"06 - 08","NT",293,null,"MS",97,155]
["0049","Cambridge Rindge and Latin","00490506",null,"09 - 12","NT",1977,null,"HS",592,947]
["0050","Rodman Early Childhood Center","00500010",null,"PK","NT",0,null,"EES",0,0]
["0050","Lt Peter M Hansen","00500012",null,"K  - 05","TA",487,null,"ES",76,122]
["0050","John F Kennedy","00500017",null,"K  - 05","NT",520,null,"ES",48,77]
["0050","Dean S Luce","00500020",null,"K  - 05","TA",491,null,"ES",67,107]
["0050","Wm H Galvin Middle","00500305",null,"06 - 08","NT",728,null,"MS",100,160]
["0050","Canton High","00500505",null,"09 - 12","NT",978,null,"HS",123,197]
["0051","Carlisle School","00510025",null,"PK - 08","NT",591,null,"ESMS",23,37]
["0052","Carver Elementary School","00520015",null,"PK - 05","SW",742,null,"ES",181,290]
["0052","Carver Middle/High School","00520405",null,"06 - 12","NT",756,null,"MSHS/K-12",154,246]
["0056","Community Education Center","00560001",null,"PK","NT",0,null,"EES",0,{"$f":"ROUND(J324*1.6, 0)","v":0}]
["0056","Center Elementary School","00560005",null,"K  - 04","TA",472,null,"ES",65,104]
["0056","South Row","00560015",null,"K  - 04","NT",423,null,"ES",36,58]
["0056","Charles D Harrington","00560025",null,"K  - 04","TA",499,null,"ES",82,131]
["0056","Byam School","00560030",null,"K  - 04","TA",484,null,"ES",74,118]
["0056","Col Moses Parker School","00560305",null,"05 - 08","NT",714,null,"MS",94,150]
["0056","McCarthy Middle School","00560310",null,"05 - 08","NT",805,null,"MS",97,155]
["0056","Chelmsford High","00560505",null,"09 - 12","NT",1444,null,"HS",125,200]
["0057","Shurtleff Early Childhood","00570003",null,"PK - 01","SW",626,null,"EES",419,670]
["0057","William A Berkowitz Elementary","00570025",null,"01 - 04","SW",488,null,"ES",317,507]
["0057","Edgar A Hooks Elementary","00570030",null,"01 - 04","SW",537,null,"ES",346,554]
["0057","George F. Kelly Elementary","00570035",null,"01 - 05","SW",518,null,"ES",307,491]
["0057","Frank M Sokolowski Elementary","00570040",null,"01 - 04","SW",528,null,"ES",366,586]
["0057","Eugene Wright Science and Technology Academy","00570045",null,"05 - 08","SW",504,null,"MS",315,504]
["0057","Clark Avenue School","00570050",null,"05 - 08","SW",650,null,"MS",398,637]
["0057","Joseph A. Browne School","00570055",null,"05 - 08","SW",576,null,"MS",379,606]
["0057","Chelsea High","00570505",null,"09 - 12","SW",1305,null,"HS",745,1192]
["0057","Chelsea Opportunity Academy","00570515",null,"09 - 12","SW",60,null,"HS",36,58]
["0061","Szetela Early Childhood Center","00610001",null,"PK","NT",0,null,"EES",0,0]
["0061","Barry","00610003",null,"K  - 05","SW",434,null,"ES",216,346]
["0061","Belcher","00610010",null,"K  - 02","SW",260,null,"EES",167,267]
["0061","Bowe","00610015",null,"K  - 05","SW",492,null,"ES",348,557]
["0061","Bowie","00610020",null,"K  - 05","NT",329,null,"ES",104,166]
["0061","Chicopee Academy","00610021",null,"06 - 12","NT",79,null,"MSHS/K-12",68,109]
["0061","Litwin","00610022",null,"K  - 05","SW",398,null,"ES",214,342]
["0061","Lambert-Lavoie","00610040",null,"K  - 05","SW",294,null,"ES",137,219]
["0061","Fairview Elementary","00610050",null,"K  - 05","SW",445,null,"ES",294,470]
["0061","Streiber Memorial School","00610065",null,"K  - 05","NT",248,null,"ES",98,157]
["0061","Gen John J Stefanik","00610090",null,"K  - 05","SW",398,null,"ES",289,462]
["0061","Bellamy Middle","00610305",null,"06 - 08","SW",809,null,"MS",424,678]
["0061","Dupont Middle","00610310",null,"06 - 08","SW",759,null,"MS",425,680]
["0061","Chicopee High","00610505",null,"09 - 12","NT",959,null,"HS",480,768]
["0061","Chicopee Comprehensive High School","00610510",null,"09 - 12","NT",1239,null,"HS",455,728]
["0063","Clarksburg Elementary","00630010",null,"K  - 08","TA",182,null,"ESMS",60,96]
["0064","Clinton Elementary","00640050",null,"PK - 04","SW",755,null,"ES",290,464]
["0064","Clinton Middle School","00640305",null,"05 - 08","SW",592,null,"MS",223,357]
["0064","Clinton Senior High","00640505",null,"PK,09 - 12","NT",444,null,"HS",135,216]
["0065","Deer Hill","00650005",null,"03 - 05","TA",370,null,"ES",17,27]
["0065","Joseph Osgood","00650010",null,"PK - 02","NT",322,null,"EES",14,22]
["0065","Cohasset Middle/High School","00650505",null,"06 - 12","NT",827,null,"MSHS/K-12",44,70]
["0067","Alcott","00670005",null,"PK - 05","TA",463,null,"ES",37,59]
["0067","Thoreau","00670020",null,"PK - 05","NT",454,null,"ES",23,37]
["0067","Willard","00670030",null,"PK - 05","NT",420,null,"ES",16,26]
["0067","Concord Middle","00670305",null,"06 - 08","NT",729,null,"MS",53,85]
["0068","Conway Grammar","00680005",null,"PK - 06","TA",118,null,"ES",28,45]
["0071","Highlands","00710010",null,"K  - 05","TA",378,null,"ES",63,101]
["0071","Great Oak","00710015",null,"K  - 05","TA",369,null,"ES",57,91]
["0071","Riverside","00710030",null,"PK - 05","TA",259,null,"ES",50,80]
["0071","Ivan G Smith","00710032",null,"K  - 05","NT",288,null,"ES",44,70]
["0071","Willis E Thorpe","00710045",null,"K  - 05","TA",321,null,"ES",55,88]
["0071","Holten Richmond Middle School","00710305",null,"06 - 08","NT",831,null,"MS",130,208]
["0071","Danvers High","00710505",null,"09 - 12","NT",919,null,"HS",142,227]
["0072","Andrew B. Cushman School","00720005",null,"PK - K","NT",64,null,"EES",18,29]
["0072","Joseph Demello","00720015",null,"01 - 05","NT",423,null,"ES",103,165]
["0072","George H Potter","00720030",null,"PK - 05","SW",395,null,"ES",114,182]
["0072","James M. Quinn School","00720040",null,"K  - 05","SW",652,null,"ES",164,262]
["0072","Dartmouth Middle","00720050",null,"06 - 08","NT",942,null,"MS",218,349]
["0072","Dartmouth High","00720505",null,"09 - 12","NT",1067,null,"HS",160,256]
["0073","Early Childhood Center","00730005",null,"PK - K","TA",198,null,"EES",39,62]
["0073","Avery","00730010",null,"01 - 05","TA",296,null,"ES",128,205]
["0073","Greenlodge","00730025",null,"01 - 05","NT",249,null,"ES",27,43]
["0073","Oakdale","00730030",null,"01 - 05","NT",265,null,"ES",34,54]
["0073","Riverdale","00730045",null,"01 - 05","TA",167,null,"ES",51,82]
["0073","Dedham Middle School","00730305",null,"06 - 08","NT",649,null,"MS",145,232]
["0073","Dedham High","00730505",null,"09 - 12","NT",731,null,"HS",149,{"$f":"ROUND(J388*1.6, 0)","v":238}]
["0074","Deerfield Elementary","00740015",null,"PK - 06","TA",355,null,"ES",66,106]
["0077","Douglas Primary School","00770005",null,"PK - 01","TA",167,null,"EES",25,40]
["0077","Douglas Elementary School","00770015",null,"02 - 05","TA",354,null,"ES",50,80]
["0077","Douglas Middle School","00770305",null,"06 - 08","NT",321,null,"MS",50,80]
["0077","Douglas High School","00770505",null,"09 - 12","NT",396,null,"HS",61,98]
["0078","Chickering","00780005",null,"PK - 05","TA",478,null,"ES",9,14]
["0079","Joseph A Campbell Elementary","00790020",null,"PK - 05","NT",510,null,"ES",68,109]
["0079","Greenmont Avenue","00790030",null,"K  - 05","SW",278,null,"ES",90,144]
["0079","Brookside Elementary","00790035",null,"K  - 05","SW",446,null,"ES",111,178]
["0079","George H. Englesby Elementary School","00790045",null,"K  - 05","SW",545,null,"ES",156,250]
["0079","Justus C. Richardson Middle School","00790410",null,"06 - 08","SW",908,null,"MS",222,355]
["0079","Dracut Senior High","00790505",null,"09 - 12","NT",876,null,"HS",145,232]
["0082","Alden School","00820004",null,"03 - 05","TA",635,null,"ES",30,48]
["0082","Chandler Elementary","00820006",null,"PK - 02","TA",570,null,"EES",35,56]
["0082","Duxbury Middle","00820305",null,"06 - 08","NT",754,null,"MS",33,53]
["0082","Duxbury High","00820505",null,"09 - 12","NT",997,null,"HS",52,83]
["0083","Central","00830005",null,"PK - 02","TA",454,null,"EES",88,141]
["0083","Gordon W. Mitchell School","00830010",null,"03 - 06","NT",655,null,"ES",118,189]
["0083","East Bridgewater JR./SR. High School","00830505",null,"07 - 12","NT",1013,null,"MSHS/K-12",154,246]
["0085","Eastham Elementary","00850005",null,"PK - 05","TA",157,null,"ES",45,72]
["0086","Center School","00860005",null,"K  - 04","TA",205,null,"ES",57,91]
["0086","Maple","00860010",null,"PK - 04","TA",202,null,"ES",69,110]
["0086","Neil A Pepin","00860020",null,"K  - 04","TA",204,null,"ES",70,112]
["0086","White Brook Middle School","00860305",null,"05 - 08","TA",424,null,"MS",139,222]
["0086","Easthampton High","00860505",null,"09 - 12","NT",471,null,"HS",118,189]
["0087","Mapleshade","00870010",null,"03 - 05","SW",300,null,"ES",74,118]
["0087","Meadow Brook","00870013",null,"PK - 02","SW",525,null,"EES",92,147]
["0087","Mountain View","00870015",null,"03 - 05","NT",274,null,"ES",33,53]
["0087","Birchland Park","00870305",null,"06 - 08","SW",641,null,"MS",136,218]
["0087","East Longmeadow High","00870505",null,"09 - 12","NT",829,null,"HS",121,194]
["0088","Center School","00880003",null,"PK - 02","NT",234,null,"EES",36,58]
["0088","Parkview Elementary","00880015",null,"PK - 02","NT",272,null,"EES",20,32]
["0088","Moreau Hall","00880020",null,"PK - 02","NT",212,null,"EES",32,51]
["0088","Richardson Olmsted School","00880025",null,"03 - 05","TA",814,null,"ES",117,187]
["0088","Easton Middle School","00880405",null,"06 - 08","TA",896,null,"MS",114,182]
["0088","Oliver Ames High","00880505",null,"09 - 12","NT",1125,null,"HS",113,181]
["0089","Edgartown Elementary","00890005",null,"PK - 08","TA",361,null,"ESMS",121,194]
["0091","Erving Elementary","00910030",null,"PK - 06","TA",105,null,"ES",29,46]
["0093","Adams School","00930003",null,"PK","NT",0,null,"EES",0,0]
["0093","Sumner G. Whittier School","00930010",null,"K  - 08","SW",632,null,"ESMS",348,557]
["0093","Webster School","00930015",null,"PK - 05","NT",349,null,"ES",179,286]
["0093","Madeline English School","00930018",null,"K  - 08","SW",776,null,"ESMS",360,576]
["0093","George Keverian School","00930028",null,"K  - 08","SW",865,null,"ESMS",439,702]
["0093","Devens School","00930030",null,"K  - 12","NT",71,null,"MSHS/K-12",54,86]
["0093","Lafayette School","00930038",null,"K  - 08","SW",954,null,"ESMS",463,741]
["0093","Parlin School","00930058",null,"K  - 08","SW",980,null,"ESMS",590,944]
["0093","Everett High","00930505",null,"09 - 12","NT",1942,null,"HS",900,1440]
["0094","East Fairhaven","00940010",null,"PK - 05","TA",398,null,"ES",132,211]
["0094","Leroy Wood","00940030",null,"PK - 05","TA",462,null,"ES",143,229]
["0094","Hastings Middle","00940305",null,"06 - 08","TA",475,null,"MS",124,198]
["0094","Fairhaven High","00940505",null,"09 - 12","NT",651,null,"HS",138,221]
["0095","North End Elementary","00950005",null,"PK - 05","NT",689,null,"ES",407,651]
["0095","Carlton M. Viveiros Elementary School","00950009",null,"K  - 05","SW",745,null,"ES",542,867]
["0095","Mary Fonseca Elementary School","00950011",null,"PK - 05","SW",652,null,"ES",520,832]
["0095","Letourneau Elementary School","00950013",null,"PK - 05","SW",560,null,"ES",417,667]
["0095","Henry Lord Community School","00950017",null,"PK - 08","SW",684,null,"ESMS",572,915]
["0095","John J Doran","00950045",null,"PK - 08","SW",483,null,"ESMS",372,595]
["0095","William S Greene","00950065",null,"PK - 05","SW",705,null,"ES",496,794]
["0095","Spencer Borden","00950130",null,"K  - 05","NT",567,null,"ES",345,552]
["0095","James Tansey","00950140",null,"K  - 05","NT",312,null,"ES",125,200]
["0095","Samuel Watson","00950145",null,"K  - 05","SW",279,null,"ES",219,350]
["0095","Talbot Innovation School","00950305",null,"06 - 08","SW",522,null,"MS",404,646]
["0095","Morton Middle","00950315",null,"06 - 08","SW",616,null,"MS",364,582]
["0095","Matthew J Kuss Middle","00950320",null,"06 - 08","SW",736,null,"MS",462,{"$f":"ROUND(J452*1.6, 0)","v":739}]
["0095","Stone PK-12 School","00950340",null,"K  - 12","SW",64,null,"MSHS/K-12",59,94]
["0095","B M C Durfee High","00950505",null,"09 - 12","NT",2006,null,"HS",1224,1958]
["0095","Resiliency Preparatory Academy","00950525",null,"07 - 12","SW",241,null,"MSHS/K-12",200,320]
["0096","East Falmouth Elementary","00960005",null,"K  - 04","SW",242,null,"ES",101,162]
["0096","Teaticket","00960015",null,"PK - 04","SW",246,null,"ES",108,173]
["0096","Mullen-Hall","00960020",null,"K  - 04","TA",436,null,"ES",127,203]
["0096","North Falmouth Elementary","00960030",null,"K  - 04","NT",343,null,"ES",58,93]
["0096","Morse Pond School","00960305",null,"05 - 06","NT",554,null,"ES",162,259]
["0096","Lawrence","00960405",null,"07 - 08","NT",567,null,"MS",144,230]
["0096","Falmouth High","00960505",null,"09 - 12","NT",820,null,"HS",180,288]
["0097","Crocker Elementary","00970016",null,"PK - 04","SW",573,null,"ES",361,578]
["0097","Reingold Elementary","00970043",null,"PK - 04","SW",616,null,"ES",361,578]
["0097","Memorial Middle School","00970048",null,"05 - 08","SW",737,null,"MS",393,629]
["0097","South Street Elementary","00970060",null,"PK - 04","SW",608,null,"ES",406,650]
["0097","Arthur M Longsjo Middle School","00970315",null,"05 - 08","SW",655,null,"MS",431,690]
["0097","McKay Arts Academy","00970340",null,"PK - 08","SW",643,null,"ESMS",388,621]
["0097","Fitchburg High","00970505",null,"PK,09 - 12","SW",1097,null,"HS",570,912]
["0097","Goodrich Academy","00970510",null,"09 - 12","NT",209,null,"HS",121,194]
["0098","Abbott Memorial","00980005",null,"PK - 08","TA",73,null,"ESMS",24,38]
["0099","Mabelle M Burrell","00990015",null,"PK - 04","NT",223,null,"ES",29,46]
["0099","Vincent M Igo Elementary","00990020",null,"K  - 04","TA",369,null,"ES",68,109]
["0099","Charles Taylor Elementary","00990050",null,"K  - 04","NT",226,null,"ES",26,42]
["0099","John J Ahern","00990405",null,"05 - 08","NT",841,null,"MS",118,189]
["0099","Foxborough High","00990505",null,"09 - 12","NT",806,null,"HS",111,178]
["0100","Juniper Hill School","01000001",null,"PK","NT",0,null,"EES",0,0]
["0100","King Elementary School","01000005",null,"K  - 04","NT",322,null,"ES",76,122]
["0100","Brophy","01000006",null,"K  - 05","SW",464,null,"ES",244,390]
["0100","Charlotte A Dunning","01000007",null,"K  - 05","NT",459,null,"ES",96,154]
["0100","Hemenway","01000015",null,"K  - 05","NT",557,null,"ES",120,192]
["0100","Barbieri Elementary","01000035",null,"K  - 05","SW",667,null,"ES",328,525]
["0100","Potter Road","01000039",null,"K  - 05","NT",525,null,"ES",162,259]
["0100","Mary E Stapleton Elementary","01000045",null,"K  - 05","SW",333,null,"ES",132,211]
["0100","Miriam F McCarthy School","01000050",null,"K  - 05","SW",524,null,"ES",256,410]
["0100","Woodrow Wilson","01000055",null,"K  - 05","SW",550,null,"ES",344,550]
["0100","Cameron Middle School","01000302",null,"06 - 08","NT",580,null,"MS",265,424]
["0100","Fuller Middle","01000305",null,"06 - 08","SW",563,null,"MS",287,459]
["0100","Walsh Middle","01000310",null,"06 - 08","NT",730,null,"MS",202,323]
["0100","Framingham High School","01000515",null,"09 - 12","NT",2235,null,"HS",651,1042]
["0101","Franklin Early Childhood Development Center","01010003",null,"PK","NT",0,null,"EES",0,0]
["0101","Jefferson Elementary","01010010",null,"K  - 05","NT",357,null,"ES",30,48]
["0101","Helen Keller Elementary","01010012",null,"K  - 05","NT",386,null,"ES",30,48]
["0101","J F Kennedy Memorial","01010013",null,"K  - 05","NT",368,null,"ES",26,42]
["0101","Oak Street Elementary","01010030",null,"K  - 05","NT",386,null,"ES",42,67]
["0101","Parmenter","01010032",null,"K  - 05","TA",338,null,"ES",82,131]
["0101","Davis Thayer","01010035",null,"K  - 05","TA",242,null,"ES",46,74]
["0101","Annie Sullivan Middle School","01010040",null,"06 - 08","NT",403,null,"MS",30,48]
["0101","Remington Middle","01010310",null,"06 - 08","NT",413,null,"MS",45,72]
["0101","Horace Mann","01010405",null,"06 - 08","NT",469,null,"MS",35,56]
["0101","Franklin High","01010505",null,"09 - 12","NT",1746,null,"HS",125,200]
["0103","Elm Street School","01030001",null,"02 - 04","SW",561,null,"ES",295,472]
["0103","Waterford Street","01030020",null,"PK - 01","SW",364,null,"EES",218,349]
["0103","Gardner Middle School","01030405",null,"05 - 07","SW",576,null,"MS",299,478]
["0103","Gardner High","01030505",null,"08 - 12","NT",650,null,"MSHS/K-12",278,445]
["0103","Gardner Academy for Learning and Technology","01030515",null,"09 - 12","NT",57,null,"HS",42,67]
["0105","Perley Elementary","01050005",null,"PK","NT",0,null,"EES",0,0]
["0105","Penn Brook","01050010",null,"K  - 06","TA",706,null,"ES",58,93]
["0105","Georgetown Middle School","01050305",null,"07 - 08","NT",205,null,"MS",15,24]
["0105","Georgetown High School","01050505",null,"09 - 12","NT",395,null,"HS",27,43]
["0107","Beeman Memorial","01070010",null,"K  - 05","SW",335,null,"ES",171,274]
["0107","East Gloucester Elementary","01070020",null,"K  - 05","SW",209,null,"ES",70,112]
["0107","Gloucester PreSchool","01070025",null,"PK","NT",0,null,"EES",0,0]
["0107","Plum Cove School","01070042",null,"K  - 05","SW",208,null,"ES",55,88]
["0107","Veterans Memorial","01070045",null,"K  - 05","SW",220,null,"ES",131,210]
["0107","West Parish","01070050",null,"K  - 05","SW",349,null,"ES",104,{"$f":"ROUND(J516*1.6, 0)","v":166}]
["0107","Ralph B O'Maley Middle","01070305",null,"06 - 08","NT",640,null,"MS",225,360]
["0107","Gloucester High","01070505",null,"09 - 12","NT",797,null,"HS",282,451]
["0109","Cuttyhunk Elementary","01090005",null,"08","NT",1,null,"MS",0,0]
["0110","South Grafton Elementary","01100005",null,"PK - 01","NT",236,null,"EES",29,46]
["0110","North Grafton Elementary","01100025",null,"PK - 01","NT",202,null,"EES",27,43]
["0110","North Street Elementary School","01100030",null,"02 - 06","TA",575,null,"ES",82,131]
["0110","Millbury Street Elementary School","01100200",null,"02 - 06","TA",692,null,"ES",86,138]
["0110","Grafton Middle","01100305",null,"07 - 08","NT",517,null,"MS",58,93]
["0110","Grafton High School","01100505",null,"09 - 12","NT",854,null,"HS",85,136]
["0111","East Meadow","01110004",null,"PK - 06","TA",357,null,"ES",108,173]
["0111","Granby Jr Sr High School","01110505",null,"07 - 12","NT",337,null,"MSHS/K-12",72,115]
["0114","The Academy of Early Learning at North Parish","01140005",null,"PK","SW",0,null,"EES",0,0]
["0114","Federal Street School","01140010",null,"K  - 04","SW",249,null,"ES",165,264]
["0114","Discovery School at Four Corners","01140025",null,"K  - 04","SW",245,null,"ES",56,90]
["0114","Newton School","01140035",null,"K  - 04","SW",243,null,"ES",176,282]
["0114","Greenfield Middle","01140305",null,"05 - 07","SW",389,null,"MS",186,298]
["0114","Greenfield High","01140505",null,"08 - 12","SW",481,null,"MSHS/K-12",210,336]
["0117","Hadley Elementary","01170015",null,"PK - 06","SW",252,null,"ES",50,80]
["0117","Hopkins Academy","01170505",null,"07 - 12","NT",252,null,"MSHS/K-12",40,64]
["0118","Halifax Elementary","01180005",null,"K  - 06","TA",609,null,"ES",101,162]
["0121","Hancock Elementary","01210005",null,"PK - 06","TA",33,null,"ES",9,14]
["0122","Cedar Elementary","01220004",null,"PK - 04","NT",383,null,"ES",31,50]
["0122","Center Elementary","01220005",null,"K  - 02","NT",337,null,"EES",16,26]
["0122","Sylvester","01220015",null,"03 - 04","NT",246,null,"ES",15,24]
["0122","Hanover Middle","01220305",null,"05 - 08","TA",800,null,"MS",80,128]
["0122","Hanover High","01220505",null,"09 - 12","NT",806,null,"HS",54,86]
["0125","Hildreth Elementary School","01250005",null,"PK - 05","TA",437,null,"ES",32,51]
["0125","Bromfield","01250505",null,"06 - 12","TA",622,null,"MSHS/K-12",27,43]
["0127","Hatfield Elementary","01270005",null,"PK - 06","TA",227,null,"ES",40,64]
["0127","Smith Academy","01270505",null,"07 - 12","NT",191,null,"MSHS/K-12",25,40]
["0128","Consentino Annex at Bartlett School","01280005",null,"K  - 02","SW",133,null,"EES",87,139]
["0128","Bradford Elementary","01280008",null,"K  - 04","NT",363,null,"ES",138,221]
["0128","Crowell","01280020",null,"K","SW",100,null,"EES",59,94]
["0128","Golden Hill","01280026",null,"01 - 04","SW",511,null,"ES",297,475]
["0128","Greenleaf Kindergarten Center","01280027",null,"K","SW",78,null,"EES",54,86]
["0128","Caleb Dustin Hunking School","01280030",null,"K  - 08","NT",1128,null,"ESMS",384,614]
["0128","Haverhill Alternative School","01280033",null,"06 - 12","NT",43,null,"MSHS/K-12",32,51]
["0128","Moody","01280045",null,"PK","SW",0,null,"EES",0,0]
["0128","Dr Paul Nettle","01280050",null,"05 - 08","SW",532,null,"MS",287,459]
["0128","Pentucket Lake Elementary","01280054",null,"K  - 04","SW",485,null,"ES",242,387]
["0128","Silver Hill Elementary School","01280067",null,"K  - 05","SW",583,null,"ES",209,334]
["0128","TEACH","01280073",null,"01 - 08, 10 - 12","SW",34,null,"MSHS/K-12",22,35]
["0128","Tilton","01280075",null,"K  - 04","SW",463,null,"ES",304,486]
["0128","Walnut Square","01280080",null,"K  - 02","NT",135,null,"EES",44,70]
["0128","John G Whittier","01280085",null,"05 - 08","SW",525,null,"MS",228,365]
["0128","Consentino Middle School","01280100",null,"04 - 08","SW",952,null,"ESMS",509,814]
["0128","Haverhill High","01280505",null,"09 - 12","SW",1794,null,"HS",677,1083]
["0131","East Elementary School","01310005",null,"PK - 05","NT",447,null,"ES",17,27]
["0131","Wm L Foster Elementary","01310010",null,"K  - 05","TA",491,null,"ES",16,26]
["0131","Plymouth River","01310019",null,"K  - 05","NT",451,null,"ES",16,26]
["0131","South Elementary","01310020",null,"K  - 05","NT",519,null,"ES",17,27]
["0131","Hingham Middle School","01310410",null,"06 - 08","TA",1016,null,"MS",58,93]
["0131","Hingham High","01310505",null,"09 - 12","NT",1252,null,"HS",61,98]
["0133","John F Kennedy","01330018",null,"PK - 05","SW",616,null,"ES",173,277]
["0133","Holbrook Middle High School","01330505",null,"06 - 12","NT",585,null,"MSHS/K-12",187,299]
["0135","Holland Elementary","01350005",null,"PK - 06","TA",204,null,"ES",66,106]
["0136","Miller School","01360007",null,"03 - 05","NT",678,null,"ES",62,99]
["0136","Placentino Elementary","01360010",null,"PK - 02","TA",610,null,"EES",46,74]
["0136","Robert H. Adams Middle School","01360305",null,"06 - 08","NT",683,null,"MS",52,83]
["0136","Holliston High","01360505",null,"09 - 12","NT",821,null,"HS",48,77]
["0137","Joseph Metcalf School","01370003",null,"PK - 04","SW",191,null,"ES",98,157]
["0137","Lt Elmer J McMahon Elementary","01370015",null,"PK - 08","SW",378,null,"ESMS",252,403]
["0137","Morgan Full Service Community School","01370025",null,"PK - 04","SW",236,null,"ES",215,344]
["0137","William R. Peck School","01370030",null,"04 - 08","SW",280,null,"ESMS",254,{"$f":"ROUND(J580*1.6, 0)","v":406}]
["0137","Kelly Elementary","01370040",null,"PK,K,01 - 04, 06 - 08","SW",423,null,"ESMS",375,600]
["0137","E N White Elementary","01370045",null,"PK - 05","SW",334,null,"ES",242,387]
["0137","Lt Clayre Sullivan Elementary","01370055",null,"K  - 08","SW",525,null,"ESMS",414,662]
["0137","Maurice A Donahue Elementary","01370060",null,"PK - 08","SW",449,null,"ESMS",367,587]
["0137","H.B. Lawrence School","01370070",null,"K  - 03","SW",234,null,"ES",209,334]
["0137","Veritas Prep Holyoke","01370075",null,"05","SW",136,null,"ES",126,202]
["0137","Holyoke STEM Academy","01370320",null,"06 - 08","SW",262,null,"MS",206,330]
["0137","Holyoke High","01370505",null,"09 - 12","SW",1460,null,"HS",1005,1608]
["0138","Park Street School","01380003",null,"PK","NT",0,null,"EES",0,0]
["0138","Memorial","01380010",null,"K  - 06","TA",522,null,"ES",65,104]
["0138","Hopedale Jr Sr High","01380505",null,"07 - 12","NT",470,null,"MSHS/K-12",47,75]
["0139","Hopkinton Pre-School","01390003",null,"PK","NT",0,null,"EES",0,0]
["0139","Marathon Elementary School","01390005",null,"K  - 01","TA",499,null,"EES",28,45]
["0139","Elmwood","01390010",null,"02 - 03","TA",553,null,"ES",21,34]
["0139","Hopkins Elementary School","01390015",null,"04 - 05","TA",554,null,"ES",30,48]
["0139","Hopkinton Middle School","01390305",null,"06 - 08","TA",854,null,"MS",48,77]
["0139","Hopkinton High","01390505",null,"09 - 12","NT",1178,null,"HS",50,80]
["0141","Mulready Elementary","01410007",null,"PK - 04","TA",233,null,"ES",65,104]
["0141","Forest Avenue Elementary","01410015",null,"K  - 04","TA",357,null,"ES",78,125]
["0141","C A Farley","01410030",null,"PK - 04","TA",408,null,"ES",105,168]
["0141","David J. Quinn Middle School","01410410",null,"05 - 07","NT",636,null,"MS",169,270]
["0141","Hudson High","01410505",null,"08 - 12","NT",881,null,"MSHS/K-12",177,283]
["0142","Lillian M Jacobs","01420015",null,"PK - 05","TA",359,null,"ES",107,171]
["0142","Memorial Middle","01420305",null,"06 - 08","NT",180,null,"MS",51,82]
["0142","Hull High","01420505",null,"09 - 12","NT",283,null,"HS",80,128]
["0144","Paul F Doyon Memorial","01440007",null,"PK - 05","NT",376,null,"ES",38,61]
["0144","Winthrop","01440015",null,"PK - 05","TA",349,null,"ES",74,118]
["0144","Ipswich Middle School","01440305",null,"06 - 08","NT",405,null,"MS",41,66]
["0144","Ipswich High","01440505",null,"09 - 12","NT",538,null,"HS",65,104]
["0145","Kingston Elementary","01450005",null,"K  - 02","TA",444,null,"EES",71,114]
["0145","Kingston Intermediate","01450020",null,"03 - 06","TA",602,null,"ES",96,154]
["0149","Rollins Early Childhood Center","01490001",null,"PK - K","SW",71,null,"EES",54,86]
["0149","Lawlor Early Childhood Center","01490002",null,"K","SW",191,null,"EES",146,234]
["0149","John Breen School","01490003",null,"PK - K","SW",129,null,"EES",86,138]
["0149","South Lawrence East Elementary School","01490004",null,"01 - 05","SW",768,null,"ES",582,931]
["0149","Community Day Arlington","01490009",null,"K  - 04","SW",615,null,"ES",472,755]
["0149","Lawrence Family Public Academy","01490011",null,"PK - K","SW",136,null,"EES",104,166]
["0149","Alexander B Bruce","01490015",null,"03 - 08","SW",551,null,"ESMS",380,608]
["0149","Arlington Middle School","01490017",null,"05 - 08","SW",609,null,"MS",442,707]
["0149","Robert Frost","01490018",null,"K  - 04","SW",602,null,"ES",357,571]
["0149","James F Hennessey","01490020",null,"PK - 02","SW",261,null,"EES",198,317]
["0149","Gerard A. Guilmette","01490022",null,"01 - 04","SW",512,null,"ES",391,626]
["0149","Guilmette Middle School","01490025",null,"05 - 08","SW",485,null,"MS",348,557]
["0149","Parthum Middle School","01490027",null,"05 - 08","SW",612,null,"MS",404,646]
["0149","Francis M Leahy","01490040",null,"01 - 05","SW",461,null,"ES",342,547]
["0149","Oliver Partnership School","01490048",null,"01 - 05","SW",491,null,"ES",377,603]
["0149","UP Academy Oliver Middle School","01490049",null,"06 - 08","SW",347,null,"MS",256,410]
["0149","Edward F. Parthum","01490053",null,"PK - 04","SW",654,null,"ES",438,701]
["0149","John K Tarbox","01490075",null,"01 - 05","SW",287,null,"ES",224,358]
["0149","Emily G Wetherbee","01490080",null,"K  - 08","SW",644,null,"ESMS",417,667]
["0149","Spark Academy","01490085",null,"06 - 08","SW",461,null,"MS",329,526]
["0149","UP Academy Leonard Middle School","01490090",null,"06 - 08","SW",301,null,"MS",201,322]
["0149","Lawrence High School","01490515",null,"09 - 12","SW",3169,null,"HS",2045,3272]
["0149","Frost Middle School","01490525",null,"05 - 08","SW",532,null,"MS",292,467]
["0149","High School Learning Center","01490536",null,"09 - 12","SW",197,null,"HS",127,203]
["0149","School for Exceptional Studies","01490537",null,"01 - 12","SW",129,null,"MSHS/K-12",114,182]
["0150","Lee Elementary","01500025",null,"PK - 06","TA",332,null,"ES",128,205]
["0150","Lee Middle/High School","01500505",null,"07 - 12","NT",360,null,"MSHS/K-12",113,181]
["0151","Leicester Memorial Elementary","01510005",null,"03 - 05","SW",324,null,"ES",92,147]
["0151","Leicester Primary School","01510010",null,"PK - 02","SW",285,null,"EES",74,118]
["0151","Leicester Middle","01510015",null,"06 - 08","NT",366,null,"MS",91,146]
["0151","Leicester High","01510505",null,"09 - 12","NT",470,null,"HS",103,165]
["0152","Morris","01520015",null,"PK - 05","TA",297,null,"ES",47,75]
["0152","Lenox Memorial High","01520505",null,"06 - 12","NT",430,null,"MSHS/K-12",76,{"$f":"ROUND(J644*1.6, 0)","v":122}]
["0153","Bennett","01530003",null,"PK","NT",0,null,"EES",0,0]
["0153","Lincoln School","01530005",null,"PK","NT",0,null,"EES",0,0]
["0153","Fall Brook","01530007",null,"K  - 05","SW",637,null,"ES",237,379]
["0153","Frances Drake School","01530010",null,"K  - 05","SW",570,null,"ES",286,458]
["0153","Johnny Appleseed","01530025",null,"K  - 05","SW",665,null,"ES",252,403]
["0153","Northwest","01530030",null,"K  - 05","SW",679,null,"ES",303,485]
["0153","Priest Street","01530040",null,"K","SW",141,null,"EES",67,107]
["0153","Samoset School","01530045",null,"06 - 08","SW",499,null,"MS",175,280]
["0153","Sky View Middle School","01530320",null,"06 - 08","SW",908,null,"MS",350,560]
["0153","Leominster High School","01530505",null,"09 - 12","SW",1062,null,"HS",346,554]
["0153","Leominster Center for Excellence","01530515",null,"09 - 12","SW",58,null,"HS",31,50]
["0153","Center For Technical Education Innovation","01530605",null,"09 - 12","SW",692,null,"HS",263,421]
["0154","Leverett Elementary","01540005",null,"PK - 06","TA",118,null,"ES",22,35]
["0155","Lexington Children's Place","01550001",null,"PK","NT",0,null,"EES",0,0]
["0155","Bridge","01550006",null,"K  - 05","NT",550,null,"ES",37,59]
["0155","Bowman","01550008",null,"K  - 05","TA",550,null,"ES",28,45]
["0155","Joseph Estabrook","01550010",null,"K  - 05","TA",585,null,"ES",35,56]
["0155","Fiske","01550015",null,"K  - 05","NT",483,null,"ES",24,38]
["0155","Harrington","01550030",null,"K  - 05","NT",501,null,"ES",36,58]
["0155","Maria Hastings","01550035",null,"K  - 05","NT",460,null,"ES",27,43]
["0155","Jonas Clarke Middle","01550305",null,"06 - 08","NT",911,null,"MS",43,69]
["0155","Wm Diamond Middle","01550310",null,"06 - 08","NT",923,null,"MS",37,59]
["0155","Lexington High","01550505",null,"09 - 12","NT",2247,null,"HS",109,174]
["0157","Hanscom Primary","01570006",null,"PK - 03","TA",272,null,"ES",3,5]
["0157","Lincoln School","01570025",null,"PK - 08","NT",543,null,"ESMS",62,99]
["0157","Hanscom Middle","01570305",null,"04 - 08","NT",294,null,"ESMS",3,5]
["0158","Shaker Lane Elementary","01580005",null,"PK - 02","TA",374,null,"EES",21,34]
["0158","Russell St Elementary","01580015",null,"03 - 05","TA",398,null,"ES",29,46]
["0158","Littleton Middle School","01580305",null,"06 - 08","NT",366,null,"MS",30,48]
["0158","Littleton High School","01580505",null,"09 - 12","NT",437,null,"HS",24,38]
["0159","Blueberry Hill","01590005",null,"K  - 05","NT",443,null,"ES",23,37]
["0159","Center","01590010",null,"K  - 05","TA",415,null,"ES",18,29]
["0159","Glenbrook Middle","01590017",null,"06 - 08","TA",337,null,"MS",31,50]
["0159","Wolf Swamp Road","01590025",null,"PK - 05","TA",343,null,"ES",34,54]
["0159","Williams Middle","01590305",null,"06 - 08","NT",315,null,"MS",14,22]
["0159","Longmeadow High","01590505",null,"09 - 12","NT",964,null,"HS",58,93]
["0160","Cardinal O'Connell Early Learning Center","01600001",null,"PK","NT",0,null,"EES",0,0]
["0160","Dr Gertrude Bailey","01600002",null,"PK - 04","SW",474,null,"ES",215,344]
["0160","Rogers STEM Academy","01600005",null,"K  - 07","SW",740,null,"ESMS",472,755]
["0160","Joseph McAvinnue","01600010",null,"PK - 04","SW",461,null,"ES",312,499]
["0160","Greenhalge","01600015",null,"PK - 04","SW",455,null,"ES",332,531]
["0160","Pyne Arts","01600018",null,"PK - 08","SW",467,null,"ESMS",217,347]
["0160","Abraham Lincoln","01600020",null,"PK - 04","SW",461,null,"ES",295,472]
["0160","Moody Elementary","01600027",null,"K  - 05","SW",287,null,"ES",202,323]
["0160","Charles W Morey","01600030",null,"PK - 04","SW",461,null,"ES",194,310]
["0160","Pawtucketville Memorial","01600036",null,"PK - 04","SW",470,null,"ES",206,330]
["0160","Peter W Reilly","01600040",null,"K  - 05","SW",581,null,"ES",292,467]
["0160","John J Shaughnessy","01600050",null,"PK - 04","SW",461,null,"ES",287,459]
["0160","Washington","01600055",null,"PK - 04","SW",229,null,"ES",122,195]
["0160","S Christa McAuliffe Elementary","01600075",null,"PK - 04","SW",460,null,"ES",313,501]
["0160","Charlotte M Murkland Elementary","01600080",null,"PK - 04","SW",458,null,"ES",329,526]
["0160","Laura Lee Therapeutic Day School","01600085",null,"02 - 03, 05 - 08","SW",25,null,"ESMS",23,37]
["0160","Bartlett Community Partnership","01600090",null,"PK - 08","SW",455,null,"ESMS",273,437]
["0160","B.F. Butler Middle School","01600310",null,"05 - 08","SW",556,null,"MS",287,459]
["0160","James S Daley Middle School","01600315",null,"05 - 08","SW",692,null,"MS",286,458]
["0160","Leblanc Therapeutic Day School","01600320",null,"09 - 12","SW",40,null,"HS",36,58]
["0160","Henry J Robinson Middle","01600330",null,"05 - 08","SW",668,null,"MS",450,720]
["0160","James Sullivan Middle School","01600340",null,"06 - 08","SW",491,null,"MS",284,454]
["0160","Dr An Wang School","01600345",null,"05 - 08","SW",680,null,"MS",354,566]
["0160","Kathryn P. Stoklosa Middle School","01600360",null,"05 - 08","SW",672,null,"MS",431,690]
["0160","Lowell High","01600505",null,"09 - 12","SW",3078,null,"HS",1444,2310]
["0160","The Career Academy","01600515",null,"09 - 12","SW",129,null,"HS",86,138]
["0160","Dr. Janice Adie Day School","01600605",null,"PK,K,01 - 07, 09, 11","SW",47,null,"MSHS/K-12",28,45]
["0161","East Street Elementary School","01610010",null,"PK - 01","TA",301,null,"EES",95,{"$f":"ROUND(J708*1.6, 0)","v":152}]
["0161","Chapin Street Elementary School","01610020",null,"02 - 03","TA",326,null,"ES",98,157]
["0161","Veterans Park Elementary","01610023",null,"04 - 05","SW",371,null,"ES",122,195]
["0161","Paul R Baird Middle","01610305",null,"06 - 08","NT",612,null,"MS",149,238]
["0161","Ludlow Senior High","01610505",null,"09 - 12","NT",868,null,"HS",182,291]
["0162","Lunenburg Primary School","01620010",null,"PK - 02","TA",380,null,"EES",65,104]
["0162","Turkey Hill Elementary School","01620025",null,"03 - 05","TA",373,null,"ES",58,93]
["0162","Lunenburg Middle School","01620305",null,"06 - 08","NT",397,null,"MS",66,106]
["0162","Lunenburg High","01620505",null,"09 - 12","NT",457,null,"HS",57,91]
["0162","Advanced Community Experience Program","01620605",null,"SP","NT",0,null,"SP",0,0]
["0163","Early Childhood Center","01630004",null,"PK - 03, 05","SW",194,null,"EES",133,213]
["0163","Washington Elementary School","01630005",null,"K  - 05","SW",457,null,"ES",321,514]
["0163","Aborn","01630011",null,"K  - 05","SW",251,null,"ES",94,150]
["0163","A Drewicz Elementary","01630016",null,"K  - 05","SW",507,null,"ES",314,502]
["0163","Brickett Elementary","01630020",null,"K  - 05","SW",352,null,"ES",223,357]
["0163","Julia F Callahan","01630030",null,"PK - 05","SW",391,null,"ES",231,370]
["0163","Cobbet Elementary","01630035",null,"K  - 05","SW",590,null,"ES",411,658]
["0163","Wm P Connery","01630040",null,"PK - 05","SW",594,null,"ES",400,640]
["0163","E J Harrington","01630045",null,"PK - 05","SW",588,null,"ES",411,658]
["0163","Robert L Ford","01630050",null,"01 - 05","SW",493,null,"ES",313,501]
["0163","Hood","01630055",null,"K  - 05","SW",469,null,"ES",284,454]
["0163","Ingalls","01630060",null,"K  - 05","SW",652,null,"ES",434,694]
["0163","Lincoln-Thomson","01630070",null,"K  - 05","SW",237,null,"ES",129,206]
["0163","Lynn Woods","01630075",null,"K  - 05","SW",176,null,"ES",48,77]
["0163","William R Fallon","01630080",null,"K  - 05","SW",49,null,"ES",44,70]
["0163","Sewell-Anderson","01630085",null,"K  - 05","SW",272,null,"ES",111,178]
["0163","Capt William G Shoemaker","01630090",null,"PK - 05","SW",318,null,"ES",119,190]
["0163","Edward A Sisson","01630095",null,"K  - 05","SW",444,null,"ES",184,294]
["0163","Tracy","01630100",null,"01 - 05","SW",437,null,"ES",277,443]
["0163","Thurgood Marshall Mid","01630305",null,"06 - 08","SW",1336,null,"MS",825,1320]
["0163","Breed Middle School","01630405",null,"06 - 08","SW",1432,null,"MS",851,1362]
["0163","Pickering Middle","01630420",null,"06 - 08","SW",659,null,"MS",280,448]
["0163","Classical High","01630505",null,"09 - 12","SW",1761,null,"HS",855,1368]
["0163","Lynn English High","01630510",null,"09 - 12","SW",1854,null,"HS",996,1594]
["0163","Fecteau-Leary Junior/Senior High School","01630525",null,"06 - 12","SW",96,null,"MSHS/K-12",69,110]
["0163","Lynn Vocational Technical Institute","01630605",null,"PK,06, 08 - 12","SW",969,null,"HS",526,842]
["0164","Lynnfield Preschool","01640005",null,"PK","NT",0,null,"EES",0,0]
["0164","Huckleberry Hill","01640010",null,"K  - 04","TA",435,null,"ES",38,61]
["0164","Summer Street","01640020",null,"K  - 04","NT",434,null,"ES",21,34]
["0164","Lynnfield Middle School","01640405",null,"05 - 08","NT",662,null,"MS",40,64]
["0164","Lynnfield High","01640505",null,"09 - 12","NT",628,null,"HS",54,86]
["0165","Beebe","01650003",null,"K  - 08","SW",904,null,"ESMS",404,646]
["0165","Ferryway","01650013",null,"K  - 08","SW",899,null,"ESMS",433,693]
["0165","Forestdale","01650027",null,"K  - 08","SW",555,null,"ESMS",226,362]
["0165","Linden","01650047",null,"K  - 08","SW",838,null,"ESMS",299,478]
["0165","Malden Early Learning Center","01650049",null,"PK","NT",0,null,"EES",0,0]
["0165","Salemwood","01650057",null,"K  - 08","SW",1181,null,"ESMS",706,1130]
["0165","Malden High","01650505",null,"09 - 12","NT",1834,null,"HS",812,1299]
["0167","Roland Green School","01670003",null,"PK","NT",0,null,"EES",0,0]
["0167","Everett W Robinson","01670007",null,"K  - 02","TA",703,null,"EES",115,184]
["0167","Jordan/Jackson Elementary","01670014",null,"03 - 05","NT",802,null,"ES",125,200]
["0167","Harold L Qualters Middle","01670035",null,"06 - 08","NT",896,null,"MS",126,202]
["0167","Mansfield High","01670505",null,"09 - 12","NT",1246,null,"HS",122,195]
["0168","Malcolm L Bell","01680005",null,"K  - 03","NT",306,null,"ES",30,48]
["0168","L H Coffin","01680010",null,"01 - 03","NT",208,null,"ES",21,34]
["0168","Village School","01680016",null,"04 - 06","TA",642,null,"ES",56,90]
["0168","Glover","01680020",null,"PK - 03","NT",324,null,"ES",20,32]
["0168","Marblehead Veterans Middle School","01680300",null,"07 - 08","NT",464,null,"MS",44,70]
["0168","Marblehead High","01680505",null,"09 - 12","NT",1038,null,"HS",87,139]
["0169","Sippican","01690005",null,"PK - 06","TA",429,null,"ES",81,130]
["0170","Early Childhood Center","01700006",null,"PK","NT",0,null,"EES",0,0]
["0170","Francis J Kane","01700008",null,"K  - 04","SW",596,null,"ES",219,350]
["0170","Richer","01700025",null,"K  - 04","SW",649,null,"ES",272,435]
["0170","Charles Jaworek School","01700030",null,"K  - 04","SW",773,null,"ES",289,462]
["0170","1 LT Charles W. Whitcomb School","01700045",null,"05 - 08","SW",1421,null,"MS",575,{"$f":"ROUND(J772*1.6, 0)","v":920}]
["0170","Marlborough High","01700505",null,"09 - 12","NT",1071,null,"HS",351,562]
["0171","Eames Way School","01710005",null,"K  - 05","NT",246,null,"ES",15,24]
["0171","South River","01710010",null,"K  - 05","NT",321,null,"ES",32,51]
["0171","Daniel Webster","01710015",null,"PK - 05","TA",296,null,"ES",60,96]
["0171","Gov Edward Winslow","01710020",null,"PK - 05","TA",387,null,"ES",37,59]
["0171","Martinson Elementary","01710025",null,"PK - 05","TA",396,null,"ES",62,99]
["0171","Furnace Brook Middle","01710310",null,"06 - 08","TA",962,null,"MS",119,190]
["0171","Marshfield High","01710505",null,"09 - 12","NT",1319,null,"HS",142,227]
["0172","Kenneth Coombs School","01720005",null,"PK - 02","TA",308,null,"EES",113,181]
["0172","Mashpee Middle School","01720020",null,"07 - 08","NT",251,null,"MS",74,118]
["0172","Quashnet School","01720035",null,"03 - 06","TA",501,null,"ES",170,272]
["0172","Mashpee High","01720505",null,"09 - 12","NT",442,null,"HS",106,170]
["0173","Center","01730005",null,"PK - 03","NT",227,null,"ES",41,66]
["0173","Old Hammondtown","01730010",null,"04 - 06","TA",191,null,"ES",26,42]
["0174","Green Meadow","01740010",null,"PK - 03","TA",434,null,"ES",87,139]
["0174","Fowler School","01740305",null,"04 - 08","TA",485,null,"ESMS",88,141]
["0174","Maynard High","01740505",null,"09 - 12","NT",368,null,"HS",53,85]
["0175","Memorial School","01750003",null,"PK - 01","NT",370,null,"EES",21,34]
["0175","Dale Street","01750005",null,"04 - 05","NT",378,null,"ES",8,13]
["0175","Ralph Wheelock School","01750007",null,"02 - 03","NT",401,null,"ES",22,35]
["0175","Thomas Blake Middle","01750305",null,"06 - 08","NT",598,null,"MS",22,35]
["0175","Medfield Senior High","01750505",null,"09 - 12","NT",797,null,"HS",37,59]
["0176","John J McGlynn Elementary School","01760068",null,"PK - 05","TA",462,null,"ES",183,293]
["0176","Brooks School","01760130",null,"PK - 05","NT",487,null,"ES",72,115]
["0176","Christopher Columbus","01760140",null,"PK - 05","TA",385,null,"ES",142,227]
["0176","Milton Fuller Roberts","01760150",null,"PK - 05","TA",544,null,"ES",152,243]
["0176","Madeleine Dugger Andrews","01760315",null,"06 - 08","NT",474,null,"MS",103,165]
["0176","John J. McGlynn Middle School","01760320",null,"06 - 08","NT",455,null,"MS",190,304]
["0176","Medford High","01760505",null,"PK,09 - 12","NT",1263,null,"HS",370,592]
["0176","Curtis-Tufts","01760510",null,"09 - 12","NT",20,null,"HS",13,21]
["0177","John D Mc Govern Elementary","01770013",null,"PK - 01","TA",300,null,"EES",29,46]
["0177","Burke/Memorial Elementary School","01770015",null,"02 - 04","TA",492,null,"ES",65,104]
["0177","Medway Middle","01770305",null,"05 - 08","NT",689,null,"MS",61,98]
["0177","Medway High","01770505",null,"09 - 12","NT",700,null,"HS",51,82]
["0178","Early Childhood Center","01780003",null,"PK - K","NT",31,null,"EES",3,5]
["0178","Herbert Clark Hoover","01780017",null,"K  - 05","NT",289,null,"ES",29,46]
["0178","Lincoln","01780020",null,"K  - 05","TA",415,null,"ES",82,131]
["0178","Horace Mann","01780025",null,"K  - 05","NT",276,null,"ES",7,11]
["0178","Roosevelt","01780035",null,"K  - 05","TA",423,null,"ES",45,72]
["0178","Winthrop","01780050",null,"K  - 05","NT",409,null,"ES",21,34]
["0178","Melrose Middle","01780305",null,"06 - 08","NT",784,null,"MS",79,126]
["0178","Melrose High","01780505",null,"09 - 12","NT",1013,null,"HS",112,179]
["0181","Marsh Grammar School","01810030",null,"PK - 08","NT",1171,null,"ESMS",332,531]
["0181","Comprehensive Grammar School","01810050",null,"PK - 08","NT",1044,null,"ESMS",312,499]
["0181","Tenney Grammar School","01810055",null,"PK - 08","TA",1340,null,"ESMS",563,901]
["0181","Donald P Timony Grammar","01810060",null,"PK - 08","TA",1299,null,"ESMS",539,862]
["0181","Methuen High","01810505",null,"09 - 12","TA",1988,null,"HS",610,976]
["0182","Henry B. Burkland Elementary School","01820008",null,"01 - 05","SW",542,null,"ES",189,302]
["0182","Mary K. Goode Elementary School","01820010",null,"01 - 05","SW",611,null,"ES",179,286]
["0182","Memorial Early Childhood Center","01820011",null,"PK - K","SW",200,null,"EES",58,93]
["0182","John T. Nichols Middle","01820305",null,"06 - 08","NT",783,null,"MS",234,374]
["0182","Middleborough High","01820505",null,"09 - 12","NT",767,null,"HS",162,259]
["0184","Fuller Meadow","01840003",null,"K  - 02","TA",270,null,"EES",17,27]
["0184","Howe-Manning","01840005",null,"PK,03 - 06","NT",352,null,"ES",30,48]
["0185","Memorial","01850010",null,"K  - 02","SW",464,null,"EES",208,333]
["0185","Brookside","01850065",null,"K  - 02","SW",475,null,"EES",192,307]
["0185","Shining Star Early Childhood Center","01850075",null,"PK","NT",0,null,"EES",0,0]
["0185","Woodland","01850090",null,"03 - 05","SW",1008,null,"ES",402,643]
["0185","Stacy Middle","01850305",null,"06 - 08","NT",1047,null,"MS",365,584]
["0185","Milford High","01850505",null,"09 - 12","NT",1169,null,"HS",351,562]
["0186","Elmwood Street","01860017",null,"PK - 03","SW",476,null,"ES",142,227]
["0186","Raymond E. Shaw Elementary","01860025",null,"04 - 06","SW",442,null,"ES",124,198]
["0186","Millbury Junior/Senior High","01860505",null,"07 - 12","NT",698,null,"MSHS/K-12",155,248]
["0187","Clyde F Brown","01870005",null,"PK - 04","TA",439,null,"ES",44,{"$f":"ROUND(J836*1.6, 0)","v":70}]
["0187","Millis Middle","01870020",null,"05 - 08","NT",375,null,"MS",45,72]
["0187","Millis High School","01870505",null,"09 - 12","NT",357,null,"HS",45,72]
["0189","Collicot","01890005",null,"K  - 05","NT",658,null,"ES",24,38]
["0189","Cunningham School","01890007",null,"PK - 05","NT",524,null,"ES",26,42]
["0189","Glover","01890010",null,"K  - 05","NT",605,null,"ES",30,48]
["0189","Tucker","01890020",null,"PK - 05","TA",394,null,"ES",71,114]
["0189","Charles S Pierce Middle","01890410",null,"06 - 08","NT",941,null,"MS",94,150]
["0189","Milton High","01890505",null,"PK,09 - 12","NT",1026,null,"HS",117,187]
["0191","Quarry Hill Community School","01910025",null,"PK - 04","TA",344,null,"ES",114,182]
["0191","Granite Valley Middle","01910310",null,"05 - 08","TA",248,null,"MS",68,109]
["0191","Monson High School","01910505",null,"09 - 12","NT",254,null,"HS",44,70]
["0196","Johnson","01960010",null,"PK - 06","TA",120,null,"ES",24,38]
["0197","Nantucket Elementary","01970005",null,"PK - 02","NT",325,null,"EES",88,141]
["0197","Cyrus Peirce","01970010",null,"06 - 08","NT",370,null,"MS",82,131]
["0197","Nantucket Intermediate School","01970020",null,"03 - 05","TA",382,null,"ES",83,133]
["0197","Nantucket High","01970505",null,"09 - 12","NT",527,null,"HS",99,158]
["0198","Bennett-Hemenway","01980005",null,"K  - 04","NT",566,null,"ES",35,56]
["0198","Brown","01980010",null,"K  - 04","NT",492,null,"ES",45,72]
["0198","Johnson","01980031",null,"K  - 04","TA",233,null,"ES",30,48]
["0198","Lilja Elementary","01980035",null,"K  - 04","NT",440,null,"ES",47,75]
["0198","Memorial","01980043",null,"K  - 04","NT",425,null,"ES",23,37]
["0198","J F Kennedy Middle School","01980305",null,"05 - 08","NT",699,null,"MS",66,106]
["0198","Wilson Middle","01980310",null,"05 - 08","NT",936,null,"MS",100,160]
["0198","Natick High","01980505",null,"PK,09 - 12","NT",1590,null,"HS",133,213]
["0199","Broadmeadow","01990005",null,"K  - 05","NT",564,null,"ES",21,34]
["0199","John Eliot","01990020",null,"K  - 05","TA",396,null,"ES",34,54]
["0199","Hillside Elementary","01990035",null,"K  - 05","NT",504,null,"ES",22,35]
["0199","William Mitchell","01990040",null,"K  - 05","NT",495,null,"ES",16,26]
["0199","Newman Elementary","01990050",null,"PK - 05","NT",668,null,"ES",43,69]
["0199","Pollard Middle","01990405",null,"07 - 08","NT",835,null,"MS",39,62]
["0199","High Rock School","01990410",null,"06","NT",448,null,"MS",20,32]
["0199","Needham High","01990505",null,"09 - 12","NT",1713,null,"HS",77,123]
["0201","Charles S Ashley","02010010",null,"K  - 05","SW",284,null,"ES",147,235]
["0201","Elizabeth Carter Brooks","02010015",null,"PK - 05","SW",271,null,"ES",174,278]
["0201","Elwyn G Campbell","02010020",null,"PK - 05","SW",205,null,"ES",127,203]
["0201","James B Congdon","02010040",null,"K  - 05","SW",319,null,"ES",229,366]
["0201","Sgt Wm H Carney Academy","02010045",null,"PK - 05","SW",714,null,"ES",500,800]
["0201","John B Devalles","02010050",null,"K  - 05","SW",376,null,"ES",305,488]
["0201","Alfred J Gomes","02010063",null,"K  - 05","SW",542,null,"ES",424,678]
["0201","Irwin M. Jacobs Elementary School","02010070",null,"PK - 05","SW",386,null,"ES",309,494]
["0201","Ellen R Hathaway","02010075",null,"PK - 05","SW",268,null,"ES",204,326]
["0201","Hayden/McFadden","02010078",null,"PK - 05","SW",640,null,"ES",527,843]
["0201","Abraham Lincoln","02010095",null,"K  - 05","SW",702,null,"ES",480,768]
["0201","Carlos Pacheco","02010105",null,"K  - 05","SW",324,null,"ES",260,416]
["0201","John Avery Parker","02010115",null,"PK - 05","SW",220,null,"ES",160,256]
["0201","Casimir Pulaski","02010123",null,"PK - 05","SW",604,null,"ES",270,432]
["0201","Renaissance Community Innovation School","02010124",null,"PK - 05","SW",177,null,"ES",148,237]
["0201","Thomas R Rodman","02010125",null,"K  - 05","SW",196,null,"ES",138,221]
["0201","Jireh Swift","02010130",null,"K  - 05","SW",192,null,"ES",94,150]
["0201","William H Taylor","02010135",null,"PK - 05","SW",225,null,"ES",122,195]
["0201","Betsey B Winslow","02010140",null,"K  - 05","SW",275,null,"ES",137,219]
["0201","Keith Middle School","02010405",null,"06 - 08","SW",963,null,"MS",639,1022]
["0201","Normandin Middle School","02010410",null,"06 - 08","SW",1247,null,"MS",739,1182]
["0201","Roosevelt Middle School","02010415",null,"06 - 08","SW",872,null,"MS",611,978]
["0201","New Bedford High","02010505",null,"09 - 12","SW",2149,null,"HS",1373,2197]
["0201","Trinity Day Academy","02010510",null,"04 - 12","SW",97,null,"MSHS/K-12",80,128]
["0201","Whaling City Junior/Senior High School","02010515",null,"06 - 12","SW",127,null,"MSHS/K-12",105,168]
["0204","Francis T Bresnahan Elementary","02040005",null,"PK - 03","TA",550,null,"ES",50,80]
["0204","Edward G. Molin Elementary School","02040030",null,"04 - 05","NT",313,null,"ES",31,50]
["0204","Rupert A Nock Middle","02040305",null,"06 - 08","NT",550,null,"MS",47,75]
["0204","Newburyport High","02040505",null,"09 - 12","NT",747,null,"HS",60,96]
["0207","A E Angier","02070005",null,"K  - 05","NT",501,null,"ES",24,38]
["0207","Bowen","02070015",null,"K  - 05","NT",405,null,"ES",31,50]
["0207","C C Burr","02070020",null,"K  - 05","NT",381,null,"ES",39,{"$f":"ROUND(J900*1.6, 0)","v":62}]
["0207","Cabot","02070025",null,"K  - 05","NT",386,null,"ES",27,43]
["0207","Countryside","02070040",null,"K  - 05","TA",417,null,"ES",44,70]
["0207","Franklin","02070055",null,"K  - 05","NT",421,null,"ES",27,43]
["0207","Lincoln-Eliot","02070070",null,"K  - 05","TA",366,null,"ES",70,112]
["0207","Horace Mann","02070075",null,"K  - 05","TA",399,null,"ES",33,53]
["0207","Mason-Rice","02070080",null,"K  - 05","NT",489,null,"ES",6,10]
["0207","Peirce","02070100",null,"K  - 05","NT",268,null,"ES",17,27]
["0207","Memorial Spaulding","02070105",null,"K  - 05","NT",464,null,"ES",23,37]
["0207","Newton Early Childhood Center","02070108",null,"PK","NT",0,null,"EES",0,0]
["0207","Underwood","02070115",null,"K  - 05","NT",292,null,"ES",22,35]
["0207","John Ward","02070120",null,"K  - 05","NT",297,null,"ES",11,18]
["0207","Williams","02070125",null,"K  - 05","NT",272,null,"ES",18,29]
["0207","Zervas","02070130",null,"K  - 05","NT",425,null,"ES",31,50]
["0207","Bigelow Middle","02070305",null,"06 - 08","NT",505,null,"MS",55,88]
["0207","Charles E Brown Middle","02070310",null,"06 - 08","NT",749,null,"MS",50,80]
["0207","F A Day Middle","02070315",null,"06 - 08","NT",962,null,"MS",79,126]
["0207","Oak Hill Middle","02070320",null,"06 - 08","NT",624,null,"MS",56,90]
["0207","Newton North High","02070505",null,"09 - 12","NT",2091,null,"HS",240,384]
["0207","Newton South High","02070510",null,"09 - 12","NT",1895,null,"HS",168,269]
["0208","Freeman-Kennedy School","02080005",null,"03 - 06","NT",520,null,"ES",28,45]
["0208","H Olive Day","02080015",null,"PK - 02","TA",375,null,"EES",15,24]
["0209","Colegrove Park Elementary","02090008",null,"PK - 06","SW",278,null,"ES",182,291]
["0209","Greylock","02090015",null,"PK - 06","SW",223,null,"ES",122,195]
["0209","Brayton","02090035",null,"PK - 06","SW",238,null,"ES",158,253]
["0209","Drury High","02090505",null,"07 - 12","NT",516,null,"MSHS/K-12",285,456]
["0210","Bridge Street","02100005",null,"PK - 05","SW",216,null,"ES",86,138]
["0210","Jackson Street","02100020",null,"K  - 05","SW",354,null,"ES",86,138]
["0210","Leeds","02100025",null,"PK - 05","SW",292,null,"ES",72,115]
["0210","R. K. Finn Ryan Road","02100029",null,"K  - 05","SW",219,null,"ES",71,114]
["0210","John F Kennedy Middle School","02100410",null,"06 - 08","SW",610,null,"MS",165,264]
["0210","Northampton High","02100505",null,"09 - 12","NT",839,null,"HS",158,253]
["0211","Atkinson","02110001",null,"01 - 05","TA",354,null,"ES",110,176]
["0211","Anne Bradstreet Early Childhood Center","02110005",null,"PK - K","NT",338,null,"EES",46,74]
["0211","Franklin","02110010",null,"01 - 05","NT",391,null,"ES",40,64]
["0211","Kittredge","02110015",null,"01 - 05","NT",234,null,"ES",24,38]
["0211","Annie L Sargent School","02110018",null,"01 - 05","NT",472,null,"ES",34,54]
["0211","Thomson","02110020",null,"01 - 05","TA",291,null,"ES",80,128]
["0211","North Andover Middle","02110305",null,"06 - 08","NT",1091,null,"MS",160,256]
["0211","North Andover High","02110505",null,"09 - 12","NT",1455,null,"HS",177,283]
["0212","Amvet Boulevard","02120007",null,"K  - 05","NT",381,null,"ES",38,61]
["0212","Falls","02120010",null,"K  - 05","NT",247,null,"ES",43,69]
["0212","Joseph W Martin Jr Elementary","02120013",null,"K  - 05","NT",620,null,"ES",82,131]
["0212","Roosevelt Avenue","02120015",null,"K  - 05","NT",262,null,"ES",26,42]
["0212","North Attleborough Early Learning Center","02120020",null,"PK","NT",0,null,"EES",0,0]
["0212","Community","02120030",null,"K  - 05","TA",307,null,"ES",132,211]
["0212","North Attleborough Middle","02120305",null,"06 - 08","NT",1101,null,"MS",170,272]
["0212","North Attleboro High","02120505",null,"09 - 12","NT",1111,null,"HS",157,251]
["0213","Lincoln Street","02130003",null,"K  - 05","TA",246,null,"ES",31,50]
["0213","Marguerite E Peaslee","02130014",null,"K  - 05","TA",278,null,"ES",21,34]
["0213","Fannie E Proctor","02130015",null,"K  - 05","TA",238,null,"ES",42,67]
["0213","Marion E Zeh","02130020",null,"K  - 05","TA",243,null,"ES",14,22]
["0213","Robert E. Melican Middle School","02130305",null,"06 - 08","TA",585,null,"MS",54,86]
["0214","W Edward Balmer","02140001",null,"02 - 04","SW",470,null,"ES",142,227]
["0214","Northbridge Elementary","02140005",null,"PK - 01","TA",281,null,"EES",108,173]
["0214","Northbridge Middle","02140305",null,"05 - 08","TA",697,null,"MS",185,296]
["0214","Northbridge High","02140505",null,"09 - 12","NT",537,null,"HS",132,211]
["0215","North Brookfield Elementary","02150015",null,"PK - 06","SW",295,null,"ES",105,168]
["0215","North Brookfield High","02150505",null,"07 - 12","NT",252,null,"MSHS/K-12",78,125]
["0217","E Ethel Little School","02170003",null,"PK - 05","TA",267,null,"ES",31,50]
["0217","L D Batchelder","02170005",null,"K  - 05","NT",437,null,"ES",24,38]
["0217","J Turner Hood","02170010",null,"K  - 05","TA",352,null,"ES",25,40]
["0217","North Reading Middle","02170305",null,"06 - 08","TA",543,null,"MS",53,85]
["0217","North Reading High","02170505",null,"09 - 12","NT",748,null,"HS",42,67]
["0218","L G Nourse Elementary","02180010",null,"K  - 03","SW",268,null,"ES",66,{"$f":"ROUND(J964*1.6, 0)","v":106}]
["0218","J C Solmonese","02180015",null,"PK - 03","SW",387,null,"ES",87,139]
["0218","Henri A. Yelle","02180060",null,"04 - 05","TA",384,null,"ES",90,144]
["0218","Norton Middle","02180305",null,"06 - 08","NT",588,null,"MS",110,176]
["0218","Norton High","02180505",null,"09 - 12","NT",715,null,"HS",114,182]
["0219","Grace Farrar Cole","02190005",null,"PK - 05","NT",458,null,"ES",32,51]
["0219","William G Vinal","02190020",null,"PK - 05","NT",504,null,"ES",10,16]
["0219","Norwell Middle School","02190405",null,"06 - 08","TA",514,null,"MS",16,26]
["0219","Norwell High","02190505",null,"09 - 12","NT",682,null,"HS",25,40]
["0220","Balch","02200005",null,"01 - 05","TA",309,null,"ES",119,190]
["0220","Cornelius M Callahan","02200010",null,"01 - 05","TA",202,null,"ES",71,114]
["0220","F A Cleveland","02200015",null,"01 - 05","NT",325,null,"ES",73,117]
["0220","John P Oldham","02200020",null,"01 - 05","TA",238,null,"ES",42,67]
["0220","Charles J Prescott","02200025",null,"01 - 05","NT",250,null,"ES",37,59]
["0220","George F. Willett","02200075",null,"PK - K","TA",269,null,"EES",60,96]
["0220","Dr. Philip O. Coakley Middle School","02200305",null,"06 - 08","NT",748,null,"MS",174,278]
["0220","Norwood High","02200505",null,"09 - 12","NT",981,null,"HS",233,373]
["0221","Oak Bluffs Elementary","02210005",null,"PK - 08","TA",427,null,"ESMS",102,163]
["0223","Dexter Park","02230010",null,"03 - 06","SW",322,null,"ES",162,259]
["0223","Fisher Hill","02230015",null,"PK - 02","SW",206,null,"EES",131,210]
["0224","Orleans Elementary","02240005",null,"K  - 05","TA",210,null,"ES",60,96]
["0226","Clara Barton","02260005",null,"02 - 04","SW",401,null,"ES",128,205]
["0226","Alfred M Chaffee","02260010",null,"PK - 01","SW",213,null,"EES",60,96]
["0226","Project C.O.F.F.E.E.","02260305",null,"07, 09 - 12","NT",21,null,"HS",12,19]
["0226","Oxford Middle","02260405",null,"05 - 07","SW",420,null,"MS",129,206]
["0226","Oxford High","02260505",null,"08 - 12","NT",515,null,"MSHS/K-12",160,256]
["0227","Old Mill Pond","02270008",null,"PK - 05","SW",618,null,"ES",271,434]
["0227","Palmer High","02270505",null,"06 - 12","SW",672,null,"MSHS/K-12",245,392]
["0229","Captain Samuel Brown","02290005",null,"K  - 05","SW",355,null,"ES",98,157]
["0229","John E Burke","02290007",null,"K  - 05","NT",272,null,"ES",47,75]
["0229","Thomas Carroll","02290010",null,"K  - 05","SW",598,null,"ES",267,427]
["0229","Center","02290015",null,"K  - 05","SW",382,null,"ES",123,197]
["0229","John E. McCarthy","02290016",null,"PK - 05","SW",245,null,"ES",83,133]
["0229","William A Welch Sr","02290027",null,"PK - 05","SW",362,null,"ES",188,301]
["0229","South Memorial","02290035",null,"PK - 05","NT",390,null,"ES",86,138]
["0229","West Memorial","02290045",null,"PK - 05","NT",228,null,"ES",51,82]
["0229","J Henry Higgins Middle","02290305",null,"06 - 08","NT",1440,null,"MS",444,710]
["0229","Peabody Veterans Memorial High","02290510",null,"09 - 12","NT",1408,null,"HS",395,632]
["0230","Pelham Elementary","02300005",null,"K  - 06","NT",134,null,"ES",21,34]
["0231","Bryantville Elementary","02310003",null,"K  - 06","TA",497,null,"ES",98,157]
["0231","Hobomock Elementary","02310010",null,"K  - 06","NT",427,null,"ES",38,61]
["0231","North Pembroke Elementary","02310015",null,"PK - 06","NT",493,null,"ES",68,109]
["0231","Pembroke Community Middle School","02310305",null,"07 - 08","TA",462,null,"MS",50,80]
["0231","Pembroke High School","02310505",null,"09 - 12","NT",834,null,"HS",82,131]
["0234","Petersham Center","02340005",null,"K  - 06","NT",120,null,"ES",34,54]
["0236","Allendale","02360010",null,"K  - 05","NT",313,null,"ES",159,254]
["0236","Egremont","02360035",null,"K  - 05","NT",427,null,"ES",178,285]
["0236","Robert T. Capeless Elementary School","02360045",null,"PK - 05","NT",192,null,"ES",89,142]
["0236","Morningside Community School","02360055",null,"PK - 05","SW",353,null,"ES",264,422]
["0236","Crosby","02360065",null,"PK - 05","SW",344,null,"ES",247,395]
["0236","Stearns","02360090",null,"K  - 05","NT",234,null,"ES",83,133]
["0236","Williams","02360100",null,"K  - 05","NT",297,null,"ES",84,134]
["0236","Silvio O Conte Community","02360105",null,"PK - 05","SW",333,null,"ES",279,446]
["0236","John T Reid Middle","02360305",null,"06 - 08","SW",539,null,"MS",311,498]
["0236","Theodore Herberg Middle","02360310",null,"06 - 08","SW",638,null,"MS",302,483]
["0236","Pittsfield High","02360505",null,"09 - 12","NT",776,null,"HS",311,498]
["0236","Taconic High","02360510",null,"09 - 12","NT",813,null,"HS",362,579]
["0238","Beatrice H Wood Elementary","02380005",null,"04 - 06","TA",289,null,"ES",54,86]
["0238","Anna Ware Jackson","02380010",null,"PK - 03","TA",360,null,"ES",60,96]
["0239","Plymouth Early Childhood Center","02390003",null,"PK","NT",0,null,"EES",0,0]
["0239","Cold Spring","02390005",null,"K  - 05","SW",222,null,"ES",72,115]
["0239","Hedge","02390010",null,"K  - 05","SW",189,null,"ES",110,176]
["0239","Federal Furnace School","02390011",null,"K  - 05","SW",365,null,"ES",110,176]
["0239","Indian Brook","02390012",null,"K  - 05","NT",570,null,"ES",106,170]
["0239","Manomet Elementary","02390015",null,"K  - 05","TA",267,null,"ES",70,{"$f":"ROUND(J1028*1.6, 0)","v":112}]
["0239","Nathaniel Morton Elementary","02390030",null,"K  - 05","NT",548,null,"ES",118,189]
["0239","South Elementary","02390046",null,"K  - 05","NT",632,null,"ES",140,224]
["0239","West Elementary","02390047",null,"K  - 05","NT",356,null,"ES",95,152]
["0239","Plymouth South Middle","02390305",null,"06 - 08","NT",708,null,"MS",137,219]
["0239","Plymouth Commun Intermediate","02390405",null,"06 - 08","NT",1064,null,"MS",294,470]
["0239","Plymouth North High","02390505",null,"09 - 12","NT",1251,null,"HS",270,432]
["0239","Plymouth South High","02390515",null,"09 - 12","NT",1070,null,"HS",169,270]
["0240","Dennett Elementary","02400010",null,"K  - 06","TA",201,null,"ES",30,48]
["0242","Provincetown Schools","02420020",null,"PK - 08","SW",104,null,"ESMS",41,66]
["0243","Amelio Della Chiesa Early Childhood Center","02430005",null,"PK","SW",0,null,"EES",0,0]
["0243","Beechwood Knoll Elementary","02430020",null,"K  - 05","NT",328,null,"ES",107,171]
["0243","Charles A Bernazzani Elementary","02430025",null,"K  - 05","NT",342,null,"ES",72,115]
["0243","Lincoln-Hancock Community School","02430035",null,"K  - 04","SW",512,null,"ES",216,346]
["0243","Atherton Hough","02430040",null,"K  - 05","NT",269,null,"ES",76,122]
["0243","Clifford H Marshall Elementary","02430055",null,"K  - 04","SW",527,null,"ES",213,341]
["0243","Merrymount","02430060",null,"K  - 05","NT",367,null,"ES",89,142]
["0243","Montclair","02430065",null,"K  - 05","NT",424,null,"ES",129,206]
["0243","Francis W Parker","02430075",null,"K  - 05","SW",329,null,"ES",135,216]
["0243","Snug Harbor Community School","02430090",null,"PK - 05","SW",311,null,"ES",222,355]
["0243","Squantum","02430095",null,"K  - 05","NT",344,null,"ES",84,134]
["0243","Wollaston School","02430110",null,"K  - 05","NT",334,null,"ES",98,157]
["0243","Atlantic Middle","02430305",null,"06 - 08","NT",543,null,"MS",167,267]
["0243","Broad Meadows Middle","02430310",null,"06 - 08","NT",365,null,"MS",152,243]
["0243","Central Middle","02430315",null,"06 - 08","NT",615,null,"MS",137,219]
["0243","Reay E Sterling Middle","02430320",null,"05 - 08","NT",369,null,"MS",189,302]
["0243","Point Webster Middle","02430325",null,"PK,05 - 08","NT",358,null,"MS",135,216]
["0243","Quincy High","02430505",null,"09 - 12","NT",1516,null,"HS",545,872]
["0243","North Quincy High","02430510",null,"09 - 12","NT",1255,null,"HS",408,653]
["0244","Margaret L Donovan","02440015",null,"K  - 05","NT",458,null,"ES",183,293]
["0244","J F Kennedy Elementary","02440018",null,"PK - 05","SW",372,null,"ES",205,328]
["0244","Elizabeth G Lyons Elementary","02440020",null,"K  - 05","SW",314,null,"ES",143,229]
["0244","Martin E Young Elementary","02440040",null,"K  - 05","SW",279,null,"ES",133,213]
["0244","Randolph Community Middle","02440410",null,"06 - 08","NT",620,null,"MS",273,437]
["0244","Randolph High","02440505",null,"09 - 12","NT",663,null,"HS",294,470]
["0246","RISE PreSchool","02460001",null,"PK","NT",0,null,"EES",0,0]
["0246","Alice M Barrows","02460002",null,"K  - 05","NT",374,null,"ES",21,34]
["0246","Birch Meadow","02460005",null,"K  - 05","NT",380,null,"ES",16,26]
["0246","Joshua Eaton","02460010",null,"K  - 05","TA",391,null,"ES",43,69]
["0246","J Warren Killam","02460017",null,"K  - 05","TA",407,null,"ES",29,46]
["0246","Wood End Elementary School","02460020",null,"K  - 05","NT",306,null,"ES",24,38]
["0246","Arthur W Coolidge Middle","02460305",null,"06 - 08","NT",442,null,"MS",35,56]
["0246","Walter S Parker Middle","02460310",null,"06 - 08","NT",547,null,"MS",49,78]
["0246","Reading Memorial High","02460505",null,"09 - 12","NT",1252,null,"HS",91,146]
["0248","A. C. Whelan Elementary School","02480003",null,"K  - 05","SW",782,null,"ES",372,595]
["0248","Beachmont Veterans Memorial School","02480013",null,"PK - 05","SW",299,null,"ES",139,222]
["0248","Rumney Marsh Academy","02480014",null,"06 - 08","SW",606,null,"MS",281,450]
["0248","Abraham Lincoln","02480025",null,"PK - 05","SW",550,null,"ES",259,414]
["0248","Staff Sargent James J. Hill Elementary School","02480035",null,"K  - 05","SW",723,null,"ES",352,563]
["0248","Paul Revere","02480050",null,"K  - 05","SW",465,null,"ES",234,374]
["0248","Garfield Elementary School","02480056",null,"PK - 05","SW",671,null,"ES",371,594]
["0248","Garfield Middle School","02480057",null,"06 - 08","SW",566,null,"MS",285,456]
["0248","Susan B. Anthony Middle School","02480305",null,"06 - 08","SW",598,null,"MS",271,434]
["0248","Revere High","02480505",null,"09 - 12","SW",1963,null,"HS",879,1406]
["0248","Seacoast School","02480520",null,"09 - 12","SW",84,null,"HS",57,91]
["0249","Richmond Consolidated","02490005",null,"PK - 08","NT",159,null,"ESMS",33,53]
["0250","Rochester Memorial","02500005",null,"PK - 06","TA",487,null,"ES",70,112]
["0251","Memorial Park","02510020",null,"K  - 04","SW",292,null,"ES",114,182]
["0251","R Stewart Esten","02510025",null,"K  - 04","SW",334,null,"ES",130,208]
["0251","Jefferson Elementary School","02510060",null,"K  - 04","SW",269,null,"ES",99,158]
["0251","John W Rogers Middle","02510305",null,"05 - 08","NT",718,null,"MS",251,402]
["0251","Rockland Senior High","02510505",null,"PK,09 - 12","NT",566,null,"HS",158,253]
["0252","Rockport Elementary","02520005",null,"PK - 05","TA",373,null,"ES",87,139]
["0252","Rockport Middle","02520305",null,"06 - 08","NT",218,null,"MS",49,78]
["0252","Rockport High","02520510",null,"09 - 12","NT",282,null,"HS",38,{"$f":"ROUND(J1092*1.6, 0)","v":61}]
["0253","Rowe Elementary","02530005",null,"PK - 06","NT",52,null,"ES",18,29]
["0258","Salem Early Childhood","02580001",null,"PK","NT",0,null,"EES",0,0]
["0258","Bates","02580003",null,"K  - 05","SW",409,null,"ES",199,318]
["0258","Carlton","02580015",null,"K  - 05","SW",286,null,"ES",124,198]
["0258","Horace Mann Laboratory","02580030",null,"K  - 05","SW",311,null,"ES",163,261]
["0258","Saltonstall School","02580050",null,"K  - 08","SW",409,null,"ESMS",169,270]
["0258","Witchcraft Heights","02580070",null,"K  - 05","SW",571,null,"ES",246,394]
["0258","Collins Middle","02580305",null,"06 - 08","SW",679,null,"MS",364,582]
["0258","Salem High","02580505",null,"09 - 12","NT",920,null,"HS",443,709]
["0258","New Liberty Innovation School","02580510",null,"09 - 12","NT",47,null,"HS",34,54]
["0258","Salem Prep High School","02580515",null,"08 - 12","NT",21,null,"HS",13,21]
["0261","Forestdale School","02610002",null,"PK - 02","TA",547,null,"EES",92,147]
["0261","Oak Ridge","02610025",null,"03 - 06","TA",808,null,"ES",141,226]
["0261","Sandwich STEM Academy","02610305",null,"07 - 08","NT",449,null,"MS",58,93]
["0261","Sandwich High","02610505",null,"09 - 12","NT",642,null,"HS",81,130]
["0262","Lynnhurst","02620040",null,"K  - 05","SW",282,null,"ES",81,130]
["0262","Oaklandvale","02620050",null,"K  - 05","SW",244,null,"ES",117,187]
["0262","Veterans Memorial","02620065",null,"PK - 05","SW",465,null,"ES",138,221]
["0262","Douglas Waybright","02620067",null,"PK - 05","SW",191,null,"ES",52,83]
["0262","Belmonte Saugus Middle","02620305",null,"06 - 08","SW",617,null,"MS",178,285]
["0262","Saugus High","02620505",null,"09 - 12","SW",673,null,"HS",173,277]
["0263","Emma L Miller Elementary School","02630010",null,"PK - 05","TA",52,null,"ES",30,48]
["0264","Cushing Elementary","02640007",null,"K  - 05","NT",333,null,"ES",28,45]
["0264","Hatherly Elementary","02640010",null,"K  - 05","NT",261,null,"ES",21,34]
["0264","Jenkins Elementary School","02640015",null,"K  - 05","NT",351,null,"ES",44,70]
["0264","Wampatuck Elementary","02640020",null,"PK - 05","NT",348,null,"ES",29,46]
["0264","Gates Middle School","02640305",null,"06 - 08","TA",681,null,"MS",79,126]
["0264","Scituate High School","02640505",null,"09 - 12","NT",954,null,"HS",83,133]
["0265","George R Martin","02650007",null,"PK - 05","TA",474,null,"ES",81,130]
["0265","Mildred Aitken School","02650015",null,"PK - 05","TA",434,null,"ES",57,91]
["0265","Dr. Kevin M. Hurley Middle School","02650405",null,"06 - 08","TA",504,null,"MS",72,115]
["0265","Seekonk High","02650505",null,"09 - 12","NT",618,null,"HS",75,120]
["0266","Sharon Early Childhood Center","02660001",null,"PK","NT",0,null,"EES",0,0]
["0266","Cottage Street","02660005",null,"K  - 05","NT",521,null,"ES",20,32]
["0266","East Elementary","02660010",null,"K  - 05","NT",517,null,"ES",45,72]
["0266","Heights Elementary","02660015",null,"K  - 05","NT",544,null,"ES",27,43]
["0266","Sharon Middle","02660305",null,"06 - 08","TA",854,null,"MS",78,125]
["0266","Sharon High","02660505",null,"09 - 12","NT",1117,null,"HS",99,158]
["0269","Pine Hill","02690010",null,"PK - 05","TA",382,null,"ES",21,34]
["0271","Beal School","02710005",null,"K  - 01","TA",299,null,"EES",47,75]
["0271","Calvin Coolidge","02710015",null,"K  - 04","TA",407,null,"ES",86,138]
["0271","Floral Street School","02710020",null,"01 - 04","TA",731,null,"ES",63,101]
["0271","Walter J Paton","02710025",null,"K  - 04","NT",380,null,"ES",33,53]
["0271","Oak Middle School","02710030",null,"07 - 08","NT",996,null,"MS",109,174]
["0271","Spring Street","02710035",null,"K  - 04","NT",365,null,"ES",12,19]
["0271","Parker Road Preschool","02710040",null,"PK","NT",0,null,"EES",0,0]
["0271","Sherwood Middle School","02710305",null,"05 - 06","NT",961,null,"ES",101,162]
["0271","Shrewsbury Sr High","02710505",null,"09 - 12","NT",1849,null,"HS",180,288]
["0272","Shutesbury Elementary","02720005",null,"PK - 06","TA",109,null,"ES",41,66]
["0273","Chace Street","02730005",null,"PK - 05","TA",360,null,"ES",94,150]
["0273","North Elementary","02730008",null,"K  - 05","NT",466,null,"ES",88,141]
["0273","South","02730015",null,"K  - 05","TA",267,null,"ES",80,128]
["0273","Somerset Middle School","02730305",null,"06 - 08","NT",616,null,"MS",121,194]
["0274","Capuano Early Childhood Center","02740005",null,"PK - K","SW",93,null,"EES",40,64]
["0274","Benjamin G Brown","02740015",null,"K  - 05","NT",230,null,"ES",31,50]
["0274","Arthur D Healey","02740075",null,"PK - 08","SW",423,null,"ESMS",232,371]
["0274","John F Kennedy","02740083",null,"K  - 08","SW",437,null,"ESMS",108,173]
["0274","Albert F. Argenziano School at Lincoln Park","02740087",null,"PK - 08","SW",606,null,"ESMS",225,360]
["0274","E Somerville Community","02740111",null,"K  - 08","SW",710,null,"ESMS",357,571]
["0274","West Somerville Neighborhood","02740115",null,"PK - 08","SW",349,null,"ESMS",140,224]
["0274","Winter Hill Community","02740120",null,"PK - 08","SW",424,null,"ESMS",232,371]
["0274","Next Wave Junior High","02740410",null,"06 - 08","SW",18,null,"MS",14,22]
["0274","Somerville High","02740505",null,"09 - 12","NT",1247,null,"HS",542,867]
["0274","Full Circle High School","02740510",null,"09 - 12","SW",51,null,"HS",34,{"$f":"ROUND(J1156*1.6, 0)","v":54}]
["0275","William E Norris","02750005",null,"PK - 06","TA",462,null,"ES",60,96]
["0276","Mary E Finn School","02760008",null,"PK - 01","TA",244,null,"EES",10,16]
["0276","Margaret A Neary","02760020",null,"04 - 05","NT",255,null,"ES",16,26]
["0276","Albert S. Woodward Memorial School","02760050",null,"02 - 03","NT",257,null,"ES",9,14]
["0276","P Brent Trottier","02760305",null,"06 - 08","NT",431,null,"MS",22,35]
["0277","Charlton Street","02770005",null,"PK,02 - 05","SW",285,null,"ES",203,325]
["0277","Eastford Road","02770010",null,"PK - 01","SW",312,null,"EES",229,366]
["0277","West Street","02770020",null,"01 - 05","SW",326,null,"ES",228,365]
["0277","Southbridge Middle School","02770315",null,"06 - 08","SW",489,null,"MS",322,515]
["0277","Southbridge High School","02770515",null,"09 - 12","SW",487,null,"HS",320,512]
["0277","Southbridge Academy","02770525",null,"09 - 12","NT",31,null,"HS",24,38]
["0278","Plains Elementary","02780015",null,"PK - 01","TA",282,null,"EES",70,112]
["0278","Mosier","02780020",null,"02 - 04","TA",428,null,"ES",119,190]
["0278","Michael E. Smith Middle School","02780305",null,"05 - 08","NT",569,null,"MS",146,234]
["0278","South Hadley High","02780505",null,"09 - 12","NT",545,null,"HS",116,186]
["0281","Early Childhood Education Center","02810001",null,"PK","NT",0,null,"EES",0,0]
["0281","Springfield Public Day Elementary School","02810005",null,"K  - 05","SW",71,null,"ES",63,101]
["0281","Edward P. Boland School","02810010",null,"PK - 05","SW",567,null,"ES",485,776]
["0281","Thomas M Balliet","02810015",null,"PK - 05","SW",255,null,"ES",173,277]
["0281","Samuel Bowles","02810020",null,"K  - 05","SW",324,null,"ES",250,400]
["0281","Milton Bradley School","02810023",null,"PK - 05","SW",476,null,"ES",434,694]
["0281","Brightwood","02810025",null,"PK - 05","SW",313,null,"ES",284,454]
["0281","Elias Brookings","02810030",null,"PK - 05","SW",282,null,"ES",232,371]
["0281","Daniel B Brunton","02810035",null,"K  - 05","SW",432,null,"ES",326,522]
["0281","William N. DeBerry","02810045",null,"K  - 05","SW",261,null,"ES",234,374]
["0281","Hiram L Dorman","02810050",null,"K  - 05","SW",296,null,"ES",241,386]
["0281","Rebecca M Johnson","02810055",null,"PK - 05","SW",649,null,"ES",564,902]
["0281","Margaret C Ells","02810060",null,"PK - 01","SW",70,null,"EES",48,77]
["0281","Glenwood","02810065",null,"K  - 05","SW",294,null,"ES",218,349]
["0281","Glickman Elementary","02810068",null,"K  - 05","SW",322,null,"ES",243,389]
["0281","Frank H Freedman","02810075",null,"K  - 05","SW",302,null,"ES",213,341]
["0281","Frederick Harris","02810080",null,"PK - 05","SW",584,null,"ES",406,650]
["0281","Homer Street","02810085",null,"K  - 05","SW",384,null,"ES",332,531]
["0281","Alfred G. Zanetti Montessori Magnet School","02810095",null,"PK - 08","SW",356,null,"ESMS",118,189]
["0281","Indian Orchard Elementary","02810100",null,"PK - 05","SW",551,null,"ES",439,702]
["0281","Kensington International School","02810110",null,"PK - 05","SW",283,null,"ES",254,406]
["0281","Liberty","02810115",null,"K  - 05","SW",283,null,"ES",202,323]
["0281","Lincoln","02810120",null,"K  - 05","SW",403,null,"ES",355,568]
["0281","Mary A. Dryden Veterans Memorial School","02810125",null,"PK - 05","SW",298,null,"ES",207,331]
["0281","Mary M Lynch","02810140",null,"K  - 05","SW",268,null,"ES",208,333]
["0281","Mary O Pottenger","02810145",null,"PK - 05","SW",416,null,"ES",297,475]
["0281","Mary M Walsh","02810155",null,"K  - 05","SW",296,null,"ES",238,381]
["0281","Sumner Avenue","02810160",null,"PK - 05","SW",468,null,"ES",384,614]
["0281","Arthur T Talmadge","02810165",null,"K  - 05","SW",243,null,"ES",185,296]
["0281","Alice B Beal Elementary","02810175",null,"K  - 05","SW",249,null,"ES",180,288]
["0281","Warner","02810180",null,"PK - 05","SW",223,null,"ES",154,246]
["0281","Washington","02810185",null,"PK - 05","SW",379,null,"ES",300,480]
["0281","White Street","02810190",null,"K  - 05","SW",454,null,"ES",385,616]
["0281","German Gerena Community School","02810195",null,"PK - 05","SW",610,null,"ES",517,827]
["0281","The Springfield Renaissance School an Expeditionary Learning School","02810205",null,"06 - 12","SW",683,null,"MSHS/K-12",359,574]
["0281","Springfield International Academy at Johnson","02810215",null,"03 - 05","NT",25,null,"ES",22,35]
["0281","John J Duggan Middle","02810320",null,"06 - 12","SW",752,null,"MSHS/K-12",522,835]
["0281","Forest Park Middle","02810325",null,"06 - 08","SW",715,null,"MS",578,925]
["0281","John F Kennedy Middle","02810328",null,"06 - 08","SW",487,null,"MS",403,645]
["0281","M Marcus Kiley Middle","02810330",null,"06 - 08","SW",708,null,"MS",569,910]
["0281","Springfield Public Day Middle School","02810345",null,"06 - 08","SW",53,null,"MS",51,82]
["0281","STEM Middle Academy","02810350",null,"06 - 08","SW",290,null,"MS",199,318]
["0281","South End Middle School","02810355",null,"06 - 08","SW",215,null,"MS",196,314]
["0281","Balliet Middle School","02810360",null,"06 - 08","SW",41,null,"MS",37,59]
["0281","Chestnut Academy","02810365",null,"06 - 08","SW",315,null,"MS",283,453]
["0281","Impact Prep at Chestnut","02810366",null,"06 - 08","SW",377,null,"MS",330,528]
["0281","Chestnut Accelerated Middle School (Talented and Gifted)","02810367",null,"06 - 08","SW",322,null,"MS",219,350]
["0281","Conservatory of the Arts","02810475",null,"06 - 12","SW",341,null,"MSHS/K-12",270,432]
["0281","Rise Academy at Van Sickle","02810480",null,"06 - 08","SW",312,null,"MS",249,{"$f":"ROUND(J1220*1.6, 0)","v":398}]
["0281","Van Sickle Academy","02810485",null,"06 - 08","SW",266,null,"MS",214,342]
["0281","Springfield Central High","02810500",null,"09 - 12","SW",2034,null,"HS",1299,2078]
["0281","High School Of Commerce","02810510",null,"09 - 12","SW",977,null,"HS",782,1251]
["0281","Springfield High School of Science and Technology","02810530",null,"09 - 12","SW",1216,null,"HS",929,1486]
["0281","Springfield Public Day High School","02810550",null,"09 - 12","SW",81,null,"HS",71,114]
["0281","Liberty Preparatory Academy","02810560",null,"09 - 11","SW",10,null,"HS",9,14]
["0281","Springfield High School","02810570",null,"09 - 12","SW",220,null,"HS",172,275]
["0281","Gateway to College at Holyoke Community College","02810575",null,"09 - 12","SW",41,null,"HS",31,50]
["0281","Gateway to College at Springfield Technical Community College","02810580",null,"09 - 12","SW",44,null,"HS",30,48]
["0281","Roger L. Putnam Vocational Technical Academy","02810620",null,"09 - 12","SW",1394,null,"HS",973,1557]
["0281","Springfield Vocational Academy","02810675",null,"SP","SW",0,null,"SP",0,0]
["0281","Springfield International Academy at Sci-Tech","02810700",null,"09 - 10","NT",41,null,"HS",27,43]
["0284","Colonial Park","02840005",null,"PK - 04","NT",221,null,"ES",24,38]
["0284","Robin Hood","02840025",null,"PK - 04","TA",344,null,"ES",59,94]
["0284","South","02840030",null,"PK - 04","TA",331,null,"ES",64,102]
["0284","Stoneham Central Middle School","02840405",null,"05 - 08","TA",723,null,"MS",128,205]
["0284","Stoneham High","02840505",null,"09 - 12","NT",668,null,"HS",90,144]
["0285","Helen Hansen Elementary","02850010",null,"K  - 05","NT",222,null,"ES",64,102]
["0285","Edwin A Jones Early Childhood Center","02850012",null,"PK","NT",0,null,"EES",0,0]
["0285","Joseph R Dawe Jr Elementary","02850014",null,"K  - 05","NT",350,null,"ES",95,152]
["0285","South Elementary","02850015",null,"K  - 05","NT",247,null,"ES",54,86]
["0285","Richard L. Wilkins Elementary School","02850020",null,"PK - 05","SW",329,null,"ES",160,256]
["0285","Joseph H Gibbons","02850025",null,"K  - 05","NT",351,null,"ES",101,162]
["0285","O'Donnell Middle School","02850405",null,"06 - 08","NT",857,null,"MS",248,397]
["0285","Stoughton High","02850505",null,"09 - 12","NT",1037,null,"HS",269,430]
["0287","Burgess Elementary","02870005",null,"PK - 06","TA",801,null,"ES",116,186]
["0288","Josiah Haynes","02880010",null,"K  - 05","NT",363,null,"ES",11,18]
["0288","Israel Loring School","02880015",null,"K  - 05","TA",473,null,"ES",45,72]
["0288","General John Nixon Elementary","02880025",null,"K  - 05","NT",345,null,"ES",23,37]
["0288","Peter Noyes","02880030",null,"PK - 05","NT",491,null,"ES",15,24]
["0288","Ephraim Curtis Middle","02880305",null,"06 - 08","TA",948,null,"MS",45,72]
["0289","Sunderland Elementary","02890005",null,"PK - 06","TA",210,null,"ES",67,107]
["0290","Sutton Early Learning","02900003",null,"PK - 02","TA",284,null,"EES",25,40]
["0290","Sutton Elementary","02900005",null,"03 - 05","NT",316,null,"ES",31,50]
["0290","Sutton Middle School","02900305",null,"06 - 08","NT",370,null,"MS",44,70]
["0290","Sutton High School","02900510",null,"09 - 12","NT",389,null,"HS",32,51]
["0291","Clarke","02910005",null,"K  - 04","TA",214,null,"ES",46,74]
["0291","Hadley","02910010",null,"K  - 04","TA",324,null,"ES",53,85]
["0291","Stanley","02910020",null,"K  - 04","NT",238,null,"ES",7,11]
["0291","Swampscott Middle","02910305",null,"PK,05 - 08","TA",673,null,"MS",102,163]
["0291","Swampscott High","02910505",null,"09 - 12","NT",708,null,"HS",108,173]
["0292","Elizabeth S Brown","02920006",null,"03 - 05","TA",276,null,"ES",45,72]
["0292","Gardner","02920015",null,"K  - 02","TA",263,null,"EES",65,104]
["0292","Mark G Hoyle Elementary","02920017",null,"PK - 02","TA",200,null,"EES",37,59]
["0292","Joseph G Luther","02920020",null,"03 - 05","TA",203,null,"ES",34,54]
["0292","Joseph Case Jr High","02920305",null,"06 - 08","NT",545,null,"MS",128,205]
["0292","Joseph Case High","02920505",null,"09 - 12","NT",532,null,"HS",86,138]
["0293","Edward F. Leddy Preschool","02930005",null,"PK","NT",0,null,"EES",0,0]
["0293","Edmund Hatch Bennett","02930007",null,"K  - 04","SW",314,null,"ES",110,176]
["0293","Joseph C Chamberlain","02930008",null,"K  - 04","SW",507,null,"ES",188,301]
["0293","East Taunton Elementary","02930010",null,"K  - 04","SW",616,null,"ES",225,360]
["0293","Mulcahey Elementary School","02930015",null,"PK - 04","SW",485,null,"ES",258,413]
["0293","Elizabeth Pole","02930027",null,"K  - 04","SW",581,null,"ES",336,538]
["0293","Hopewell","02930035",null,"K  - 04","SW",283,null,"ES",176,282]
["0293","Joseph H Martin","02930042",null,"05 - 07","NT",692,null,"MS",286,458]
["0293","H H Galligan","02930057",null,"K  - 04","SW",251,null,"ES",173,277]
["0293","John F Parker Middle","02930305",null,"05 - 07","NT",505,null,"MS",280,448]
["0293","Benjamin Friedman Middle","02930315",null,"05 - 07","NT",778,null,"MS",307,491]
["0293","Taunton High","02930505",null,"08 - 12","NT",2589,null,"MSHS/K-12",1003,1605]
["0293","Taunton Alternative High School","02930525",null,"10 - 12","NT",114,null,"HS",79,126]
["0295","L F Dewing","02950001",null,"PK - 02","TA",421,null,"EES",64,102]
["0295","Heath-Brook","02950010",null,"K  - 02","TA",351,null,"EES",49,78]
["0295","North Street","02950020",null,"03 - 04","TA",284,null,"ES",49,78]
["0295","John F. Ryan","02950023",null,"05 - 06","NT",514,null,"ES",70,{"$f":"ROUND(J1284*1.6, 0)","v":112}]
["0295","Louise Davy Trahan","02950025",null,"03 - 04","NT",205,null,"ES",34,54]
["0295","John W. Wynn Middle","02950305",null,"07 - 08","NT",555,null,"MS",85,136]
["0295","Tewksbury Memorial High","02950505",null,"09 - 12","NT",915,null,"HS",127,203]
["0296","Tisbury Elementary","02960005",null,"PK - 08","TA",300,null,"ESMS",97,155]
["0298","Proctor Elementary","02980005",null,"04 - 06","TA",267,null,"ES",10,16]
["0298","Steward Elementary","02980010",null,"PK - 03","TA",333,null,"ES",12,19]
["0300","Truro Central","03000005",null,"PK - 06","SW",90,null,"ES",27,43]
["0301","Tyngsborough Elementary","03010020",null,"PK - 05","TA",742,null,"ES",115,184]
["0301","Tyngsborough Middle","03010305",null,"06 - 08","NT",367,null,"MS",48,77]
["0301","Tyngsborough High School","03010505",null,"09 - 12","NT",479,null,"HS",41,66]
["0304","Taft Early Learning Center","03040005",null,"PK - 03","TA",470,null,"ES",105,168]
["0304","Whitin Intermediate","03040405",null,"04 - 07","TA",528,null,"ESMS",96,154]
["0304","Uxbridge High","03040505",null,"08 - 12","NT",577,null,"MSHS/K-12",98,157]
["0304","Gateway to College","03040515",null,"10 - 12","NT",46,null,"HS",16,26]
["0305","Early Childhood Center at the Doyle School","03050001",null,"PK","NT",0,null,"EES",0,0]
["0305","Dolbeare","03050005",null,"K  - 04","NT",459,null,"ES",50,80]
["0305","Woodville School","03050015",null,"K  - 04","TA",402,null,"ES",84,134]
["0305","Greenwood","03050020",null,"K  - 04","NT",223,null,"ES",11,18]
["0305","Walton","03050040",null,"K  - 04","NT",230,null,"ES",16,26]
["0305","Galvin Middle School","03050310",null,"05 - 08","TA",1038,null,"MS",148,237]
["0305","Wakefield Memorial High","03050505",null,"09 - 12","TA",995,null,"HS",125,200]
["0306","Wales Elementary","03060005",null,"PK - 06","TA",132,null,"ES",45,72]
["0307","Daniel Feeney Preschool Center","03070002",null,"PK","NT",0,null,"EES",0,0]
["0307","Elm Street School","03070005",null,"K  - 05","TA",422,null,"ES",33,53]
["0307","Boyden","03070010",null,"K  - 05","TA",348,null,"ES",45,72]
["0307","Fisher","03070015",null,"K  - 05","NT",463,null,"ES",40,64]
["0307","Old Post Road","03070018",null,"K  - 05","TA",447,null,"ES",52,83]
["0307","Bird Middle","03070305",null,"06 - 08","NT",449,null,"MS",53,85]
["0307","Eleanor N Johnson Middle","03070310",null,"06 - 08","NT",436,null,"MS",46,74]
["0307","Walpole High","03070505",null,"09 - 12","NT",1117,null,"HS",96,154]
["0308","Waltham Public Schools Dual Language Program","03080001",null,"K  - 02","SW",114,null,"EES",43,69]
["0308","William F. Stanley Elementary School","03080005",null,"PK - 05","SW",363,null,"ES",127,203]
["0308","Douglas MacArthur Elementary School","03080032",null,"K  - 05","NT",460,null,"ES",61,98]
["0308","Northeast Elementary School","03080040",null,"PK - 05","SW",482,null,"ES",183,293]
["0308","Thomas R Plympton Elementary School","03080050",null,"K  - 05","SW",424,null,"ES",164,262]
["0308","James Fitzgerald Elementary School","03080060",null,"K  - 05","NT",415,null,"ES",114,182]
["0308","Henry Whittemore Elementary School","03080065",null,"K  - 05","SW",418,null,"ES",215,344]
["0308","John F Kennedy Middle","03080404",null,"06 - 08","SW",533,null,"MS",175,280]
["0308","John W. McDevitt Middle School","03080415",null,"06 - 08","SW",677,null,"MS",227,363]
["0308","Waltham Sr High","03080505",null,"09 - 12","NT",1614,null,"HS",572,915]
["0309","Stanley M Koziol Elementary School","03090020",null,"PK - 03","SW",321,null,"ES",182,291]
["0309","Ware Middle School","03090305",null,"04 - 06","SW",318,null,"ES",156,250]
["0309","Ware Junior/Senior High School","03090505",null,"07 - 12","NT",469,null,"MSHS/K-12",210,336]
["0310","John William Decas","03100003",null,"PK - 02","SW",523,null,"EES",283,453]
["0310","Minot Forest","03100017",null,"03 - 04","SW",348,null,"ES",170,272]
["0310","Wareham Middle","03100305",null,"05 - 07","NT",521,null,"MS",276,442]
["0310","Wareham Cooperative Alternative School","03100315",null,"09 - 12","NT",51,null,"HS",34,54]
["0310","Wareham Senior High","03100505",null,"08 - 12","NT",584,null,"MSHS/K-12",249,398]
["0314","Cunniff","03140015",null,"PK - 05","NT",313,null,"ES",69,110]
["0314","Hosmer","03140020",null,"PK - 05","TA",557,null,"ES",133,213]
["0314","James Russell Lowell","03140025",null,"PK - 05","TA",401,null,"ES",108,173]
["0314","Watertown Middle","03140305",null,"06 - 08","TA",565,null,"MS",150,240]
["0314","Watertown High","03140505",null,"09 - 12","NT",656,null,"HS",190,304]
["0315","Claypit Hill School","03150005",null,"K  - 05","NT",542,null,"ES",26,42]
["0315","Happy Hollow School","03150015",null,"K  - 05","TA",377,null,"ES",24,38]
["0315","Loker School","03150020",null,"K  - 05","TA",275,null,"ES",8,13]
["0315","Wayland Middle School","03150305",null,"06 - 08","NT",667,null,"MS",47,75]
["0315","Wayland High School","03150505",null,"09 - 12","NT",845,null,"HS",38,61]
["0316","Park Avenue Elementary","03160015",null,"PK - 04","SW",748,null,"ES",447,715]
["0316","Webster Middle School","03160315",null,"05 - 08","SW",570,null,"MS",307,491]
["0316","Bartlett High School","03160505",null,"09 - 12","SW",453,null,"HS",197,315]
["0317","Preschool at Wellesley Schools","03170001",null,"PK","NT",0,null,"EES",0,0]
["0317","Katharine Lee Bates","03170005",null,"K  - 05","NT",355,null,"ES",7,11]
["0317","Joseph E Fiske","03170015",null,"K  - 05","TA",292,null,"ES",24,{"$f":"ROUND(J1348*1.6, 0)","v":38}]
["0317","John D Hardy","03170020",null,"K  - 05","NT",288,null,"ES",10,16]
["0317","Hunnewell","03170025",null,"K  - 05","NT",262,null,"ES",10,16]
["0317","Schofield","03170045",null,"K  - 05","TA",379,null,"ES",27,43]
["0317","Sprague Elementary School","03170048",null,"K  - 05","NT",369,null,"ES",24,38]
["0317","Ernest F Upham","03170050",null,"K  - 05","NT",230,null,"ES",9,14]
["0317","Wellesley Middle","03170305",null,"06 - 08","NT",1153,null,"MS",62,99]
["0317","Wellesley Sr High","03170505",null,"09 - 12","TA",1522,null,"HS",77,123]
["0318","Wellfleet Elementary","03180005",null,"PK - 05","TA",89,null,"ES",26,42]
["0321","J Harding Armstrong","03210005",null,"K  - 03","NT",421,null,"ES",38,61]
["0321","Annie E Fales","03210010",null,"K  - 03","NT",364,null,"ES",24,38]
["0321","Elsie A Hastings Elementary","03210025",null,"PK - 03","NT",373,null,"ES",43,69]
["0321","Mill Pond School","03210045",null,"04 - 06","TA",912,null,"ES",86,138]
["0321","Sarah W Gibbons Middle","03210305",null,"07 - 08","NT",594,null,"MS",47,75]
["0321","Westborough High","03210505",null,"09 - 12","NT",1154,null,"HS",99,158]
["0322","Major Edwards Elementary","03220005",null,"PK - 05","TA",385,null,"ES",93,149]
["0322","West Boylston Junior/Senior High","03220505",null,"06 - 12","NT",482,null,"MSHS/K-12",92,147]
["0323","Rose L Macdonald","03230003",null,"01 - 03","TA",263,null,"ES",36,58]
["0323","Spring Street School","03230005",null,"PK - K","TA",113,null,"EES",15,24]
["0323","Howard School","03230305",null,"04 - 06","TA",287,null,"ES",54,86]
["0323","West Bridgewater Junior/Senior","03230505",null,"07 - 12","NT",625,null,"MSHS/K-12",88,141]
["0325","Fort Meadow Early Childhood Center","03250003",null,"PK","NT",0,null,"EES",0,0]
["0325","Franklin Ave","03250015",null,"K  - 04","SW",216,null,"ES",137,219]
["0325","Abner Gibbs","03250020",null,"K  - 04","SW",221,null,"ES",122,195]
["0325","Highland","03250025",null,"K  - 04","SW",346,null,"ES",145,232]
["0325","Munger Hill","03250033",null,"K  - 04","NT",366,null,"ES",113,181]
["0325","Paper Mill","03250036",null,"K  - 04","SW",327,null,"ES",148,237]
["0325","Southampton Road","03250040",null,"K  - 04","SW",329,null,"ES",115,184]
["0325","Westfield Intermediate School","03250075",null,"05 - 06","SW",804,null,"ES",330,528]
["0325","Westfield Middle School","03250310",null,"07 - 08","SW",801,null,"MS",292,467]
["0325","Westfield High","03250505",null,"09 - 12","SW",1192,null,"HS",328,525]
["0325","Westfield Technical Academy","03250605",null,"09 - 12","SW",522,null,"HS",165,264]
["0326","Abbot Elementary","03260004",null,"03 - 05","NT",384,null,"ES",26,42]
["0326","Day Elementary","03260007",null,"03 - 05","NT",358,null,"ES",22,35]
["0326","Millennium Elementary","03260013",null,"PK","NT",0,null,"EES",0,0]
["0326","Nabnasset","03260015",null,"K  - 02","NT",318,null,"EES",20,32]
["0326","Col John Robinson","03260025",null,"K  - 02","NT",307,null,"EES",22,35]
["0326","John A. Crisafulli Elementary School","03260045",null,"03 - 05","NT",354,null,"ES",16,26]
["0326","Rita E. Miller Elementary School","03260055",null,"K  - 02","NT",306,null,"EES",19,30]
["0326","Blanchard Middle","03260310",null,"06 - 08","NT",553,null,"MS",25,40]
["0326","Stony Brook School","03260330",null,"06 - 08","NT",662,null,"MS",30,48]
["0326","Westford Academy","03260505",null,"09 - 12","NT",1707,null,"HS",67,107]
["0327","Westhampton Elementary School","03270005",null,"PK - 06","NT",115,null,"ES",15,24]
["0330","Country","03300010",null,"PK - 03","TA",290,null,"ES",13,21]
["0330","Field Elementary School","03300012",null,"04 - 05","NT",297,null,"ES",15,24]
["0330","Woodland","03300015",null,"PK - 03","TA",264,null,"ES",13,21]
["0330","Weston Middle","03300305",null,"06 - 08","NT",491,null,"MS",26,42]
["0330","Weston High","03300505",null,"09 - 12","TA",700,null,"HS",31,50]
["0331","Alice A Macomber","03310015",null,"PK - 02","TA",318,null,"EES",90,144]
["0331","Westport Elementary","03310030",null,"03 - 06","TA",475,null,"ES",125,200]
["0331","Westport Junior/Senior High School","03310515",null,"07 - 12","NT",585,null,"MSHS/K-12",127,203]
["0332","Cowing Early Childhood","03320001",null,"PK","NT",0,null,"EES",0,0]
["0332","John Ashley","03320005",null,"K","SW",253,null,"EES",115,184]
["0332","Philip G Coburn","03320007",null,"K  - 05","SW",511,null,"ES",358,573]
["0332","John R Fausey","03320010",null,"K  - 05","NT",460,null,"ES",149,238]
["0332","Memorial","03320025",null,"01 - 05","SW",212,null,"ES",139,222]
["0332","Mittineague","03320030",null,"01 - 05","SW",169,null,"ES",63,101]
["0332","Tatham","03320040",null,"K  - 05","NT",259,null,"ES",84,134]
["0332","West Springfield Middle","03320305",null,"06 - 08","SW",902,null,"MS",404,646]
["0332","West Springfield High","03320505",null,"09 - 12","NT",1186,null,"HS",480,768]
["0335","Deerfield School","03350010",null,"K  - 05","NT",186,null,"ES",8,13]
["0335","Downey","03350012",null,"PK - 05","NT",287,null,"ES",21,34]
["0335","Paul Hanlon","03350015",null,"K  - 05","NT",229,null,"ES",13,21]
["0335","Martha Jones","03350017",null,"K  - 05","NT",283,null,"ES",9,14]
["0335","William E Sheehan","03350025",null,"K  - 05","NT",317,null,"ES",7,{"$f":"ROUND(J1412*1.6, 0)","v":11}]
["0335","Westwood Integrated Preschool","03350050",null,"PK","NT",0,null,"EES",0,0]
["0335","E W Thurston Middle","03350305",null,"06 - 08","NT",748,null,"MS",53,85]
["0335","Westwood High","03350505",null,"09 - 12","NT",1011,null,"HS",38,61]
["0336","Johnson Early Childhood Center","03360003",null,"PK","NT",0,null,"EES",0,0]
["0336","Academy Avenue","03360005",null,"K  - 04","NT",298,null,"ES",88,141]
["0336","Maria Weston Chapman Middle School","03360020",null,"06 - 08","TA",878,null,"MS",267,427]
["0336","Frederick C Murphy","03360050",null,"K  - 04","TA",219,null,"ES",65,104]
["0336","Thomas V Nash","03360060",null,"K  - 04","NT",174,null,"ES",46,74]
["0336","Lawrence W Pingree","03360065",null,"K  - 04","TA",191,null,"ES",54,86]
["0336","William Seach","03360080",null,"K  - 04","SW",323,null,"ES",189,302]
["0336","Ralph Talbot","03360085",null,"K  - 04","TA",241,null,"ES",71,114]
["0336","Thomas W. Hamilton Primary School","03360105",null,"K  - 04","NT",310,null,"ES",66,106]
["0336","Wessagusset","03360110",null,"K  - 04","NT",281,null,"ES",78,125]
["0336","Abigail Adams Middle School","03360310",null,"05 - 06","TA",892,null,"ES",265,424]
["0336","Weymouth High School","03360505",null,"09 - 12","NT",1847,null,"HS",451,722]
["0337","Whately Elementary","03370005",null,"PK - 06","NT",114,null,"ES",25,40]
["0340","Anne T. Dunphy School","03400020",null,"PK - 06","TA",137,null,"ES",32,51]
["0342","Boutwell","03420005",null,"PK - K","NT",99,null,"EES",6,10]
["0342","Wildwood","03420015",null,"PK - K","NT",127,null,"EES",11,18]
["0342","Woburn Street","03420020",null,"01 - 03","TA",418,null,"ES",42,67]
["0342","Shawsheen Elementary","03420025",null,"01 - 03","NT",365,null,"ES",38,61]
["0342","North Intermediate","03420060",null,"04 - 05","NT",268,null,"ES",29,46]
["0342","West Intermediate","03420080",null,"04 - 05","NT",237,null,"ES",19,30]
["0342","Wilmington Middle School","03420330",null,"06 - 08","NT",783,null,"MS",75,120]
["0342","Wilmington High","03420505",null,"09 - 12","NT",824,null,"HS",72,115]
["0343","Winchendon PreSchool Program","03430010",null,"PK","NT",0,null,"EES",0,0]
["0343","Memorial","03430040",null,"K  - 02","SW",301,null,"EES",134,214]
["0343","Toy Town Elementary","03430050",null,"03 - 05","SW",263,null,"ES",120,192]
["0343","Murdock Middle School","03430315",null,"06 - 08","SW",286,null,"MS",97,155]
["0343","Murdock Academy for Success","03430405",null,"09 - 12","SW",43,null,"HS",27,43]
["0343","Murdock High School","03430515",null,"09 - 12","SW",287,null,"HS",100,160]
["0344","Lincoln Elementary","03440005",null,"K  - 05","NT",431,null,"ES",10,16]
["0344","Lynch Elementary","03440020",null,"PK - 05","TA",488,null,"ES",33,53]
["0344","Vinson-Owen Elementary","03440025",null,"PK - 05","NT",419,null,"ES",10,16]
["0344","Muraco Elementary","03440040",null,"K  - 05","NT",374,null,"ES",19,30]
["0344","Ambrose Elementary","03440045",null,"K  - 05","NT",392,null,"ES",5,8]
["0344","McCall Middle","03440305",null,"06 - 08","NT",1103,null,"MS",57,91]
["0344","Winchester High School","03440505",null,"09 - 12","NT",1365,null,"HS",82,131]
["0346","William P. Gorman/Fort Banks Elementary","03460015",null,"PK - 02","SW",434,null,"EES",126,202]
["0346","Arthur T. Cummings Elementary School","03460020",null,"03 - 05","SW",449,null,"ES",127,203]
["0346","Winthrop Middle School","03460305",null,"06 - 08","SW",461,null,"MS",111,178]
["0346","Winthrop High School","03460505",null,"09 - 12","NT",595,null,"HS",129,206]
["0347","Goodyear Elementary School","03470005",null,"K  - 05","SW",311,null,"ES",106,170]
["0347","Hurld-Wyman Elementary School","03470020",null,"K  - 05","NT",383,null,"ES",72,115]
["0347","Linscott-Rumford","03470025",null,"K  - 05","SW",207,null,"ES",58,93]
["0347","Clyde Reeves","03470040",null,"PK - 05","NT",364,null,"ES",74,118]
["0347","Shamrock","03470043",null,"PK - 05","SW",225,null,"ES",91,146]
["0347","Malcolm White","03470055",null,"K  - 05","SW",313,null,"ES",116,186]
["0347","Mary D Altavesta","03470065",null,"K  - 05","SW",243,null,"ES",72,115]
["0347","John F Kennedy Middle School","03470405",null,"06 - 08","NT",475,null,"MS",134,214]
["0347","Daniel L Joyce Middle School","03470410",null,"06 - 08","NT",527,null,"MS",123,197]
["0347","Woburn High","03470505",null,"09 - 12","NT",1288,null,"HS",290,464]
["0348","Head Start","03480002",null,"PK","NT",0,null,"EES",0,0]
["0348","Belmont Street Community","03480020",null,"PK - 06","SW",533,null,"ES",430,688]
["0348","Wawecus Road School","03480026",null,"K  - 06","SW",150,null,"ES",92,147]
["0348","Woodland Academy","03480030",null,"K  - 06","SW",637,null,"ES",483,773]
["0348","Burncoat Street","03480035",null,"K  - 06","SW",309,null,"ES",241,386]
["0348","Canterbury","03480045",null,"PK - 06","SW",323,null,"ES",242,387]
["0348","Chandler Elementary Community","03480050",null,"K  - 06","SW",507,null,"ES",404,646]
["0348","Chandler Magnet","03480052",null,"PK - 06","SW",464,null,"ES",328,525]
["0348","City View","03480053",null,"PK - 06","SW",447,null,"ES",358,573]
["0348","Clark St Community","03480055",null,"PK - 06","SW",223,null,"ES",189,302]
["0348","Columbus Park","03480060",null,"PK - 06","SW",447,null,"ES",322,515]
["0348","Flagg Street","03480090",null,"K  - 06","SW",393,null,"ES",103,{"$f":"ROUND(J1476*1.6, 0)","v":165}]
["0348","Elm Park Community","03480095",null,"K  - 06","SW",464,null,"ES",371,594]
["0348","Goddard School/Science Technical","03480100",null,"PK - 06","SW",385,null,"ES",283,453]
["0348","Gates Lane","03480110",null,"PK - 06","SW",493,null,"ES",298,477]
["0348","Grafton Street","03480115",null,"K  - 06","SW",389,null,"ES",282,451]
["0348","Heard Street","03480136",null,"K  - 06","SW",281,null,"ES",127,203]
["0348","Jacob Hiatt Magnet","03480140",null,"PK - 06","SW",357,null,"ES",188,301]
["0348","Lake View","03480145",null,"K  - 06","SW",330,null,"ES",145,232]
["0348","Lincoln Street","03480160",null,"K  - 06","SW",247,null,"ES",205,328]
["0348","May Street","03480175",null,"K  - 06","SW",331,null,"ES",147,235]
["0348","Francis J McGrath Elementary","03480177",null,"K  - 06","SW",245,null,"ES",142,227]
["0348","Midland Street","03480185",null,"K  - 06","SW",221,null,"ES",82,131]
["0348","Nelson Place","03480200",null,"PK - 06","TA",510,null,"ES",165,264]
["0348","Norrback Avenue","03480202",null,"PK - 06","SW",513,null,"ES",254,406]
["0348","Quinsigamond","03480210",null,"PK - 06","SW",734,null,"ES",515,824]
["0348","Rice Square","03480215",null,"K  - 06","SW",486,null,"ES",306,490]
["0348","Roosevelt","03480220",null,"PK - 06","SW",640,null,"ES",283,453]
["0348","Worcester Arts Magnet School","03480225",null,"PK - 06","SW",376,null,"ES",118,189]
["0348","Tatnuck","03480230",null,"PK - 06","SW",388,null,"ES",186,298]
["0348","Thorndyke Road","03480235",null,"K  - 06","SW",369,null,"ES",191,306]
["0348","Union Hill School","03480240",null,"K  - 06","SW",415,null,"ES",316,506]
["0348","West Tatnuck","03480260",null,"PK - 06","SW",322,null,"ES",93,149]
["0348","Vernon Hill School","03480280",null,"PK - 06","SW",455,null,"ES",336,538]
["0348","University Pk Campus School","03480285",null,"07 - 12","TA",240,null,"MSHS/K-12",149,238]
["0348","Claremont Academy","03480350",null,"07 - 12","TA",541,null,"MSHS/K-12",355,568]
["0348","Burncoat Middle School","03480405",null,"07 - 08","TA",681,null,"MS",394,630]
["0348","Forest Grove Middle","03480415",null,"07 - 08","TA",971,null,"MS",443,709]
["0348","Worcester East Middle","03480420",null,"07 - 08","TA",763,null,"MS",516,826]
["0348","Sullivan Middle","03480423",null,"06 - 08","TA",893,null,"MS",562,899]
["0348","Burncoat Senior High","03480503",null,"09 - 12","TA",1071,null,"HS",609,974]
["0348","Doherty Memorial High","03480512",null,"09 - 12","TA",1509,null,"HS",631,1010]
["0348","North High","03480515",null,"09 - 12","TA",1209,null,"HS",771,1234]
["0348","South High Community","03480520",null,"09 - 12","TA",1355,null,"HS",814,1302]
["0348","Worcester Technical High","03480605",null,"09 - 12","TA",1414,null,"HS",614,982]
["0349","R. H. Conwell","03490010",null,"PK - 06","TA",58,null,"ES",20,32]
["0350","Delaney","03500003",null,"PK - 03","TA",476,null,"ES",49,78]
["0350","Charles E Roderick","03500010",null,"04 - 06","NT",437,null,"ES",45,72]
["0406","Smith Vocational and Agricultural High","04060705",null,"09 - 12","SW",484,null,"HS",160,256]
["0407","Dudley Street Neighborhood Charter School","04070405",null,"PK - 05","SW",225,null,"ES",134,214]
["0409","Alma del Mar Charter School","04090205",null,"K  - 08","SW",440,null,"ESMS",272,435]
["0410","Excel Academy Charter School","04100205",null,"05 - 12","SW",1289,null,"MSHS/K-12",554,886]
["0411","Boston Green Academy Horace Mann Charter School","04110305",null,"06 - 12","SW",461,null,"MSHS/K-12",265,424]
["0412","Academy Of the Pacific Rim Charter Public School","04120530",null,"05 - 12","SW",534,null,"MSHS/K-12",196,314]
["0413","Four Rivers Charter Public School","04130505",null,"07 - 12","TA",218,null,"MSHS/K-12",53,85]
["0414","Berkshire Arts and Technology Charter Public School","04140305",null,"06 - 12","SW",366,null,"MSHS/K-12",156,250]
["0416","Boston Preparatory Charter Public School","04160305",null,"06 - 12","SW",526,null,"MSHS/K-12",224,358]
["0417","Bridge Boston Charter School","04170205",null,"PK - 07","SW",299,null,"ESMS",185,296]
["0418","Christa McAuliffe Charter Public School","04180305",null,"06 - 08","TA",391,null,"MS",93,149]
["0419","Helen Y. Davis Leadership Academy Charter Public School","04190305",null,"06 - 08","SW",191,null,"MS",119,190]
["0420","Benjamin Banneker Charter Public School","04200205",null,"PK - 06","SW",324,null,"ES",145,232]
["0424","Boston Day and Evening Academy Charter School","04240505",null,"09 - 12","SW",365,null,"HS",218,349]
["0426","Community Day Charter Public School - Gateway","04260205",null,"PK - 07","SW",320,null,"ESMS",145,232]
["0428","Brooke Charter School","04280305",null,"K  - 11","SW",1842,null,"MSHS/K-12",820,1312]
["0429","KIPP Academy Lynn Charter School","04290010",null,"K,01 - 03, 05 -12","SW",1452,null,"MSHS/K-12",686,1098]
["0430","Advanced Math and Science Academy Charter School","04300305",null,"06 - 12","TA",972,null,"MSHS/K-12",63,101]
["0431","Community Day Charter Public School - R. Kingman Webster","04310205",null,"PK - 07","SW",318,null,"ESMS",165,264]
["0432","Cape Cod Lighthouse Charter School","04320530",null,"06 - 08","TA",243,null,"MS",45,72]
["0435","Innovation Academy Charter School","04350305",null,"05 - 12","TA",792,null,"MSHS/K-12",76,122]
["0436","Community Charter School of Cambridge","04360305",null,"06 - 12","SW",330,null,"MSHS/K-12",107,171]
["0437","City on a Hill Charter Public School Circuit Street","04370505",null,"09 - 12","SW",252,null,"HS",138,221]
["0438","Codman Academy Charter Public School","04380505",null,"PK - 12","SW",325,null,"MSHS/K-12",182,291]
["0439","Conservatory Lab Charter School","04390050",null,"PK - 08","SW",399,null,"ESMS",192,307]
["0440","Community Day Charter Public School - Prospect","04400205",null,"PK - 08","SW",379,null,"ESMS",201,322]
["0441","Sabis International Charter School","04410505",null,"K  - 12","SW",1574,null,"MSHS/K-12",591,{"$f":"ROUND(J1539*1.6, 0)","v":946}]
["0444","Neighborhood House Charter School","04440205",null,"PK - 10","SW",600,null,"MSHS/K-12",230,368]
["0445","Abby Kelley Foster Charter Public School","04450105",null,"K  - 12","SW",1421,null,"MSHS/K-12",523,837]
["0446","Foxborough Regional Charter School","04460550",null,"K  - 12","TA",1611,null,"MSHS/K-12",321,514]
["0447","Benjamin Franklin Classical Charter Public School","04470205",null,"K  - 08","TA",457,null,"ESMS",35,56]
["0449","Boston Collegiate Charter School","04490305",null,"05 - 12","SW",701,null,"MSHS/K-12",208,333]
["0450","Hilltown Cooperative Charter Public School","04500105",null,"K  - 08","TA",217,null,"ESMS",32,51]
["0452","Edward M. Kennedy Academy for Health Careers (Horace Mann Charter School)","04520505",null,"09 - 12","SW",378,null,"HS",206,330]
["0453","Holyoke Community Charter School","04530005",null,"K  - 08","SW",701,null,"ESMS",471,754]
["0454","Lawrence Family Development Charter School","04540205",null,"PK - 08","SW",674,null,"ESMS",371,594]
["0455","Hill View Montessori Charter Public School","04550050",null,"K  - 08","TA",306,null,"ESMS",57,91]
["0456","Lowell Community Charter Public School","04560050",null,"PK - 08","SW",766,null,"ESMS",378,605]
["0458","Lowell Middlesex Academy Charter School","04580505",null,"09 - 12","SW",92,null,"HS",64,102]
["0463","KIPP Academy Boston Charter School","04630205",null,"K  - 08","SW",595,null,"ESMS",375,600]
["0464","Marblehead Community Charter Public School","04640305",null,"04 - 08","TA",228,null,"ESMS",29,46]
["0466","Martha's Vineyard Charter School","04660550",null,"K  - 12","TA",178,null,"MSHS/K-12",60,96]
["0468","Ma Academy for Math and Science School","04680505",null,"11 - 12","NT",98,null,"HS",2,3]
["0469","MATCH Charter Public School","04690505",null,"PK - 12","SW",1162,null,"MSHS/K-12",659,1054]
["0470","Mystic Valley Regional Charter School","04700105",null,"K  - 12","NT",1575,null,"MSHS/K-12",281,450]
["0474","A North Central Charter Essential (District): Sizer School: A North Central Charter Essential School","04740505",null,"07 - 12","SW",359,null,"MSHS/K-12",121,194]
["0478","Francis W. Parker Charter Essential School","04780505",null,"07 - 12","NT",394,null,"MSHS/K-12",26,42]
["0479","Pioneer Valley Performing Arts Charter Public School","04790505",null,"07 - 12","TA",389,null,"MSHS/K-12",100,160]
["0480","UP Academy Charter School of Boston","04800405",null,"06 - 08","SW",501,null,"MS",328,525]
["0481","Boston Renaissance Charter Public School","04810550",null,"PK - 06","SW",822,null,"ES",407,651]
["0482","River Valley Charter School","04820050",null,"K  - 08","TA",288,null,"ESMS",24,38]
["0483","Rising Tide Charter Public School","04830305",null,"05 - 12","TA",652,null,"MSHS/K-12",68,109]
["0484","Roxbury Preparatory Charter School","04840505",null,"05 - 12","SW",1494,null,"MSHS/K-12",830,1328]
["0485","Salem Academy Charter School","04850485",null,"06 - 12","SW",482,null,"MSHS/K-12",143,229]
["0486","Seven Hills Charter School","04860105",null,"K  - 08","SW",666,null,"ESMS",383,613]
["0487","Prospect Hill Academy Charter School","04870550",null,"K  - 12","SW",1114,null,"MSHS/K-12",404,646]
["0488","South Shore Charter Public School","04880550",null,"K  - 12","TA",947,null,"MSHS/K-12",178,285]
["0489","Sturgis Charter Public School","04890505",null,"09 - 12","NT",840,null,"HS",100,160]
["0491","Atlantis Charter School","04910550",null,"K  - 12","SW",1287,null,"MSHS/K-12",541,866]
["0492","Martin Luther King Jr. Charter School of Excellence","04920005",null,"K  - 05","SW",367,null,"ES",262,419]
["0493","Phoenix Charter Academy","04930505",null,"09 - 12","SW",198,null,"HS",93,149]
["0494","Pioneer Charter School of Science","04940205",null,"K  - 12","SW",785,null,"MSHS/K-12",287,459]
["0496","Global Learning Charter Public School","04960305",null,"05 - 12","SW",503,null,"MSHS/K-12",258,413]
["0497","Pioneer Valley Chinese Immersion Charter School","04970205",null,"K  - 12","TA",513,null,"MSHS/K-12",85,136]
["0498","Veritas Preparatory Charter School","04980405",null,"05 - 08","SW",348,null,"MS",253,405]
["0499","Hampden Charter School of Science East","04990305",null,"06 - 12","SW",489,null,"MSHS/K-12",187,299]
["0600","Carol Huebner Early Childhood Program","06000001",null,"PK","NT",0,null,"EES",0,0]
["0600","Blanchard Memorial School","06000005",null,"K  - 06","NT",468,null,"ES",23,37]
["0600","Merriam School","06000010",null,"K  - 06","NT",492,null,"ES",27,43]
["0600","McCarthy-Towne School","06000015",null,"K  - 06","TA",519,null,"ES",43,69]
["0600","C.T. Douglas Elementary School","06000020",null,"K  - 06","NT",405,null,"ES",25,40]
["0600","Paul P Gates Elementary School","06000025",null,"K  - 06","TA",374,null,"ES",34,54]
["0600","Luther Conant School","06000030",null,"K  - 06","NT",450,null,"ES",34,54]
["0600","Raymond J Grey Junior High","06000405",null,"07 - 08","TA",926,null,"MS",50,80]
["0600","Acton-Boxborough Regional High","06000505",null,"09 - 12","NT",1823,null,"HS",100,160]
["0603","Hoosac Valley Elementary School","06030020",null,"PK - 03","SW",308,null,"ES",169,270]
["0603","Hoosac Valley Middle School","06030315",null,"04 - 07","SW",409,null,"ESMS",218,349]
["0603","Hoosac Valley High School","06030505",null,"08 - 12","NT",379,null,"MSHS/K-12",163,261]
["0605","Amherst Regional Middle School","06050405",null,"07 - 08","NT",405,null,"MS",108,173]
["0605","Amherst Regional High","06050505",null,"09 - 12","NT",915,null,"HS",201,322]
["0610","Westminster Elementary","06100005",null,"02 - 05","NT",392,null,"ES",64,102]
["0610","Meetinghouse School","06100010",null,"K  - 01","NT",188,null,"EES",30,48]
["0610","Briggs Elementary","06100025",null,"PK - 05","TA",473,null,"ES",69,110]
["0610","Overlook Middle School","06100305",null,"06 - 08","NT",573,null,"MS",81,130]
["0610","Oakmont Regional High School","06100505",null,"09 - 12","NT",648,null,"HS",90,144]
["0615","Athol Community Elementary School","06150020",null,"PK - 04","SW",521,null,"ES",294,470]
["0615","Royalston Community School","06150050",null,"K  - 06","TA",141,null,"ES",47,75]
["0615","Athol-Royalston Middle School","06150305",null,"05 - 08","SW",410,null,"MS",198,317]
["0615","Athol High","06150505",null,"09 - 12","SW",333,null,"HS",152,243]
["0616","Lura A. White Elementary School","06160001",null,"PK - 05","SW",333,null,"ES",72,115]
["0616","Page Hilltop Elementary School","06160002",null,"PK - 05","SW",507,null,"ES",147,{"$f":"ROUND(J1603*1.6, 0)","v":235}]
["0616","Ayer Shirley Regional Middle School","06160305",null,"06 - 08","SW",419,null,"MS",98,157]
["0616","Ayer Shirley Regional High School","06160505",null,"09 - 12","SW",386,null,"HS",84,134]
["0618","Muddy Brook Regional Elementary School","06180035",null,"PK - 04","SW",311,null,"ES",110,176]
["0618","Monument Valley Regional Middle School","06180310",null,"05 - 08","SW",340,null,"MS",108,173]
["0618","Monument Mt Regional High","06180505",null,"09 - 12","NT",523,null,"HS",108,173]
["0620","Tahanto Regional High","06200505",null,"06 - 12","TA",580,null,"MSHS/K-12",67,107]
["0622","John F Kennedy Elementary","06220008",null,"K  - 02","TA",269,null,"EES",76,122]
["0622","Millville Elementary","06220010",null,"PK - 05","TA",210,null,"ES",48,77]
["0622","A F Maloney","06220015",null,"03 - 05","TA",318,null,"ES",74,118]
["0622","Frederick W. Hartnett Middle School","06220405",null,"06 - 08","TA",416,null,"MS",88,141]
["0622","Blackstone Millville RHS","06220505",null,"09 - 12","NT",433,null,"HS",92,147]
["0625","Mitchell Elementary School","06250002",null,"PK - 03","TA",969,null,"ES",163,261]
["0625","Merrill Elementary School","06250020",null,"K  - 01","TA",332,null,"EES",68,109]
["0625","Laliberte Elementary School","06250050",null,"02 - 04","TA",513,null,"ES",94,150]
["0625","Williams Intermediate School","06250300",null,"04 - 06","TA",765,null,"ES",133,213]
["0625","Raynham Middle School","06250315",null,"05 - 08","NT",673,null,"MS",118,189]
["0625","Bridgewater Middle School","06250320",null,"07 - 08","NT",497,null,"MS",93,149]
["0625","Therapeutic Day School","06250415",null,"06 - 12","NT",17,null,"MSHS/K-12",11,18]
["0625","Bridgewater-Raynham Regional","06250505",null,"09 - 12","NT",1461,null,"HS",183,293]
["0632","New Hingham Regional Elementary","06320025",null,"PK - 06","NT",114,null,"ES",28,45]
["0635","Becket Washington School","06350005",null,"PK - 05","SW",105,null,"ES",33,53]
["0635","Craneville","06350025",null,"K  - 05","SW",399,null,"ES",135,216]
["0635","Kittredge","06350035",null,"PK - 05","SW",117,null,"ES",42,67]
["0635","Nessacus Regional Middle School","06350305",null,"06 - 08","SW",376,null,"MS",117,187]
["0635","Wahconah Regional High","06350505",null,"09 - 12","SW",528,null,"HS",119,190]
["0640","Concord Carlisle High","06400505",null,"09 - 12","TA",1268,null,"HS",66,106]
["0645","Ezra H Baker Innovation School","06450005",null,"PK - 03","SW",296,null,"ES",125,200]
["0645","Marguerite E Small Elementary","06450015",null,"PK - 03","SW",230,null,"ES",124,198]
["0645","Station Avenue Elementary","06450025",null,"K  - 03","SW",433,null,"ES",164,262]
["0645","N H Wixon Innovation School","06450050",null,"04 - 05","NT",510,null,"ES",226,362]
["0645","Mattacheese Middle School","06450305",null,"06 - 07","NT",453,null,"MS",207,331]
["0645","Dennis-Yarmouth Regional High","06450505",null,"08 - 12","NT",1002,null,"MSHS/K-12",355,568]
["0650","Dighton Elementary","06500005",null,"PK - 04","TA",473,null,"ES",84,134]
["0650","Palmer River","06500010",null,"PK - 04","TA",570,null,"ES",73,117]
["0650","Dighton Middle School","06500305",null,"05 - 08","NT",420,null,"MS",69,110]
["0650","Dorothy L Beckwith","06500310",null,"05 - 08","NT",576,null,"MS",96,154]
["0650","Dighton-Rehoboth Regional High School","06500505",null,"PK,09 - 12","NT",801,null,"HS",85,136]
["0655","Dover-Sherborn Regional Middle School","06550405",null,"06 - 08","TA",522,null,"MS",13,21]
["0655","Dover-Sherborn Regional High","06550505",null,"09 - 12","NT",672,null,"HS",24,38]
["0658","Dudley Elementary","06580005",null,"02 - 04","SW",379,null,"ES",109,174]
["0658","Mason Road School","06580010",null,"PK - 01","SW",237,null,"EES",81,130]
["0658","Charlton Elementary","06580020",null,"PK - 01","SW",285,null,"EES",64,102]
["0658","Heritage School","06580030",null,"02 - 04","SW",450,null,"ES",93,149]
["0658","Dudley Middle School","06580305",null,"05 - 08","SW",558,null,"MS",121,194]
["0658","Charlton Middle School","06580310",null,"05 - 08","NT",683,null,"MS",113,181]
["0658","Shepherd Hill Regional High","06580505",null,"09 - 12","NT",1100,null,"HS",185,296]
["0660","Nauset Regional Middle","06600305",null,"06 - 08","TA",567,null,"MS",116,186]
["0660","Nauset Regional High","06600505",null,"09 - 12","TA",934,null,"HS",174,278]
["0662","Farmington River Elementary","06620020",null,"PK - 06","TA",90,null,"ES",35,56]
["0665","Freetown Elementary School","06650001",null,"PK - 03","TA",380,null,"ES",90,144]
["0665","Assawompset Elementary School","06650002",null,"K  - 03","TA",473,null,"ES",80,128]
["0665","George R Austin Intermediate School","06650015",null,"04 - 06","TA",430,null,"ES",86,138]
["0665","Freetown-Lakeville Middle School","06650305",null,"06 - 08","NT",749,null,"MS",140,224]
["0665","Apponequet Regional High","06650505",null,"09 - 12","NT",726,null,"HS",89,142]
["0670","Frontier Regional","06700505",null,"07 - 12","TA",643,null,"MSHS/K-12",118,189]
["0672","Chester Elementary","06720059",null,"PK - 05","TA",109,null,"ES",42,67]
["0672","Littleville Elementary School","06720143",null,"PK - 05","NT",277,null,"ES",79,126]
["0672","Gateway Regional Middle School","06720405",null,"06 - 08","NT",200,null,"MS",64,102]
["0672","Gateway Regional High","06720505",null,"09 - 12","NT",192,null,"HS",47,75]
["0673","Boutwell School","06730001",null,"PK","NT",0,null,"EES",0,0]
["0673","Swallow/Union School","06730005",null,"K  - 04","NT",306,null,"ES",14,22]
["0673","Florence Roche School","06730010",null,"K  - 04","NT",544,null,"ES",48,77]
["0673","Groton Dunstable Regional Middle","06730305",null,"05 - 08","NT",734,null,"MS",46,74]
["0673","Groton Dunstable Regional","06730505",null,"09 - 12","NT",759,null,"HS",33,{"$f":"ROUND(J1667*1.6, 0)","v":53}]
["0674","Gill Elementary","06740005",null,"K  - 06","NT",121,null,"ES",35,56]
["0674","Hillcrest Elementary School","06740015",null,"PK - 01","SW",127,null,"EES",77,123]
["0674","Sheffield Elementary School","06740050",null,"02 - 05","SW",212,null,"ES",125,200]
["0674","Great Falls Middle","06740310",null,"06 - 08","NT",242,null,"MS",113,181]
["0674","Turners Fall High","06740505",null,"09 - 12","NT",198,null,"HS",79,126]
["0675","Bessie Buker Elementary","06750007",null,"K  - 05","TA",248,null,"ES",18,29]
["0675","Cutler School","06750010",null,"K  - 05","TA",284,null,"ES",15,24]
["0675","Winthrop School","06750015",null,"PK - 05","TA",250,null,"ES",23,37]
["0675","Miles River Middle","06750310",null,"06 - 08","NT",391,null,"MS",24,38]
["0675","Hamilton-Wenham Regional High","06750505",null,"09 - 12","NT",559,null,"HS",38,61]
["0680","Green Meadows Elementary","06800005",null,"PK - 08","TA",293,null,"ESMS",65,104]
["0680","Mile Tree Elementary","06800025",null,"PK - 01","NT",297,null,"EES",50,80]
["0680","Soule Road","06800030",null,"04 - 05","TA",341,null,"ES",59,94]
["0680","Stony Hill School","06800050",null,"02 - 03","TA",321,null,"ES",47,75]
["0680","Wilbraham Middle","06800310",null,"06 - 08","NT",614,null,"MS",82,131]
["0680","Minnechaug Regional High","06800505",null,"09 - 12","NT",1089,null,"HS",126,202]
["0683","Hampshire Regional High","06830505",null,"07 - 12","TA",717,null,"MSHS/K-12",92,147]
["0685","Hawlemont Regional","06850005",null,"PK - 06","SW",120,null,"ES",54,86]
["0690","King Philip Regional High","06900505",null,"09 - 12","NT",1286,null,"HS",94,150]
["0690","King Philip Middle School","06900510",null,"07 - 08","TA",731,null,"MS",82,131]
["0695","Lincoln-Sudbury Regional High","06950505",null,"09 - 12","TA",1507,null,"HS",78,125]
["0698","Manchester Memorial Elementary","06980010",null,"PK - 05","NT",316,null,"ES",16,26]
["0698","Essex Elementary","06980020",null,"K  - 05","TA",223,null,"ES",22,35]
["0698","Manchester Essex Regional Middle School","06980030",null,"06 - 08","TA",368,null,"MS",29,46]
["0698","Manchester Essex Regional High School","06980510",null,"09 - 12","NT",460,null,"HS",28,45]
["0700","Martha's Vineyard Regional High","07000505",null,"09 - 12","TA",626,null,"HS",162,259]
["0705","Masconomet Regional Middle School","07050405",null,"07 - 08","TA",639,null,"MS",42,67]
["0705","Masconomet Regional High School","07050505",null,"09 - 12","NT",1132,null,"HS",58,93]
["0710","Memorial School","07100001",null,"PK - 04","TA",457,null,"ES",49,78]
["0710","Miscoe Hill School","07100015",null,"05 - 08","TA",792,null,"MS",72,115]
["0710","Henry P Clough","07100179",null,"PK - 04","NT",343,null,"ES",23,37]
["0710","Nipmuc Regional High","07100510",null,"09 - 12","NT",649,null,"HS",58,93]
["0712","Chatham Elementary School","07120001",null,"PK - 04","SW",209,null,"ES",71,114]
["0712","Harwich Elementary School","07120002",null,"PK - 04","SW",508,null,"ES",133,213]
["0712","Monomoy Regional Middle School","07120315",null,"05 - 07","NT",459,null,"MS",120,192]
["0712","Monomoy Regional High School","07120515",null,"08 - 12","NT",638,null,"MSHS/K-12",152,243]
["0715","Lanesborough Elementary","07150005",null,"PK - 06","TA",188,null,"ES",39,62]
["0715","Williamstown Elementary","07150010",null,"PK - 06","TA",421,null,"ES",78,125]
["0715","Mt Greylock Regional High","07150505",null,"07 - 12","TA",543,null,"MSHS/K-12",74,118]
["0717","Buckland-Shelburne Regional","07170005",null,"PK - 06","TA",243,null,"ES",83,133]
["0717","Colrain Central","07170010",null,"PK - 06","SW",92,null,"ES",28,45]
["0717","Sanderson Academy","07170020",null,"PK - 06","TA",129,null,"ES",32,51]
["0717","Mohawk Trail Regional High","07170505",null,"07 - 12","NT",346,null,"MSHS/K-12",124,198]
["0720","Phillipston Memorial","07200003",null,"PK - 04","SW",93,null,"ES",39,62]
["0720","Baldwinville Elementary","07200005",null,"02 - 04","SW",284,null,"ES",85,136]
["0720","Templeton Center","07200020",null,"K  - 01","SW",179,null,"EES",50,80]
["0720","Narragansett Middle","07200305",null,"05 - 08","NT",476,null,"MS",142,227]
["0720","Narragansett Regional High","07200505",null,"09 - 12","NT",317,null,"HS",90,144]
["0725","Mary Rowlandson Elementary","07250010",null,"PK - 05","TA",436,null,"ES",81,130]
["0725","Center School","07250020",null,"PK - 05","NT",520,null,"ES",32,51]
["0725","Florence Sawyer School","07250025",null,"PK - 08","NT",701,null,"ESMS",45,72]
["0725","Luther Burbank Middle School","07250305",null,"06 - 08","TA",243,null,"MS",38,61]
["0725","Hale","07250310",null,"06 - 08","NT",281,null,"MS",16,26]
["0725","Nashoba Regional","07250505",null,"09 - 12","NT",964,null,"HS",48,77]
["0728","Swift River","07280015",null,"PK - 06","TA",132,null,"ES",42,67]
["0730","Algonquin Regional High","07300505",null,"09 - 12","TA",1436,null,"HS",82,131]
["0735","Squannacook Early Childhood Center","07350002",null,"PK - 04","NT",4,null,"EES",0,0]
["0735","Spaulding Memorial","07350005",null,"K  - 04","SW",430,null,"ES",99,158]
["0735","Ashby Elementary","07350010",null,"K  - 04","SW",173,null,"ES",43,69]
["0735","Hawthorne Brook","07350030",null,"05 - 08","NT",492,null,"MS",80,128]
["0735","Varnum Brook","07350035",null,"K  - 04","SW",538,null,"ES",101,162]
["0735","Nissitissit Middle School","07350310",null,"05 - 08","NT",523,null,"MS",89,142]
["0735","North Middlesex Regional","07350505",null,"09 - 12","NT",804,null,"HS",95,152]
["0740","Old Rochester Regional Jr High","07400405",null,"07 - 08","TA",435,null,"MS",50,{"$f":"ROUND(J1731*1.6, 0)","v":80}]
["0740","Old Rochester Regional High","07400505",null,"09 - 12","NT",764,null,"HS",86,138]
["0745","Elmer S Bagnall","07450005",null,"PK - 06","NT",459,null,"ES",52,83]
["0745","Helen R Donaghue School","07450010",null,"03 - 06","TA",230,null,"ES",40,64]
["0745","Dr John C Page School","07450015",null,"PK - 06","NT",328,null,"ES",26,42]
["0745","Dr Frederick N Sweetsir","07450020",null,"PK - 02","TA",185,null,"EES",25,40]
["0745","Pentucket Regional Middle","07450405",null,"07 - 08","NT",397,null,"MS",55,88]
["0745","Pentucket Regional Sr High","07450505",null,"09 - 12","NT",734,null,"HS",62,99]
["0750","Bernardston Elementary","07500006",null,"PK - 06","TA",147,null,"ES",45,72]
["0750","Pearl E Rhodes Elementary","07500007",null,"PK - 04","TA",26,null,"ES",10,16]
["0750","Northfield Elementary","07500008",null,"PK - 06","TA",166,null,"ES",32,51]
["0750","Warwick Community School","07500009",null,"PK - 06","TA",56,null,"ES",17,27]
["0750","Pioneer Valley Regional","07500505",null,"07 - 12","NT",318,null,"MSHS/K-12",52,83]
["0753","Hardwick Elementary","07530005",null,"K  - 06","TA",169,null,"ES",66,106]
["0753","Hubbardston Center","07530010",null,"K  - 06","NT",309,null,"ES",55,88]
["0753","New Braintree Grade","07530020",null,"K  - 01","NT",58,null,"EES",12,19]
["0753","Oakham Center","07530025",null,"02 - 06","NT",130,null,"ES",21,34]
["0753","Ruggles Lane","07530030",null,"PK - 06","TA",404,null,"ES",132,211]
["0753","Quabbin Regional Middle School","07530405",null,"07 - 08","NT",353,null,"MS",86,138]
["0753","Quabbin Regional High School","07530505",null,"09 - 12","NT",622,null,"HS",109,174]
["0755","Ralph C Mahar Regional","07550505",null,"07 - 12","SW",609,null,"MSHS/K-12",236,378]
["0755","Pathways Early College Innovation School","07550515",null,"11 - 12","NT",33,null,"HS",6,10]
["0755","The Gateway to College","07550525",null,"09, 11 - 12","NT",124,null,"HS",50,80]
["0760","Silver Lake Regional Middle School","07600405",null,"07 - 08","TA",509,null,"MS",99,158]
["0760","Silver Lake Regional High","07600505",null,"PK,09 - 12","TA",1116,null,"HS",147,235]
["0763","Somerset Berkley Regional High School","07630505",null,"09 - 12","TA",1029,null,"HS",132,211]
["0765","New Marlborough Central","07650018",null,"PK - 04","NT",65,null,"ES",18,29]
["0765","South Egremont","07650030",null,"K","NT",14,null,"EES",4,6]
["0765","Undermountain","07650035",null,"PK - 06","TA",267,null,"ES",100,160]
["0765","Mt Everett Regional","07650505",null,"07 - 12","NT",298,null,"MSHS/K-12",97,155]
["0766","Woodland School","07660010",null,"PK - 02","SW",296,null,"EES",86,138]
["0766","Powder Mill School","07660315",null,"03 - 06","SW",466,null,"ES",124,198]
["0766","Southwick Regional School","07660505",null,"07 - 12","NT",700,null,"MSHS/K-12",118,189]
["0767","East Brookfield Elementary","07670008",null,"PK - 06","TA",160,null,"ES",50,80]
["0767","Wire Village School","07670040",null,"K  - 04","SW",441,null,"ES",175,280]
["0767","Knox Trail Middle School","07670415",null,"05 - 08","TA",448,null,"MS",177,283]
["0767","David Prouty High","07670505",null,"09 - 12","NT",285,null,"HS",95,152]
["0770","Tantasqua Regional Jr High","07700405",null,"07 - 08","TA",588,null,"MS",120,192]
["0770","Tantasqua Regional Sr High","07700505",null,"09 - 12","TA",715,null,"HS",105,168]
["0770","Tantasqua Regional Vocational","07700605",null,"09 - 12","TA",475,null,"HS",115,184]
["0773","Salisbury Elementary","07730015",null,"PK - 06","SW",461,null,"ES",179,286]
["0773","Newbury Elementary","07730020",null,"PK - 06","NT",370,null,"ES",43,69]
["0773","Pine Grove","07730025",null,"PK - 06","NT",403,null,"ES",58,93]
["0773","Triton Regional Middle School","07730405",null,"07 - 08","NT",381,null,"MS",72,115]
["0773","Triton Regional High School","07730505",null,"09 - 12","NT",681,null,"HS",119,190]
["0774","Chilmark Elementary","07740010",null,"K  - 05","NT",54,null,"ES",8,13]
["0774","West Tisbury Elementary","07740020",null,"PK - 08","TA",339,null,"ESMS",78,125]
["0775","Early Childhood Center","07750001",null,"PK","NT",0,null,"EES",0,0]
["0775","Naquag Elementary School","07750005",null,"K  - 02","TA",317,null,"EES",38,61]
["0775","Davis Hill Elementary","07750018",null,"K  - 05","NT",457,null,"ES",48,77]
["0775","Dawson","07750020",null,"K  - 05","NT",477,null,"ES",50,80]
["0775","Houghton Elementary","07750027",null,"K  - 04","NT",364,null,"ES",42,67]
["0775","Leroy E.Mayo","07750032",null,"K  - 05","NT",483,null,"ES",46,74]
["0775","Paxton Center","07750040",null,"K  - 08","NT",455,null,"ESMS",49,78]
["0775","Thomas Prince","07750045",null,"K  - 08","NT",377,null,"ESMS",26,42]
["0775","Glenwood Elementary School","07750060",null,"03 - 05","TA",357,null,"ES",61,98]
["0775","Mountview Middle","07750305",null,"06 - 08","NT",823,null,"MS",74,118]
["0775","Central Tree Middle","07750310",null,"06 - 08","NT",385,null,"MS",33,53]
["0775","Chocksett Middle School","07750315",null,"05 - 08","NT",363,null,"MS",41,66]
["0775","Wachusett Regional High","07750505",null,"09 - 12","NT",2087,null,"HS",195,312]
["0778","Warren Elementary","07780005",null,"PK - 06","SW",395,null,"ES",168,269]
["0778","West Brookfield Elementary","07780010",null,"PK - 06","NT",272,null,"ES",87,139]
["0778","Quaboag Regional Middle Innovation School","07780305",null,"07 - 08","NT",222,null,"MS",75,120]
["0778","Quaboag Regional High","07780505",null,"09 - 12","NT",355,null,"HS",101,162]
["0780","Louise A Conley","07800010",null,"K  - 05","TA",529,null,"ES",108,{"$f":"ROUND(J1795*1.6, 0)","v":173}]
["0780","John H Duval","07800030",null,"K  - 05","TA",451,null,"ES",121,194]
["0780","Indian Head","07800035",null,"K  - 04","NT",512,null,"ES",81,130]
["0780","Whitman Middle","07800310",null,"06 - 08","TA",586,null,"MS",126,202]
["0780","Hanson Middle School","07800315",null,"05 - 08","NT",479,null,"MS",89,142]
["0780","Whitman Hanson Regional","07800505",null,"PK,09 - 12","NT",1161,null,"HS",207,331]
["0801","Assabet Valley Vocational High School","08010605",null,"09 - 12","TA",1120,null,"HS",282,451]
["0805","Blackstone Valley","08050605",null,"09 - 12","TA",1219,null,"HS",117,187]
["0806","Blue Hills Regional Vocational Technical","08060605",null,"09 - 12","SW",846,null,"HS",192,307]
["0810","Bristol-Plymouth Vocational Technical","08100605",null,"09 - 12","TA",1262,null,"HS",317,507]
["0815","Cape Cod Region Vocational Technical","08150605",null,"09 - 12","SW",568,null,"HS",223,357]
["0817","Essex North Shore Agricultural and Technical School","08170505",null,"09 - 12","TA",1391,null,"HS",248,397]
["0818","Franklin County Technical","08180605",null,"09 - 12","SW",484,null,"HS",158,253]
["0821","Diman Regional Vocational Technical High","08210605",null,"09 - 12","SW",1391,null,"HS",504,806]
["0823","Gr Lawrence Regional Vocational Technical","08230605",null,"09 - 12","SW",1541,null,"HS",820,1312]
["0825","Gr New Bedford Vocational Technical","08250605",null,"09 - 12","SW",2104,null,"HS",806,1290]
["0828","Gr Lowell Regional Vocational Technical","08280605",null,"09 - 12","SW",2187,null,"HS",955,1528]
["0829","Joseph P Keefe Technical High School","08290605",null,"09 - 12","SW",749,null,"HS",326,522]
["0830","Minuteman Regional High","08300605",null,"09 - 12","SW",513,null,"HS",104,166]
["0832","Montachusett Regional Vocational Technical","08320605",null,"09 - 12","TA",1403,null,"HS",323,517]
["0851","Charles McCann Vocational Technical","08510605",null,"09 - 12","SW",489,null,"HS",162,259]
["0852","Nashoba Valley Technical High School","08520605",null,"09 - 12","SW",684,null,"HS",124,198]
["0853","Northeast Metro Regional Vocational","08530605",null,"09 - 12","SW",1232,null,"HS",413,661]
["0855","Old Colony Regional Vocational Technical","08550605",null,"09 - 12","TA",543,null,"HS",94,150]
["0860","Pathfinder Vocational Technical","08600605",null,"09 - 12","SW",635,null,"HS",226,362]
["0871","Shawsheen Valley Vocational Technical High School","08710605",null,"09 - 12","TA",1275,null,"HS",186,298]
["0872","Southeastern Regional Vocational Technical","08720605",null,"09 - 12","SW",1435,null,"HS",469,750]
["0873","So Shore Vocational Technical High","08730605",null,"09 - 12","TA",633,null,"HS",151,242]
["0876","Bay Path Regional Vocational Technical High School","08760605",null,"09 - 12","TA",1115,null,"HS",252,403]
["0878","Tri-County Regional Vocational Technical","08780605",null,"09 - 12","TA",1008,null,"HS",186,298]
["0879","Upper Cape Cod Vocational Technical","08790605",null,"09 - 12","TA",699,null,"HS",174,278]
["0885","Whittier Regional Vocational","08850605",null,"09 - 12","SW",1237,null,"HS",353,565]
["0910","Bristol County Agricultural High","09100705",null,"09 - 12","TA",447,null,"HS",100,160]
["0915","Norfolk County Agricultural","09150705",null,"09 - 12","TA",550,null,"HS",63,101]
["3501","Paulo Freire Social Justice Charter School","35010505",null,"09 - 12","SW",288,null,"HS",233,373]
["3502","Baystate Academy Charter Public School","35020405",null,"06 - 12","SW",476,null,"MSHS/K-12",326,522]
["3503","Collegiate Charter School of Lowell","35030205",null,"K  - 08","SW",844,null,"ESMS",347,555]
["3504","City on a Hill Charter Public School Dudley Square","35040505",null,"09 - 12","SW",241,null,"HS",134,214]
["3505","UP Academy Charter School of Dorchester","35050405",null,"PK - 08","SW",666,null,"ESMS",404,646]
["3506","Pioneer Charter School of Science II (PCSS-II)","35060505",null,"07 - 12","SW",360,null,"MSHS/K-12",83,133]
["3507","City on a Hill Charter Public School New Bedford","35070505",null,"09 - 12","SW",199,null,"HS",134,214]
["3508","Phoenix Academy Public Charter High School Springfield","35080505",null,"09 - 12","SW",193,null,"HS",166,266]
["3509","Argosy Collegiate Charter School","35090305",null,"06 - 10","SW",454,null,"MSHS/K-12",255,408]
["3510","Springfield Preparatory Charter School","35100205",null,"K  - 04","SW",270,null,"ES",185,296]
["3511","Bentley Academy Charter School","35110205",null,"K  - 05","SW",335,null,"ES",221,354]
["3513","New Heights Charter School of Brockton","35130305",null,"06 - 10","SW",523,null,"MSHS/K-12",193,309]
["3514","Libertas Academy Charter School","35140305",null,"06 - 07","SW",165,null,"MS",125,200]
["3515","Old Sturbridge Academy Charter Public School","35150205",null,"K  - 04","SW",200,null,"ES",55,88]
["3516","Hampden Charter School of Science West","35160305",null,"06 - 09","SW",212,null,"MS",103,165]
["3517","Map Academy Charter School","35170505",null,"09 - 12","SW",128,null,"HS",63,101]
["3518","Phoenix Academy Public Charter High School Lawrence","35180505",null,"09 - 12","SW",136,null,"HS",90,144]
["3901","Greenfield Commonwealth Virtual School","39010900",null,"K  - 12","SW",580,null,"MSHS/K-12",287,459]
["3902","TEC Connections Academy Commonwealth Virtual School","39020900",null,"K  - 12","SW",2301,null,"MSHS/K-12",1030,1648]
["0207","Zervas","02070130",null,"K  - 05","NT",413,null,"ES",36,57.6]