{"text_format":"1","workbook":"xlsx","n_sheets":11,"sheets":["READ ME FIRST","1. Signature Page","2. Contact Information","3A. Expenditures Lines 1-6","3B. Expenditures Lines 7-11","4. Budget ","Schedule A","drop down","LiaisonList","DataDistrictList","DataLookupValues"],"not_rendered":{"charts":0,"images":0,"macros":1,"external_links":2,"defined_names":21,"comments":1,"pivot_tables":0},"unopened":[],"bounds":{"document_bytes":16777216,"sheet_cells":100000,"rows_first":2000,"rows_last":500,"rows_between":2000,"halvings":0,"cell_chars":16384,"cell_head_chars":4096},"cells_cut":0,"cells_raw":0,"read":"whole","date_system":"1900"}

{"sheet":"READ ME FIRST","index":0,"n_rows":30,"n_cols":2,"rows_kept":30,"cut":false,"hidden":false,"merged":[[24,1,24,12],[1,1,1,12],[16,1,23,12],[15,1,15,12],[2,1,2,12],[3,1,3,12],[4,1,12,12],[13,1,13,12],[14,1,14,12],[29,1,29,12],[28,1,28,12],[27,1,27,12],[26,1,26,12],[25,1,25,12]]}
[]
[null,"Massachusetts Department of Elementary & Secondary Education"]
[null,"FY20 Carl D. Perkins Career and Technical Education Secondary Application Workbook"]
[null,"Overview  "]
[null,"\nThis application allows LEAs (districts and other eligible entities, referred to in this application collectively as \"districts\") to apply for funding for the Perkins Secondary Allocation Grant.                                \n\n If you have questions, please refer to our Federal Grant Programs website and/or contact the Federal Programs Specialist assigned to your district for guidance.\n\n"]
[]
[]
[]
[]
[]
[]
[]
[]
[null,"First Step:  Saving the File"]
[null,"Save this file to your computer. Rename the file by replacing the words 'leacode' in the file name with your 4-digit district code, but keep the rest of the filename and the file extension (.xlsm) the same. For example, Abington (0001) would rename the file as 'FY20Perkins-0001.xlsm'. Users of Apple Macintosh computers must save as a macro-enabled file (with an .xlsm extension) for the workbook to function properly."]
{"$rows_left_out":16}
{"sheet":"1. Signature Page","index":1,"n_rows":28,"n_cols":17,"rows_kept":28,"cut":false,"hidden":false,"merged":[[25,1,27,3],[25,4,25,8],[25,9,25,15],[25,16,25,19],[26,4,27,8],[26,9,26,12],[26,13,26,15],[26,16,27,19],[27,9,27,12],[27,13,27,15],[20,1,20,4],[20,5,20,10],[20,12,20,13],[20,14,20,18],[21,1,21,4],[21,5,21,10],[21,12,21,13],[21,14,21,18],[17,1,18,19],[1,1,2,19],[4,1,4,19],[5,1,5,19],[10,5,10,11],[11,5,11,11]]}
[]
[null,"Massachusetts Department of Elementary and Secondary Education\nSTANDARD CONTRACT FORM AND APPLICATION FOR PROGRAM GRANTS"]
[]
[]
[null,"UPLOAD A SCANNED, SIGNED COPY OF THIS PAGE WITH THE DATE OF SUBMISSION TO EDGRANTS WITH THE BUDGET "]
[null,"District staff with the role of “control user” in EdGrants have been provided user log-in names and passwords and have been trained to submit a grant application via EdGrants. Provide all required application materials to your district control user with access to EdGrants to submit budgets and attachments  for each fund code for which the district is applying.                                                              \n                 Applications are due by September 27, 2019"]
[]
[]
[null,null,null,"District Name:",null,null,null,null,null,null,null,null,"Org Code:",null,{"$f":"valorg4code","v":"Org "}]
[]
[null,null,null,"Address: ",null,{"$f":"valAddr1","v":"Address 1"},null,null,null,null,null,null,"DESE Federal Grant Liaison",null,{"$f":"valname","v":"Liaison's Name"}]
[null,null,null,null,null,{"$f":"valCtyStZip","v":"Town, State Zip"},null,null,null,null,null,null,"Phone number:",null,{"$f":"valphonenum","v":"Liaison's Number"}]
[null,null,null,null,null,null,null,null,null,null,null,null,"Email:",null,{"$f":"valemail","v":"Liaison's Email"}]
[]
[]
{"$rows_left_out":14}
{"sheet":"2. Contact Information","index":2,"n_rows":18,"n_cols":5,"rows_kept":18,"cut":false,"hidden":false,"merged":[[7,2,7,11],[8,2,8,11],[9,1,9,3],[9,4,9,11],[1,1,1,3],[3,1,3,11],[4,1,4,11],[5,1,5,3],[5,4,5,11],[6,1,6,2],[6,3,6,11],[15,2,15,11],[16,2,16,11],[17,1,17,3],[17,4,17,11],[12,1,12,11],[13,1,13,3],[13,4,13,11],[14,1,14,2],[14,3,14,11]]}
[]
[null,{"$f":"DataLookupValues!B7","v":"Org Name"}]
[]
[null,"District Contact Information by Program\nPlease provide information for primary district contact for each program"]
[null,"Perkins Secondary Allocation Grant (Fund Code 400)"]
[null,"Name of Primary Contact:"]
[null,"Title:"]
[null,"Phone:"]
[null,"Email:"]
[null,"New to this program?  (Y/N)",null,null,"Select One"]
[]
[]
[null,"Business Office Contact (for fiscal information, if different from above)"]
[null,"Name of Primary Contact:"]
[null,"Title:"]
{"$rows_left_out":4}
{"sheet":"3A. Expenditures Lines 1-6","index":3,"n_rows":45,"n_cols":12,"rows_kept":45,"cut":false,"hidden":false,"merged":[[44,6,44,9],[42,6,42,9],[43,6,43,9],[18,5,20,5],[21,5,24,5],[25,5,27,5],[28,5,31,5],[32,5,35,5],[40,6,40,9],[41,6,41,9],[1,2,1,5],[3,5,3,6],[37,4,39,4],[37,5,38,9],[39,6,39,9],[4,5,7,8]]}
[]
[null,null,{"$f":"valDistrName","v":"Org Name"}]
[]
[null,null,null,null,null,"Expenditures (Lines 1-6)"]
[null,null,null,null,null,"For each expenditure in each line, complete steps 3.1 though 3.6. \nAll information for the individual expenditure will be correlated across the table.\nLines 1-6 are on this tab; Line 7-11 are on the following tab. \nBoth tabs need to be completed and expenditures should match the items on the Budget tab."]
[]
[]
[]
[]
[]
[]
[]
[]
[]
[]
{"$rows_left_out":31}
{"sheet":"3B. Expenditures Lines 7-11","index":4,"n_rows":50,"n_cols":10,"rows_kept":50,"cut":false,"hidden":false,"merged":[[42,1,44,1],[42,2,43,6],[44,3,44,6],[45,3,45,6],[3,3,3,4],[4,3,7,6],[20,3,24,3],[25,3,29,3],[30,3,33,3],[46,3,46,6],[47,3,47,6],[48,3,48,6],[49,3,49,6],[34,3,40,3]]}
[]
[null,{"$f":"valDistrName","v":"Org Name"}]
[]
[null,null,null,"Expenditures (Lines 7-11)"]
[null,null,null,"For each expenditure in each line, complete steps 3.1 though 3.6. \nAll information for the individual expenditure will be correlated across the table.\nLines 7-11 are on this tab; Line 1-6 are on the prior tab. \nBoth tabs need to be completed and expenditures should match the items on the Budget tab."]
[]
[]
[]
[]
[]
[]
[]
[]
[]
[]
{"$rows_left_out":36}
{"sheet":"4. Budget ","index":5,"n_rows":133,"n_cols":34,"rows_kept":133,"cut":false,"hidden":false,"merged":[[84,8,84,11],[13,1,16,1],[102,3,102,11],[89,19,89,20],[90,4,90,10],[90,19,90,20],[91,4,91,10],[91,19,91,20],[97,19,97,20],[82,3,82,11],[85,9,85,10],[86,9,86,10],[89,4,89,11],[78,19,78,20],[79,4,79,10],[79,19,79,20],[80,4,80,10],[80,19,80,20],[81,4,81,10],[81,19,81,20],[72,4,72,10],[72,19,72,20],[73,3,73,11],[75,19,75,20],[76,4,76,10],[76,19,76,20],[77,4,77,10],[77,19,77,20],[78,4,78,10],[61,19,61,20],[62,4,62,10],[62,19,62,20],[63,4,63,10],[63,19,63,20],[64,4,64,10],[64,19,64,20],[65,4,65,10],[65,19,65,20],[66,4,66,6],[68,4,68,10],[68,19,68,20],[69,4,69,10],[69,19,69,20],[70,4,70,10],[70,19,70,20],[71,4,71,10],[71,19,71,20],[56,19,56,20],[57,4,57,7],[57,19,57,20],[58,4,58,7],[58,19,58,20],[59,3,59,11],[50,3,50,11],[52,19,52,20],[53,4,53,7],[53,19,53,20],[54,4,54,7],[54,19,54,20],[55,4,55,7],[55,19,55,20],[56,4,56,7],[47,4,47,11],[47,19,47,20],[48,4,48,11],[48,19,48,20],[49,4,49,11],[49,19,49,20],[41,4,41,7],[41,19,41,20],[42,3,42,11],[43,3,43,7],[44,4,44,11],[44,19,45,20],[45,4,45,11],[46,4,46,11],[46,19,46,20],[35,3,35,11],[36,3,36,7],[37,19,37,20],[38,4,38,7],[38,19,38,20],[39,4,39,7],[39,19,39,20],[40,4,40,7],[40,19,40,20],[32,4,32,7],[32,19,32,20],[33,4,33,7],[33,19,33,20],[34,4,34,7],[34,19,34,20],[28,4,28,7],[28,19,28,20],[29,3,29,11],[29,19,29,20],[30,3,30,7],[31,4,31,7],[31,19,31,20],[26,19,26,20],[27,4,27,7],[27,19,27,20],[19,4,19,7],[19,19,19,20],[20,19,20,20],[21,3,21,7],[22,19,22,20],[23,4,23,7],[23,19,23,20],[24,4,24,7],[24,19,24,20],[120,10,120,20],[120,24,120,27],[121,5,121,6],[121,7,121,8],[121,10,121,20],[121,24,121,27],[2,2,2,10],[3,19,3,20],[4,2,4,20],[6,3,7,5],[6,6,7,7],[7,8,7,9],[7,10,7,11],[14,3,14,11],[14,19,14,20],[16,4,16,7],[16,19,16,20],[17,4,17,7],[17,19,17,20],[18,4,18,7],[18,19,18,20],[25,4,25,7],[25,19,25,20],[26,4,26,7],[122,5,122,6],[122,7,122,8],[122,10,122,20],[122,24,122,27],[123,5,123,6],[123,7,123,8],[123,10,123,20],[123,24,123,27],[124,5,124,6],[124,7,124,8],[124,10,124,20],[124,24,124,27],[125,5,125,6],[125,7,125,8],[125,10,125,20],[125,24,125,27],[126,5,126,6],[126,7,126,8],[126,10,126,20],[126,24,126,27],[127,5,127,6],[127,7,127,8],[127,10,127,20],[127,24,127,27],[128,5,128,6],[128,7,128,8],[128,10,128,20],[128,24,128,27],[129,5,129,6],[129,7,129,8],[129,10,129,20],[129,24,129,27],[130,5,130,6],[130,7,130,8],[130,10,130,20],[130,24,130,27],[131,5,131,6],[131,7,131,8],[131,10,131,20],[131,24,131,27],[132,5,132,6],[132,7,132,8],[132,11,133,21],[111,3,112,31],[110,1,111,1],[110,3,110,31],[113,3,113,10],[115,23,115,30],[116,23,116,30],[117,5,118,6],[117,7,118,8],[117,10,118,20],[117,24,118,27],[117,29,118,29],[119,5,119,6],[119,7,119,8],[119,10,119,20],[119,24,119,27],[120,5,120,6],[120,7,120,8],[95,19,95,20],[96,19,96,20],[94,19,94,20],[93,19,93,20],[92,19,92,20],[92,4,92,10],[93,4,93,10],[94,4,94,10],[95,4,95,10],[96,4,96,10]]}
[]
[]
[null,null,{"$f":"DataLookupValues!B7","v":"Org Name"}]
[]
[null,null,"FY20 Perkins Secondary Allocation Budget Worksheet"]
[]
[null,null,null,"Allocation \n",null,null,{"$f":"valAllocPerk","v":0}]
[]
[]
[null,null,null,null,null,null,null,null,null,null,"Bellingham",null,null,null,null,null,null,"Bellingham (0025)"]
[null,null,null,null,null,null,null,null,null,"Bellingham"]
[]
[]
[null,"Step 4.1\nAll Districts"]
[null,null,null,"Line Item Category: Select an option from the drop down menu.",null,null,null,null,null,null,null,null,null,"Amount",null,"Expenditures \n(whole numbers)",null,"Primary Function",null,"Comments"]
{"$rows_left_out":119}
{"sheet":"Schedule A","index":6,"n_rows":44,"n_cols":12,"rows_kept":44,"cut":false,"hidden":false,"merged":[[80,6,81,8],[80,9,81,11],[81,1,81,5],[83,1,84,11],[78,1,78,5],[78,6,78,8],[78,9,78,11],[79,1,79,5],[79,6,79,8],[79,9,79,11],[76,1,76,5],[76,6,76,8],[76,9,76,11],[77,1,77,5],[77,6,77,8],[77,9,77,11],[74,1,74,5],[74,6,74,8],[74,9,74,11],[75,1,75,5],[75,6,75,8],[75,9,75,11],[72,1,72,5],[72,6,72,8],[72,9,72,11],[73,1,73,5],[73,6,73,8],[73,9,73,11],[70,1,70,5],[70,6,70,8],[70,9,70,11],[71,1,71,5],[71,6,71,8],[71,9,71,11],[68,1,68,5],[68,6,68,8],[68,9,68,11],[69,1,69,5],[69,6,69,8],[69,9,69,11],[66,1,66,5],[66,6,66,8],[66,9,66,11],[67,1,67,5],[67,6,67,8],[67,9,67,11],[64,1,64,5],[64,6,64,8],[64,9,64,11],[65,1,65,5],[65,6,65,8],[65,9,65,11],[61,1,62,5],[61,6,62,8],[61,9,62,11],[63,1,63,5],[63,6,63,8],[63,9,63,11],[56,1,57,1],[56,2,57,4],[56,5,57,10],[56,11,57,11],[58,1,59,1],[58,2,59,4],[58,5,59,10],[58,11,59,11],[43,1,44,11],[49,1,49,11],[50,1,50,11],[52,1,52,11],[54,1,55,1],[54,2,55,11],[39,1,39,5],[39,6,39,8],[39,9,39,11],[40,6,41,8],[40,9,41,11],[41,1,41,5],[37,1,37,5],[37,6,37,8],[37,9,37,11],[38,1,38,5],[38,6,38,8],[38,9,38,11],[35,1,35,5],[35,6,35,8],[35,9,35,11],[36,1,36,5],[36,6,36,8],[36,9,36,11],[33,1,33,5],[33,6,33,8],[33,9,33,11],[34,1,34,5],[34,6,34,8],[34,9,34,11],[31,1,31,5],[31,6,31,8],[31,9,31,11],[32,1,32,5],[32,6,32,8],[32,9,32,11],[29,1,29,5],[29,6,29,8],[29,9,29,11],[30,1,30,5],[30,6,30,8],[30,9,30,11],[27,1,27,5],[27,6,27,8],[27,9,27,11],[28,1,28,5],[28,6,28,8],[28,9,28,11],[25,1,25,5],[25,6,25,8],[25,9,25,11],[26,1,26,5],[26,6,26,8],[26,9,26,11],[23,1,23,5],[23,6,23,8],[23,9,23,11],[24,1,24,5],[24,6,24,8],[24,9,24,11],[18,1,19,1],[18,2,19,4],[18,5,19,10],[18,11,19,11],[21,1,22,5],[21,6,22,8],[21,9,22,11],[2,2,2,10],[3,2,6,10],[9,1,9,11],[10,1,10,11],[12,1,12,11],[14,1,15,1],[14,2,15,11],[16,1,17,1],[16,2,17,4],[16,5,17,10],[16,11,17,11]]}
[]
[]
[null,null,"Instructions:\n\n "]
[null,null,"Fill out and print a Schedule A if  Perkins Fund Code 400 funds \nare assigned to your district from other grant recipients, and your district (agency) is operator/administrator.              \n"]
[]
[]
[]
[]
[]
[null,"MASSACHUSETTS DEPARTMENT OF ELEMENTARY AND SECONDARY EDUCATION"]
[null,"STANDARD APPLICATION FOR PROGRAM GRANTS"]
[]
[null,"FY20 SCHEDULE A - Assignment Schedule"]
[]
[null,1,"Schedule A is to be completed if the applicant agency operates and administers a grant project using funds from more than one grant recipient."]
{"$rows_left_out":30}
{"sheet":"drop down","index":7,"n_rows":70,"n_cols":7,"rows_kept":70,"cut":false,"hidden":true,"merged":[]}
["per day",null,null,"Select One",null,"Budget Categories","Primary Functions "]
["per hour",null,null,"yes ",null,"Administrator Salaries","Select One"]
["flat",null,null,"no",null,"Select One","1R"]
[null,null,null,null,null,"Grant Program Manager/Coordinator ","2R"]
[null,null,null,null,null,"Other ","3R"]
[null,null,null,null,null,"InstructionalProf Staff Salaries","4R"]
[null,null,null,null,null,"Select One","5R"]
[null,null,null,null,null,"Classroom Teachers  ","6R"]
[null,null,null,null,null,"Instructional Coaches "]
[null,null,null,null,null,"Certified Specialist Teachers (providing individualized instruction)  "]
[null,null,null,null,null,"Instructional Coordinators and Team Leaders  "]
[null,null,null,null,null,"Medical / Therapeutic Services "]
[null,null,null,null,null,"Librarians and Media Center Directors "]
[null,null,null,null,null,"Professional Development Directors/Coordinators  "]
[null,null,null,null,null,"Guidance or School Adjustment Counselors, Social Workers  "]
{"$rows_left_out":56}
{"sheet":"LiaisonList","index":8,"n_rows":8,"n_cols":4,"rows_kept":8,"cut":false,"hidden":true,"merged":[]}
["Aneesh Sahni","781-338-3532","aneesh.sahni@doe.mass.edu","Aneesh Sahni"]
["Alex Lilley","781-338-6212","alilley@doe.mass.edu","Alex Lilley"]
["Beth O'Connell","781-338-3132","EO'Connell@doe.mass.edu","Beth O'Connell"]
["Nancy Labrie","781-338-3536","nlabrie@doe.mass.edu","Nancy Labrie"]
["Ellie Rounds-Bloom","781-338-3128","erounds-bloom@doe.mass.edu","Ellie Rounds-Bloom"]
["Julia Foodman","781-338-3577","jfoodman@doe.mass.edu","Julia Foodman"]
["Russ Fleming","781-338-6529","RFleming@doe.mass.edu","Russ Fleming"]
["Sue Mazzarella","781-338-3587","smazzarella@doe.mass.edu","Sue Mazzarella"]

{"sheet":"DataDistrictList","index":9,"n_rows":84,"n_cols":19,"rows_kept":84,"cut":false,"hidden":true,"merged":[]}
[1,"Org Code","Org Name","Org Type","Function","Contact Name","Address 1","Address 2","Town","State","Zip","Liaison's Name","Liaison's Number","Liaison's Email","March EL Count (18c)","March Enrolled Count"]
[2,"08010000","Assabet Valley Regional Vocational Technical","Public School District","Superintendent","Ernest Houle","215 Fitchburg Street",null,"Marlborough","MA","01752",{"$f":"VLOOKUP(N2, LiaisonList!$C$1:$D$8, 2, FALSE)","v":"Ellie Rounds-Bloom"},"781-338-3128","erounds-bloom@doe.mass.edu",28,1103,{"$f":"IF(L2=\"djwalker@doe.mass.edu\", \"nlabrie@doe.mass.edu\", \" \")","v":" "},{"$f":"IF(Q2=\"nlabrie@doe.mass.edu\", \"781-338-3536\",\"\")","v":""}]
[3,"00160000","Attleboro","Public School District","Superintendent","David Sawyer","100 Rathbun Willard Drive",null,"Attleboro","MA","02703",{"$f":"VLOOKUP(N3, LiaisonList!$C$1:$D$8, 2, FALSE)","v":"Ellie Rounds-Bloom"},"781-338-3128","erounds-bloom@doe.mass.edu",381,5791,{"$f":"IF(L3=\"djwalker@doe.mass.edu\", \"nlabrie@doe.mass.edu\", \" \")","v":" "},{"$f":"IF(Q3=\"nlabrie@doe.mass.edu\", \"781-338-3536\",\"\")","v":""}]
[4,"00200000","Barnstable","Public School District","Superintendent","Meg Mayo-Brown","P O Box 955",null,"Hyannis","MA","02601",{"$f":"VLOOKUP(N4, LiaisonList!$C$1:$D$8, 2, FALSE)","v":"Beth O'Connell"},"781-338-3132","EO'Connell@doe.mass.edu",471,4728,{"$f":"IF(L4=\"djwalker@doe.mass.edu\", \"nlabrie@doe.mass.edu\", \" \")","v":" "},{"$f":"IF(Q4=\"nlabrie@doe.mass.edu\", \"781-338-3536\",\"\")","v":""}]
[5,"00300000","Beverly","Public School District","Superintendent","Steven Hiersche","70 Balch St.",null,"Beverly","MA","01915",{"$f":"VLOOKUP(N5, LiaisonList!$C$1:$D$8, 2, FALSE)","v":"Nancy Labrie"},{"$f":"IF(N5=\"nlabrie@doe.mass.edu\", \"781-338-3536\",\"\")","v":"781-338-3536"},"nlabrie@doe.mass.edu",171,4385]
[6,"08050000","Blackstone Valley Regional Vocational Technical","Public School District","Superintendent","Michael Fitzpatrick","65 Pleasant Street",null,"Upton","MA","01568",{"$f":"VLOOKUP(N6, LiaisonList!$C$1:$D$8, 2, FALSE)","v":"Aneesh Sahni"},"781-338-3532","aneesh.sahni@doe.mass.edu",3,1220,{"$f":"IF(L6=\"djwalker@doe.mass.edu\", \"nlabrie@doe.mass.edu\", \" \")","v":" "},{"$f":"IF(Q6=\"nlabrie@doe.mass.edu\", \"781-338-3536\",\"\")","v":""}]
[7,"08060000","Blue Hills Regional Vocational Technical","Public School District","Superintendent","James Quaglia","800 Randolph Street",null,"Canton","MA","02021",{"$f":"VLOOKUP(N7, LiaisonList!$C$1:$D$8, 2, FALSE)","v":"Nancy Labrie"},{"$f":"IF(N7=\"nlabrie@doe.mass.edu\", \"781-338-3536\",\"\")","v":"781-338-3536"},"nlabrie@doe.mass.edu",4,842]
[8,"00350000","Boston","Public School District","Superintendent","Tommy Chang","2300 Washington Street",null,"Roxbury","MA","02119",{"$f":"VLOOKUP(N8, LiaisonList!$C$1:$D$8, 2, FALSE)","v":"Julia Foodman"},"781-338-3577","jfoodman@doe.mass.edu",15445,49775,{"$f":"IF(L8=\"djwalker@doe.mass.edu\", \"nlabrie@doe.mass.edu\", \" \")","v":" "},{"$f":"IF(Q8=\"nlabrie@doe.mass.edu\", \"781-338-3536\",\"\")","v":""}]
[9,"09100000","Bristol County Agricultural","Public School District","Superintendent","Adele Sands","135 Center Street",null,"Dighton","MA","02715",{"$f":"VLOOKUP(N9, LiaisonList!$C$1:$D$8, 2, FALSE)","v":"Nancy Labrie"},{"$f":"IF(N9=\"nlabrie@doe.mass.edu\", \"781-338-3536\",\"\")","v":"781-338-3536"},"nlabrie@doe.mass.edu",0,457]
[10,"08100000","Bristol-Plymouth Regional Vocational Technical","Public School District","Superintendent","Alexandre Magalhaes","207 Hart Street",null,"Taunton","MA","02780",{"$f":"VLOOKUP(N10, LiaisonList!$C$1:$D$8, 2, FALSE)","v":"Russ Fleming"},"781-338-6529","RFleming@doe.mass.edu",3,1247,{"$f":"IF(L10=\"djwalker@doe.mass.edu\", \"nlabrie@doe.mass.edu\", \" \")","v":" "},{"$f":"IF(Q10=\"nlabrie@doe.mass.edu\", \"781-338-3536\",\"\")","v":""}]
[11,"00440000","Brockton","Public School District","Superintendent","Kathleen Smith","43 Crescent Street",null,"Brockton","MA","02301",{"$f":"VLOOKUP(N11, LiaisonList!$C$1:$D$8, 2, FALSE)","v":"Sue Mazzarella"},"781-338-3587","smazzarella@doe.mass.edu",4161,16527," ",""]
[12,"00460000","Brookline","Public School District","Superintendent","Andrew Bott","333 Washington Street",null,"Brookline","MA","02445",{"$f":"VLOOKUP(N12, LiaisonList!$C$1:$D$8, 2, FALSE)","v":"Julia Foodman"},"781-338-3577","jfoodman@doe.mass.edu",808,7493," ",""]
[13,"00490000","Cambridge","Public School District","Superintendent","Kenneth Salim","159 Thorndike Street",null,"Cambridge","MA","02141",{"$f":"VLOOKUP(N13, LiaisonList!$C$1:$D$8, 2, FALSE)","v":"Alex Lilley"},"781-338-6212","alilley@doe.mass.edu",577,6357," ",""]
[14,"08150000","Cape Cod Regional Vocational Technical","Public School District","Superintendent","Robert Sanborn","351 Pleasant Lake Avenue",null,"Harwich","MA","02645",{"$f":"VLOOKUP(N14, LiaisonList!$C$1:$D$8, 2, FALSE)","v":"Julia Foodman"},"781-338-3577","jfoodman@doe.mass.edu",9,580," ",""]
[15,"06350000","Central Berkshire","Public School District","Superintendent","Laurie Casna","PO Box 299","Rt 8","Dalton","MA","01227",{"$f":"VLOOKUP(N15, LiaisonList!$C$1:$D$8, 2, FALSE)","v":"Alex Lilley"},"781-338-6212","alilley@doe.mass.edu",8,1546," ",""]
{"$rows_left_out":70}
{"sheet":"DataLookupValues","index":10,"n_rows":24,"n_cols":6,"rows_kept":24,"cut":false,"hidden":true,"merged":[]}
["Workbook Information"]
["Fiscal Year","FY18","Fundcode:",305]
["Title full name","I, Part A"]
["Title abbreviated","I"]
["District Information"]
["District value",1,null,null,"Liasons"]
["District Name:",{"$f":"VLOOKUP(valDistr,dataDistr,3,FALSE)","v":"Org Name"},"district code",{"$f":"LEFT(VLOOKUP(valDistr,dataDistr,2,FALSE),4)","v":"Org "},"Name",{"$f":"VLOOKUP(valDistr,dataDistr,12,FALSE)","v":"Liaison's Name"}]
["Address1",{"$f":"VLOOKUP(valDistr,dataDistr,7,FALSE)","v":"Address 1"},null,null,"Phone",{"$f":"VLOOKUP(valDistr,dataDistr,13,FALSE)","v":"Liaison's Number"}]
["Address2",{"$f":"IF(VLOOKUP(valDistr,dataDistr,8,FALSE)=0,\"\",VLOOKUP(valDistr,dataDistr,8,FALSE))","v":"Address 2"},null,null,"Email",{"$f":"VLOOKUP(valDistr,dataDistr,14,FALSE)","v":"Liaison's Email"}]
["City, State, ZIP",{"$f":"VLOOKUP(valDistr,dataDistr,9,FALSE)&\", \"&VLOOKUP(valDistr,dataDistr,10,FALSE)&\" \"&VLOOKUP(valDistr,dataDistr,11,FALSE)","v":"Town, State Zip"}]
["District Enrollment",{"$f":"VLOOKUP(valDistr,dataDistr,16,FALSE)","v":"March Enrolled Count"},"EL Enrollment",{"$f":"VLOOKUP(valDistr,dataDistr,15,FALSE)","v":"March EL Count (18c)"}]
["Low Inc Methods TI"]
["SELECT ONE",null,"TitleI Status"]
["Oct Eco Dis",null,1]
["Oct Eco Dis x 1.6",null,2,"SW"]
{"$rows_left_out":9}