{"text_format":"1","workbook":"xlsx","n_sheets":15,"sheets":["READ ME FIRST","1. Signature Page","2. Contact Information","3A. Expenditures Lines 1-6","3B. Expenditures Lines 7-11","4. Budget","5. ISA crosswalk","Schedule A","LiasionList","dropdown","DataDistrictList","DataLookupValues","drop down","liaison","district list"],"not_rendered":{"charts":0,"images":0,"macros":0,"external_links":2,"defined_names":27,"comments":0,"pivot_tables":0},"unopened":[],"bounds":{"document_bytes":16777216,"sheet_cells":100000,"rows_first":2000,"rows_last":500,"rows_between":2000,"halvings":0,"cell_chars":16384,"cell_head_chars":4096},"cells_cut":0,"cells_raw":0,"read":"whole","date_system":"1900"}

{"sheet":"READ ME FIRST","index":0,"n_rows":30,"n_cols":2,"rows_kept":30,"cut":false,"hidden":false,"merged":[[28,1,28,12],[29,1,29,12],[15,1,15,12],[16,1,23,12],[25,1,25,12],[26,1,26,12],[27,1,27,12],[24,1,24,12],[14,1,14,12],[1,1,1,12],[2,1,2,12],[3,1,3,12],[4,1,12,12],[13,1,13,12]]}
[]
[null,"Massachusetts Department of Elementary & Secondary Education"]
[null,"FY20 Carl D. Perkins Career and Technical Education Postsecondary Application Workbook"]
[null,"Overview  "]
[null,"\nThis application allows LEAs (districts and other eligible entities, referred to in this application collectively as \"districts\") to apply for funding for the Perkins Secondary Allocation Grant.                                \n\n If you have questions, please refer to our Federal Grant Programs website and/or contact the Federal Programs Specialist assigned to your district for guidance.\n\n"]
[]
[]
[]
[]
[]
[]
[]
[]
[null,"First Step:  Saving the File"]
[null,"Save this file to your computer. Rename the file by replacing the words 'leacode' in the file name with your 4-digit district code, but keep the rest of the filename and the file extension (.xlsm) the same. For example, Abington (0001) would rename the file as 'FY20Perkins401-0001.xlsm'. Users of Apple Macintosh computers must save as a macro-enabled file (with an .xlsm extension) for the workbook to function properly."]
{"$rows_left_out":16}
{"sheet":"1. Signature Page","index":1,"n_rows":28,"n_cols":17,"rows_kept":28,"cut":false,"hidden":false,"merged":[[25,1,27,3],[25,4,25,8],[25,9,25,15],[25,16,25,19],[26,4,27,8],[26,9,26,12],[26,13,26,15],[26,16,27,19],[27,9,27,12],[27,13,27,15],[20,1,20,4],[20,5,20,10],[20,12,20,13],[20,14,20,18],[21,1,21,4],[21,5,21,10],[21,12,21,13],[21,14,21,18],[17,1,18,19],[1,1,2,19],[4,1,4,19],[5,1,5,19],[10,5,10,10],[11,5,11,10],[12,5,12,10]]}
[]
[null,"Massachusetts Department of Elementary and Secondary Education\nSTANDARD CONTRACT FORM AND APPLICATION FOR PROGRAM GRANTS"]
[]
[]
[null,"UPLOAD A SCANNED, SIGNED COPY OF THIS PAGE WITH THE DATE OF SUBMISSION TO EDGRANTS WITH THE BUDGET FOR EACH FUND CODE"]
[null,"District staff with the role of “control user” in EdGrants have been provided user log-in names and passwords and have been trained to submit a grant application via EdGrants. Provide all required application materials to your district control user with access to EdGrants to submit budgets and attachments  for each fund code for which the district is applying.                                                              \n                 Applications are due by September 27, 2019"]
[]
[]
[null,null,null,"District Name:"]
[]
[null,null,null,"Address: ",null,null,null,null,null,null,null,null,"DESE Federal Grant Liaison",null,{"$f":"valname","v":"Liaison Name"}]
[null,null,null,null,null,null,null,null,null,null,null,null,"Phone number:",null,{"$f":"valphonenum","v":"Liaison Phone Number"}]
[null,null,null,null,null,null,null,null,null,null,null,null,"Email:",null,{"$f":"valemail","v":"Liaison Email"}]
[]
[]
{"$rows_left_out":14}
{"sheet":"2. Contact Information","index":2,"n_rows":9,"n_cols":5,"rows_kept":9,"cut":false,"hidden":false,"merged":[[6,2,6,11],[7,2,7,11],[8,1,8,3],[8,4,8,11],[1,1,1,3],[2,1,2,11],[3,1,3,11],[4,1,4,3],[4,4,4,11],[5,1,5,2],[5,3,5,11]]}
[]
[null,{"$f":"valDistrName","v":"College Name"}]
[null,"District Contact Information by Program\nPlease provide information for primary district contact for each program"]
[null,"Perkins Postsecondary Allocation Grant (Fund Code 401)"]
[null,"Name of Primary Contact:"]
[null,"Title:"]
[null,"Phone:"]
[null,"Email:"]
[null,"New to this program?  (Y/N)",null,null,"Select One"]

{"sheet":"3A. Expenditures Lines 1-6","index":3,"n_rows":43,"n_cols":10,"rows_kept":43,"cut":false,"hidden":false,"merged":[[1,3,1,4],[40,4,40,7],[41,4,41,7],[42,4,42,7],[35,2,38,2],[35,3,36,7],[37,4,37,7],[38,4,38,7],[39,4,39,7],[4,3,7,6],[18,3,20,3],[21,3,23,3],[24,3,26,3],[27,3,29,3],[30,3,32,3]]}
[]
[null,null,null,{"$f":"valDistrName","v":"College Name"}]
[]
[null,null,null,"Expenditures"]
[null,null,null,"For each expenditure in each line, complete steps 3.1 though 3.6. \nAll information for the individual expenditure will be correlated across the table.\nLines 1-6 are on this tab; Line 7-11 are on the following tab. \nBoth tabs need to be completed and expenditures should match the items on the Budget tab."]
[]
[]
[]
[]
[]
[]
[]
[]
[]
[]
{"$rows_left_out":29}
{"sheet":"3B. Expenditures Lines 7-11","index":4,"n_rows":44,"n_cols":11,"rows_kept":44,"cut":false,"hidden":false,"merged":[[4,2,4,5],[43,4,43,7],[14,4,18,4],[19,4,23,4],[24,4,27,4],[28,4,34,4],[39,4,39,7],[40,4,40,7],[41,4,41,7],[36,2,38,2],[36,3,37,7],[38,4,38,7],[5,2,7,5],[42,4,42,7]]}
[]
[]
[]
[]
[null,null,"Expenditures (Lines 7-11)"]
[null,null,"For each expenditure in each line, complete steps 3.1 though 3.6. \nAll information for the individual expenditure will be correlated across the table.\nLines 7-11 are on this tab; Line 1-6 are on the prior tab. \nBoth tabs need to be completed and expenditures should match the items on the Budget tab."]
[]
[]
[]
[]
[]
[]
[]
[null,null,null,null,"Line Item","Step 3.1 \nPlease include a description of the position(s) or services that will be funded. Please describe in some detail how expenditures are SUPPLEMENTING, not SUPPLANTING local funds.","Step 3.2\nDoes this expenditure address the performance targets on core indicators?","Step 3.3\nIf this expenditure addresses the performance target on a core indictor, list the core indicator(s)  addressed.","Step 3.4\nIf this expenditure addresses performance targets on a core indicator, please list the special population(s) targeted."," Step 3.5\nFor each expenditure item, explain how the expenditure addresses one or more required use of funds. You must use a portion of the Perkins allocation for professional development.\nIf all required uses are not addressed, please complete Step 3.7 below.","Step 3.6\nPlease describe how this expenditure will improve your program."]
[null,null,null,null,"Line 7: Supplies and Materials",null,"Select One"]
{"$rows_left_out":30}
{"sheet":"4. Budget","index":5,"n_rows":134,"n_cols":34,"rows_kept":134,"cut":false,"hidden":false,"merged":[[132,5,132,6],[132,7,132,8],[132,10,132,20],[132,24,132,27],[133,5,133,6],[133,7,133,8],[133,11,134,21],[129,5,129,6],[129,7,129,8],[129,10,129,20],[129,24,129,27],[130,5,130,6],[130,7,130,8],[130,10,130,20],[130,24,130,27],[131,5,131,6],[131,7,131,8],[131,10,131,20],[131,24,131,27],[126,5,126,6],[126,7,126,8],[126,10,126,20],[126,24,126,27],[127,5,127,6],[127,7,127,8],[127,10,127,20],[127,24,127,27],[128,5,128,6],[128,7,128,8],[128,10,128,20],[128,24,128,27],[123,5,123,6],[123,7,123,8],[123,10,123,20],[123,24,123,27],[124,5,124,6],[124,7,124,8],[124,10,124,20],[124,24,124,27],[125,5,125,6],[125,7,125,8],[125,10,125,20],[125,24,125,27],[120,5,120,6],[120,7,120,8],[120,10,120,20],[120,24,120,27],[121,5,121,6],[121,7,121,8],[121,10,121,20],[121,24,121,27],[122,5,122,6],[122,7,122,8],[122,10,122,20],[122,24,122,27],[86,9,86,10],[87,9,87,10],[111,1,112,1],[111,3,111,31],[112,3,113,31],[114,3,114,10],[116,23,116,30],[117,23,117,30],[118,5,119,6],[118,7,119,8],[118,10,119,20],[118,24,119,27],[118,29,119,29],[103,3,103,11],[98,19,98,20],[90,4,90,11],[90,19,90,20],[91,4,91,10],[91,19,91,20],[97,4,97,10],[97,19,97,20],[95,19,95,20],[82,4,82,10],[82,19,82,20],[83,3,83,11],[85,9,85,10],[71,4,71,10],[71,19,71,20],[72,4,72,10],[72,19,72,20],[73,4,73,10],[73,19,73,20],[79,4,79,10],[79,19,79,20],[80,4,80,10],[80,19,80,20],[81,4,81,10],[81,19,81,20],[74,3,74,11],[76,19,76,20],[77,4,77,10],[77,19,77,20],[78,4,78,10],[78,19,78,20],[66,4,66,10],[66,19,66,20],[67,4,67,6],[69,4,69,10],[69,19,69,20],[70,4,70,10],[70,19,70,20],[63,4,63,10],[63,19,63,20],[64,4,64,10],[64,19,64,20],[65,4,65,10],[65,19,65,20],[58,4,58,7],[58,19,58,20],[59,4,59,7],[59,19,59,20],[60,3,60,11],[62,19,62,20],[55,4,55,7],[55,19,55,20],[56,4,56,7],[56,19,56,20],[57,4,57,7],[57,19,57,20],[50,4,50,11],[50,19,50,20],[51,3,51,11],[53,19,53,20],[54,4,54,7],[54,19,54,20],[47,4,47,11],[47,19,47,20],[48,4,48,11],[48,19,48,20],[49,4,49,11],[49,19,49,20],[42,4,42,7],[42,19,42,20],[43,3,43,11],[44,3,44,7],[45,4,45,11],[45,19,46,20],[46,4,46,11],[38,19,38,20],[39,4,39,7],[39,19,39,20],[40,4,40,7],[40,19,40,20],[41,4,41,7],[41,19,41,20],[34,4,34,7],[34,19,34,20],[35,4,35,7],[35,19,35,20],[36,3,36,11],[37,3,37,7],[30,3,30,11],[30,19,30,20],[31,3,31,7],[32,4,32,7],[32,19,32,20],[33,4,33,7],[33,19,33,20],[29,4,29,7],[29,19,29,20],[23,19,23,20],[24,4,24,7],[24,19,24,20],[25,4,25,7],[25,19,25,20],[26,4,26,7],[26,19,26,20],[15,19,15,20],[17,4,17,7],[17,19,17,20],[18,4,18,7],[18,19,18,20],[27,4,27,7],[27,19,27,20],[28,4,28,7],[28,19,28,20],[2,2,2,10],[3,19,3,20],[4,2,4,20],[6,3,7,5],[6,6,7,7],[7,8,7,9],[7,10,7,11],[92,4,92,10],[96,4,96,10],[95,4,95,10],[94,4,94,10],[93,4,93,10],[96,19,96,20],[94,19,94,20],[93,19,93,20],[92,19,92,20],[19,4,19,7],[19,19,19,20],[20,4,20,7],[20,19,20,20],[21,19,21,20],[22,3,22,7],[14,2,14,22],[15,3,15,11]]}
[]
[]
[null,null,{"$f":"valDistrName","v":"College Name"}]
[]
[null,null,"FY20 Perkins Postsecondary Allocation Budget Worksheet"]
[]
[null,null,null,"Allocation \n",null,null,{"$f":"IFERROR(valAllocPerk, 0)","v":0}]
[]
[]
[]
[null,null,null,null,null,null,null,null,null,null,"Bellingham",null,null,null,null,null,null,"Bellingham (0025)"]
[null,null,null,null,null,null,null,null,null,"Bellingham"]
[]
[]
[]
{"$rows_left_out":120}
{"sheet":"5. ISA crosswalk","index":6,"n_rows":39,"n_cols":14,"rows_kept":39,"cut":false,"hidden":false,"merged":[[32,11,32,12],[2,3,6,10],[9,9,10,10],[16,10,16,12],[16,4,16,6],[31,11,31,12]]}
[]
[null,null,null,"Interdepartmental Service Agreement (ISA) Crosswalk"]
[null,null,null,"Community colleges eligble to receive Perkins Post Secondray funds are required to an ISA for our files.  \nPlease complete this crosswalk to expedite execution of your ISA.  Grants Management will reach out to you once your grant application has been approved to complete the ISA process.\n"]
[]
[]
[]
[]
[]
[]
[]
[]
[]
[]
[]
[]
{"$rows_left_out":25}
{"sheet":"Schedule A","index":7,"n_rows":49,"n_cols":12,"rows_kept":49,"cut":false,"hidden":false,"merged":[[19,1,20,1],[19,2,20,11],[26,1,27,5],[26,6,27,8],[26,9,27,11],[2,2,2,10],[3,2,11,10],[14,1,14,11],[15,1,15,11],[17,1,17,11],[28,1,28,5],[28,6,28,8],[28,9,28,11],[21,1,22,1],[21,2,22,4],[21,5,22,10],[21,11,22,11],[23,1,24,1],[23,2,24,4],[23,5,24,11],[29,1,29,5],[29,6,29,8],[29,9,29,11],[30,1,30,5],[30,6,30,8],[30,9,30,11],[31,1,31,5],[31,6,31,8],[31,9,31,11],[32,1,32,5],[32,6,32,8],[32,9,32,11],[33,1,33,5],[33,6,33,8],[33,9,33,11],[34,1,34,5],[34,6,34,8],[34,9,34,11],[35,1,35,5],[35,6,35,8],[35,9,35,11],[36,1,36,5],[36,6,36,8],[36,9,36,11],[37,1,37,5],[37,6,37,8],[37,9,37,11],[38,1,38,5],[38,6,38,8],[38,9,38,11],[39,1,39,5],[39,6,39,8],[39,9,39,11],[40,1,40,5],[40,6,40,8],[40,9,40,11],[41,1,41,5],[41,6,41,8],[41,9,41,11],[42,1,42,5],[42,6,42,8],[42,9,42,11],[45,6,46,8],[45,9,46,11],[46,1,46,5],[48,1,49,11],[43,1,43,5],[43,6,43,8],[43,9,43,11],[44,1,44,5],[44,6,44,8],[44,9,44,11]]}
[]
[]
[null,null,"Instructions:\n\n "]
[null,null,"Fill out and print a separate copy of Schedule A for each Perkins program for which funds \nare assigned to your district from other grant recipients, and your district (agency) is operator/administrator.              \n"]
[]
[]
[]
[]
[]
[]
[]
[]
[]
[]
[null,"MASSACHUSETTS DEPARTMENT OF ELEMENTARY AND SECONDARY EDUCATION"]
{"$rows_left_out":35}
{"sheet":"LiasionList","index":8,"n_rows":39,"n_cols":10,"rows_kept":39,"cut":false,"hidden":true,"merged":[]}
["Aneesh","Aneesh Sahni","781-338-3532","aneesh.sahni@doe.mass.edu"]
["Alex","Alex Lilley","781-338-6212","alilley@doe.mass.edu"]
["Beth","Beth O'Connell","781-338-3132","EO'Connell@doe.mass.edu"]
["Nancy","Nancy Labrie","781-338-3536","nlabrie@doe.mass.edu"]
["Ellie","Ellie Rounds-Bloom","781-338-3128","erounds-bloom@doe.mass.edu"]
["Julia","Julia Foodman","781-338-3577","jfoodman@doe.mass.edu"]
["Russ","Russ Fleming","781-338-6529","RFleming@doe.mass.edu"]
["Sue","Sue Mazzarella","781-338-3587","smazzarella@doe.mass.edu"]
[]
[null,{"$f":"CONCATENATE(G10,D10)","v":"08010801"},2019,"0801","Ellie","Assabet Valley Regional Vocational Technical","0801","Ellie Rounds-Bloom","781-338-3128","erounds-bloom@doe.mass.edu"]
[null,"4010805",2019,"0805","Aneesh","Blackstone Valley Regional Vocational Technical","0805","Aneesh Sahni","781-338-3532","aneesh.sahni@doe.mass.edu"]
[null,"4010806",2019,"0806","Nancy","Blue Hills Regional Vocational Technical","0806","Nancy Labrie","781-338-3536","nlabrie@doe.mass.edu"]
[null,"4010821",2019,"0821","Alex","Greater Fall River Regional Vocational Technical","0821","Alex Lilley","781-338-6212","alilley@doe.mass.edu"]
[null,"4010828",2019,"0828","Nancy","Greater Lowell Regional Vocational Technical","0828","Nancy Labrie","781-338-3536","nlabrie@doe.mass.edu"]
[null,"4010832",2019,"0832","Beth","Montachusett Regional Vocational Technical","0832","Beth O'Connell","781-338-3132","EO'Connell@doe.mass.edu"]
{"$rows_left_out":25}
{"sheet":"dropdown","index":9,"n_rows":67,"n_cols":7,"rows_kept":67,"cut":false,"hidden":true,"merged":[]}
["per day",null,null,"Select One",null,"Budget Categories","Primary Functions "]
["per hour",null,null,"yes ",null,"Administrator Salaries","Select One"]
["flat",null,null,"no",null,"Select One","Select One"]
[null,null,null,null,null,"Grant Program Manager/Coordinator ","1R"]
[null,null,null,null,null,"Other ","2R"]
[null,null,null,null,null,"InstructionalProf Staff Salaries","3R"]
[null,null,null,null,null,"Select One","4R"]
[null,null,null,null,null,"Classroom Teachers  ","5R"]
[null,null,null,null,null,"Instructional Coaches ","6R"]
[null,null,null,null,null,"Certified Specialist Teachers (providing individualized instruction)  "]
[null,null,null,null,null,"Instructional Coordinators and Team Leaders  "]
[null,null,null,null,null,"Librarians and Media Center Directors "]
[null,null,null,null,null,"Professional Development Directors/Coordinators  "]
[null,null,null,null,null,"Guidance or School Adjustment Counselors, Social Workers  "]
[null,null,null,null,null,"Other  "]
{"$rows_left_out":53}
{"sheet":"DataDistrictList","index":10,"n_rows":19,"n_cols":6,"rows_kept":19,"cut":false,"hidden":true,"merged":[]}
[1,"College Name","Org Code","Liaison Name","Liaison Phone Number","Liaison Email"]
[2,"Berkshire Community College",{"$f":"VLOOKUP(B2, LiasionList!$F$10:$G$50,2, FALSE)","v":"1203"},{"$f":"VLOOKUP(C2, LiasionList!$G$10:$H$39, 2, FALSE)","v":"Beth O'Connell"},{"$f":"VLOOKUP(C2, LiasionList!$G$10:$J$39, 3, FALSE)","v":"781-338-3132"},{"$f":"VLOOKUP(C2, LiasionList!$G$10:$J$39, 4, FALSE)","v":"EO'Connell@doe.mass.edu"}]
[3,"Bristol Community College  ","1205",{"$f":"VLOOKUP(C3, LiasionList!$G$10:$H$39, 2, FALSE)","v":"Ellie Rounds-Bloom"},{"$f":"VLOOKUP(C3, LiasionList!$G$10:$J$39, 3, FALSE)","v":"781-338-3128"},{"$f":"VLOOKUP(C3, LiasionList!$G$10:$J$39, 4, FALSE)","v":"erounds-bloom@doe.mass.edu"}]
[4,"Bunker Hill Community College ",1206,{"$f":"VLOOKUP(C4, LiasionList!$G$10:$H$39, 2, FALSE)","v":"Alex Lilley"},{"$f":"VLOOKUP(C4, LiasionList!$G$10:$J$39, 3, FALSE)","v":"781-338-6212"},{"$f":"VLOOKUP(C4, LiasionList!$G$10:$J$39, 4, FALSE)","v":"alilley@doe.mass.edu"}]
[5,"Cape Cod Community College",{"$f":"VLOOKUP(B5, LiasionList!$F$10:$G$50,2, FALSE)","v":"1207"},{"$f":"VLOOKUP(C5, LiasionList!$G$10:$H$39, 2, FALSE)","v":"Aneesh Sahni"},{"$f":"VLOOKUP(C5, LiasionList!$G$10:$J$39, 3, FALSE)","v":"781-338-3532"},{"$f":"VLOOKUP(C5, LiasionList!$G$10:$J$39, 4, FALSE)","v":"aneesh.sahni@doe.mass.edu"}]
[6,"Holyoke Community College",{"$f":"VLOOKUP(B6, LiasionList!$F$10:$G$50,2, FALSE)","v":"1210"},{"$f":"VLOOKUP(C6, LiasionList!$G$10:$H$39, 2, FALSE)","v":"Nancy Labrie"},{"$f":"VLOOKUP(C6, LiasionList!$G$10:$J$39, 3, FALSE)","v":"781-338-3536"},{"$f":"VLOOKUP(C6, LiasionList!$G$10:$J$39, 4, FALSE)","v":"nlabrie@doe.mass.edu"}]
[7,"Massachusetts Bay Community College",{"$f":"VLOOKUP(B7, LiasionList!$F$10:$G$50,2, FALSE)","v":"1211"},{"$f":"VLOOKUP(C7, LiasionList!$G$10:$H$39, 2, FALSE)","v":"Sue Mazzarella"},{"$f":"VLOOKUP(C7, LiasionList!$G$10:$J$39, 3, FALSE)","v":"781-338-3587"},{"$f":"VLOOKUP(C7, LiasionList!$G$10:$J$39, 4, FALSE)","v":"smazzarella@doe.mass.edu"}]
[8,"Massasoit Community College",{"$f":"VLOOKUP(B8, LiasionList!$F$10:$G$50,2, FALSE)","v":"1213"},{"$f":"VLOOKUP(C8, LiasionList!$G$10:$H$39, 2, FALSE)","v":"Julia Foodman"},{"$f":"VLOOKUP(C8, LiasionList!$G$10:$J$39, 3, FALSE)","v":"781-338-3577"},{"$f":"VLOOKUP(C8, LiasionList!$G$10:$J$39, 4, FALSE)","v":"jfoodman@doe.mass.edu"}]
[9,"Middlesex Community College",{"$f":"VLOOKUP(B9, LiasionList!$F$10:$G$50,2, FALSE)","v":"1214"},{"$f":"VLOOKUP(C9, LiasionList!$G$10:$H$39, 2, FALSE)","v":"Sue Mazzarella"},{"$f":"VLOOKUP(C9, LiasionList!$G$10:$J$39, 3, FALSE)","v":"781-338-3587"},{"$f":"VLOOKUP(C9, LiasionList!$G$10:$J$39, 4, FALSE)","v":"smazzarella@doe.mass.edu"}]
[10,"Mount Wachusett Community College",{"$f":"VLOOKUP(B10, LiasionList!$F$10:$G$50,2, FALSE)","v":"1215"},{"$f":"VLOOKUP(C10, LiasionList!$G$10:$H$39, 2, FALSE)","v":"Sue Mazzarella"},{"$f":"VLOOKUP(C10, LiasionList!$G$10:$J$39, 3, FALSE)","v":"781-338-3587"},{"$f":"VLOOKUP(C10, LiasionList!$G$10:$J$39, 4, FALSE)","v":"smazzarella@doe.mass.edu"}]
[11,"Greenfield Community College",{"$f":"VLOOKUP(B11, LiasionList!$F$10:$G$50,2, FALSE)","v":"1218"},{"$f":"VLOOKUP(C11, LiasionList!$G$10:$H$39, 2, FALSE)","v":"Aneesh Sahni"},{"$f":"VLOOKUP(C11, LiasionList!$G$10:$J$39, 3, FALSE)","v":"781-338-3532"},{"$f":"VLOOKUP(C11, LiasionList!$G$10:$J$39, 4, FALSE)","v":"aneesh.sahni@doe.mass.edu"}]
[12,"North Shore Community College",{"$f":"VLOOKUP(B12, LiasionList!$F$10:$G$50,2, FALSE)","v":"1225"},{"$f":"VLOOKUP(C12, LiasionList!$G$10:$H$39, 2, FALSE)","v":"Ellie Rounds-Bloom"},{"$f":"VLOOKUP(C12, LiasionList!$G$10:$J$39, 3, FALSE)","v":"781-338-3128"},{"$f":"VLOOKUP(C12, LiasionList!$G$10:$J$39, 4, FALSE)","v":"erounds-bloom@doe.mass.edu"}]
[13,"Northern Essex Community College",{"$f":"VLOOKUP(B13, LiasionList!$F$10:$G$50,2, FALSE)","v":"1230"},{"$f":"VLOOKUP(C13, LiasionList!$G$10:$H$39, 2, FALSE)","v":"Aneesh Sahni"},{"$f":"VLOOKUP(C13, LiasionList!$G$10:$J$39, 3, FALSE)","v":"781-338-3532"},{"$f":"VLOOKUP(C13, LiasionList!$G$10:$J$39, 4, FALSE)","v":"aneesh.sahni@doe.mass.edu"}]
[14,"Quinsigamond Community College",{"$f":"VLOOKUP(B14, LiasionList!$F$10:$G$50,2, FALSE)","v":"1240"},{"$f":"VLOOKUP(C14, LiasionList!$G$10:$H$39, 2, FALSE)","v":"Aneesh Sahni"},{"$f":"VLOOKUP(C14, LiasionList!$G$10:$J$39, 3, FALSE)","v":"781-338-3532"},{"$f":"VLOOKUP(C14, LiasionList!$G$10:$J$39, 4, FALSE)","v":"aneesh.sahni@doe.mass.edu"}]
[15,"Roxbury Community College ",1245,{"$f":"VLOOKUP(C15, LiasionList!$G$10:$H$39, 2, FALSE)","v":"Nancy Labrie"},{"$f":"VLOOKUP(C15, LiasionList!$G$10:$J$39, 3, FALSE)","v":"781-338-3536"},{"$f":"VLOOKUP(C15, LiasionList!$G$10:$J$39, 4, FALSE)","v":"nlabrie@doe.mass.edu"}]
{"$rows_left_out":5}
{"sheet":"DataLookupValues","index":11,"n_rows":6,"n_cols":6,"rows_kept":6,"cut":false,"hidden":true,"merged":[]}
["District Information"]
["College value",1,null,null,"Liasons"]
["College Name:",{"$f":"VLOOKUP(B2, DataDistrictList!A1:B19,2, FALSE)","v":"College Name"},"district code",{"$f":"LEFT(VLOOKUP(valDistr,dataDistr,3,FALSE),4)","v":"Org "},"Name",{"$f":"VLOOKUP(valDistr,dataDistr,4,FALSE)","v":"Liaison Name"}]
["Address1",{"$f":"VLOOKUP(valDistr,dataDistr,7,FALSE)","v":{"$error":"#REF!"}},null,null,"Phone",{"$f":"VLOOKUP(valDistr,dataDistr,5,FALSE)","v":"Liaison Phone Number"}]
["Address2",{"$f":"IF(VLOOKUP(valDistr,dataDistr,8,FALSE)=0,\"\",VLOOKUP(valDistr,dataDistr,8,FALSE))","v":{"$error":"#REF!"}},null,null,"Email",{"$f":"VLOOKUP(valDistr,dataDistr,6,FALSE)","v":"Liaison Email"}]
["City, State, ZIP",9]

{"sheet":"drop down","index":12,"n_rows":70,"n_cols":7,"rows_kept":70,"cut":false,"hidden":true,"merged":[]}
["per day",null,null,"yes ",null,"Budget Categories","Primary Functions "]
["per hour",null,null,"no",null,"Administrator Salaries","Select One"]
["flat",null,null,null,null,"Select One","Instruction-School day (public, K-12) "]
[null,null,null,null,null,"Grant Program Manager/Coordinator ","High quality PD"]
[null,null,null,null,null,"Other ","Data collection/management"]
[null,null,null,null,null,"InstructionalProf Staff Salaries","Instructional technology/digital learning"]
[null,null,null,null,null,"Select One","Planning and evaluation"]
[null,null,null,null,null,"Classroom Teachers  ","Program administration"]
[null,null,null,null,null,"Instructional Coaches ","Student transportation"]
[null,null,null,null,null,"Certified Specialist Teachers (providing individualized instruction)  ","Other"]
[null,null,null,null,null,"Instructional Coordinators and Team Leaders  "]
[null,null,null,null,null,"Medical / Therapeutic Services "]
[null,null,null,null,null,"Librarians and Media Center Directors "]
[null,null,null,null,null,"Professional Development Directors/Coordinators  "]
[null,null,null,null,null,"Guidance or School Adjustment Counselors, Social Workers  "]
{"$rows_left_out":56}
{"sheet":"liaison","index":13,"n_rows":8,"n_cols":3,"rows_kept":8,"cut":false,"hidden":true,"merged":[]}
["Aneesh Sahni","781-338-3532","aneesh.sahni@doe.mass.edu"]
["Alex Lilley","781-338-6212","alilley@doe.mass.edu"]
["Beth O'Connell","781-338-3132","EO'Connell@doe.mass.edu"]
["Nancy Labrie","781-338-3536","nlabrie@doe.mass.edu"]
["Ellie Rounds-Bloom","781-338-3128","erounds-bloom@doe.mass.edu"]
["Julia Foodman","781-338-3577","jfoodman@doe.mass.edu"]
["Russ Fleming","781-338-6529","RFleming@doe.mass.edu"]
["Sue Mazzarella","781-338-3587","smazzarella@doe.mass.edu"]

{"sheet":"district list","index":14,"n_rows":19,"n_cols":3,"rows_kept":19,"cut":false,"hidden":true,"merged":[]}
["LEA code","Name","Address"]
["1203","Berkshire Community College"]
["1205","Bristol Community College  "]
["1206","Bunker Hill Community College "]
["1207","Cape Cod Community College"]
["1210","Holyoke Community College"]
["1211","Massachusetts Bay Community College"]
["1213","Massasoit Community College"]
["1214","Middlesex Community College"]
["1215","Mount Wachusett Community College"]
["1218","Greenfield Community College"]
["1225","North Shore Community College"]
["1230","Northern Essex Community College"]
["1240","Quinsigamond Community College"]
["1245","Roxbury Community College "]
{"$rows_left_out":4}